{
  "rules": {
    // TypeScript-specific
    "member-access": true,
    "no-empty-interface": true,
    "no-inferrable-types": true,
    "no-internal-module": true,
    "only-arrow-functions": true,
    "no-var-requires": true,
    "unified-signatures": true,

    // Functionality
    "ban-comma-operator": true,
    "curly": true,
    "function-constructor": true,
    "no-duplicate-switch-case": true,
    "no-duplicate-variable": [true, "check-parameters"],
    "no-empty": [true, "allow-empty-catch"],
    "no-eval": true,
    "no-invalid-template-strings": true,
    "no-misused-new": true,
    "no-shadowed-variable": true,
    "no-sparse-arrays": true,
    "no-string-literal": true,
    "no-tautology-expression": true,
    "no-unnecessary-class": true,
    "no-unsafe-finally": true,
    "no-var-keyword": true,
    "prefer-conditional-expression": [true, "check-else-if"],
    "restrict-plus-operands": true,
    "static-this": true,
    "strict-comparisons": [
      true,
      {
        "allow-object-equal-comparison": true,
        "allow-string-order-comparison": false
      }
    ],
    "switch-default": true,
    "triple-equals": [
      true,
      "allow-null-check"
    ],
    "unnecessary-constructor": true,
    "no-switch-case-fall-through": true,
    "no-boolean-literal-compare": true,

    // Maintainability
    "no-duplicate-imports": true,
    "prefer-const": true,
    "prefer-readonly": true,

    // Style
    "arrow-return-shorthand": true,
    "callable-types": true,
    "comment-format": [
      true,
      "check-space"
    ],
    "completed-docs": false, // Should really turn this on
    "encoding": true,
    "file-header": {
      "options": [
        "\\d{4} ExtendApps, Inc."
      ]
    },
    "increment-decrement": true,
    "no-unnecessary-initializer": true,
    "one-line": [
      true,
      "check-open-brace",
      "check-whitespace"
    ],
    "prefer-method-signature": true,
    "prefer-switch": [true, {"min-cases": 2}],
    "prefer-template": true,
    "space-before-function-paren": false,
    "switch-final-break": [true, "always"],
    "variable-name": [
      true,
      "ban-keywords",
      "check-format"
    ],

    // Format
    "align": true,
    "arrow-parens": [true, "ban-single-arg-parens"],
    "eofline": true,
    "import-spacing": true,
    "indent": [
      true,
      "spaces",
      4
    ],
    "linebreak-style": [true, "LF"],
    "new-parens": true,
    "no-consecutive-blank-lines": true,
    "no-irregular-whitespace": true,
    "no-trailing-whitespace": true,
    "number-literal-format": true,
    "quotemark": [
      true,
      "single"
    ],
    "semicolon": [
      true,
      "always",
      "ignore-bound-class-methods"
    ],
    "typedef-whitespace": [
      true,
      {
        "call-signature": "nospace",
        "index-signature": "nospace",
        "parameter": "nospace",
        "property-declaration": "nospace",
        "variable-declaration": "nospace"
      }
    ],
    "whitespace": [
      true,
      "check-branch",
      "check-decl",
      "check-operator",
      "check-separator",
      "check-type"
    ]
  }
}
