{
  "0": {
    "words": [
      {
        "word": "paciente",
        "weight": 0.3226306402710895,
        "ocurrence_times": [
          {
            "start_time": "18.74",
            "end_time": "19.16"
          },
          {
            "start_time": "36.75",
            "end_time": "37.25"
          },
          {
            "start_time": "53.38",
            "end_time": "54.08"
          },
          {
            "start_time": "56.24",
            "end_time": "56.66"
          },
          {
            "start_time": "67.46",
            "end_time": "68.05"
          },
          {
            "start_time": "73.5",
            "end_time": "73.95"
          },
          {
            "start_time": "116.07",
            "end_time": "116.82"
          }
        ]
      },
      {
        "word": "principalmente",
        "weight": 0.2550044587123238,
        "ocurrence_times": [
          {
            "start_time": "10.64",
            "end_time": "11.38"
          },
          {
            "start_time": "23.38",
            "end_time": "24.71"
          },
          {
            "start_time": "37.26",
            "end_time": "38.05"
          },
          {
            "start_time": "74.86",
            "end_time": "75.57"
          },
          {
            "start_time": "114.14",
            "end_time": "114.82"
          },
          {
            "start_time": "121.41",
            "end_time": "122.13"
          }
        ]
      },
      {
        "word": "an\u00e1lisis",
        "weight": 0.168914452172879,
        "ocurrence_times": [
          {
            "start_time": "31.16",
            "end_time": "31.61"
          },
          {
            "start_time": "36.05",
            "end_time": "36.56"
          },
          {
            "start_time": "92.78",
            "end_time": "93.35"
          }
        ]
      },
      {
        "word": "especialista",
        "weight": 0.13113489091017183,
        "ocurrence_times": [
          {
            "start_time": "19.26",
            "end_time": "20.05"
          },
          {
            "start_time": "63.88",
            "end_time": "64.42"
          },
          {
            "start_time": "77.29",
            "end_time": "78.0"
          },
          {
            "start_time": "78.08",
            "end_time": "78.7"
          },
          {
            "start_time": "115.38",
            "end_time": "115.98"
          }
        ]
      },
      {
        "word": "pueda",
        "weight": 0.1154681647940075,
        "ocurrence_times": [
          {
            "start_time": "56.66",
            "end_time": "56.98"
          },
          {
            "start_time": "94.18",
            "end_time": "94.6"
          }
        ]
      },
      {
        "word": "poder",
        "weight": 0.11191486831936276,
        "ocurrence_times": [
          {
            "start_time": "47.77",
            "end_time": "48.15"
          },
          {
            "start_time": "82.69",
            "end_time": "83.09"
          }
        ]
      },
      {
        "word": "informaci\u00f3n",
        "weight": 0.09967600023779799,
        "ocurrence_times": [
          {
            "start_time": "76.72",
            "end_time": "77.21"
          }
        ]
      },
      {
        "word": "va",
        "weight": 0.09451221687176739,
        "ocurrence_times": [
          {
            "start_time": "40.44",
            "end_time": "40.63"
          },
          {
            "start_time": "47.67",
            "end_time": "47.73"
          }
        ]
      },
      {
        "word": "secci\u00f3n",
        "weight": 0.07953688841329296,
        "ocurrence_times": [
          {
            "start_time": "30.61",
            "end_time": "31.09"
          },
          {
            "start_time": "44.31",
            "end_time": "44.66"
          }
        ]
      },
      {
        "word": "adicional",
        "weight": 0.046996016883657316,
        "ocurrence_times": [
          {
            "start_time": "82.06",
            "end_time": "82.47"
          }
        ]
      },
      {
        "word": "explicar",
        "weight": 0.045222638368705784,
        "ocurrence_times": [
          {
            "start_time": "94.6",
            "end_time": "95.02"
          }
        ]
      },
      {
        "word": "determinar",
        "weight": 0.043945068664169785,
        "ocurrence_times": [
          {
            "start_time": "83.09",
            "end_time": "83.62"
          }
        ]
      },
      {
        "word": "parte",
        "weight": 0.043778610070744906,
        "ocurrence_times": [
          {
            "start_time": "53.02",
            "end_time": "53.29"
          },
          {
            "start_time": "73.09",
            "end_time": "73.37"
          }
        ]
      },
      {
        "word": "mostrar",
        "weight": 0.043724511027881795,
        "ocurrence_times": [
          {
            "start_time": "41.4",
            "end_time": "42.16"
          }
        ]
      }
    ],
    "line": " paciente principalmente an\u00e1lisis especialista pueda poder informaci\u00f3n va secci\u00f3n adicional explicar determinar parte mostrar",
    "cluster_polarity": 0
  },
  "1": {
    "words": [
      {
        "word": "grabaci\u00f3n",
        "weight": 0.3300291302538494,
        "ocurrence_times": [
          {
            "start_time": "1.56",
            "end_time": "2.35"
          },
          {
            "start_time": "11.5",
            "end_time": "13.55"
          },
          {
            "start_time": "54.88",
            "end_time": "55.78"
          },
          {
            "start_time": "62.55",
            "end_time": "63.25"
          },
          {
            "start_time": "89.8",
            "end_time": "90.45"
          },
          {
            "start_time": "99.46",
            "end_time": "100.15"
          }
        ]
      },
      {
        "word": "voy",
        "weight": 0.12781939242613402,
        "ocurrence_times": [
          {
            "start_time": "89.11",
            "end_time": "89.26"
          },
          {
            "start_time": "90.9",
            "end_time": "91.07"
          }
        ]
      },
      {
        "word": "momento",
        "weight": 0.12563462338743236,
        "ocurrence_times": [
          {
            "start_time": "98.38",
            "end_time": "98.75"
          },
          {
            "start_time": "100.47",
            "end_time": "100.93"
          },
          {
            "start_time": "118.62",
            "end_time": "119.11"
          }
        ]
      },
      {
        "word": "puede",
        "weight": 0.11076987099459012,
        "ocurrence_times": [
          {
            "start_time": "13.94",
            "end_time": "14.16"
          },
          {
            "start_time": "15.26",
            "end_time": "15.7"
          },
          {
            "start_time": "78.7",
            "end_time": "78.93"
          }
        ]
      },
      {
        "word": "ver",
        "weight": 0.1028196896736223,
        "ocurrence_times": [
          {
            "start_time": "46.89",
            "end_time": "47.04"
          },
          {
            "start_time": "120.87",
            "end_time": "121.03"
          }
        ]
      },
      {
        "word": "sesi\u00f3n",
        "weight": 0.09104333868378814,
        "ocurrence_times": [
          {
            "start_time": "46.59",
            "end_time": "46.82"
          },
          {
            "start_time": "66.48",
            "end_time": "66.81"
          }
        ]
      },
      {
        "word": "ahorita",
        "weight": 0.08316687473990841,
        "ocurrence_times": [
          {
            "start_time": 0,
            "end_time": 0
          }
        ]
      },
      {
        "word": "ser",
        "weight": 0.06847690387016228,
        "ocurrence_times": [
          {
            "start_time": "0.53",
            "end_time": "0.84"
          },
          {
            "start_time": "15.7",
            "end_time": "15.9"
          },
          {
            "start_time": "26.16",
            "end_time": "26.46"
          }
        ]
      },
      {
        "word": "informando",
        "weight": 0.06394090719933418,
        "ocurrence_times": [
          {
            "start_time": "106.59",
            "end_time": "107.1"
          }
        ]
      },
      {
        "word": "importante",
        "weight": 0.05002080732417812,
        "ocurrence_times": [
          {
            "start_time": "61.98",
            "end_time": "62.43"
          }
        ]
      },
      {
        "word": "modo",
        "weight": 0.04924677486475238,
        "ocurrence_times": [
          {
            "start_time": "3.73",
            "end_time": "3.98"
          }
        ]
      },
      {
        "word": "diez",
        "weight": 0.044714939658759896,
        "ocurrence_times": [
          {
            "start_time": "107.33",
            "end_time": "107.51"
          }
        ]
      },
      {
        "word": "empieza",
        "weight": 0.043945068664169785,
        "ocurrence_times": [
          {
            "start_time": "101.85",
            "end_time": "102.95"
          }
        ]
      }
    ],
    "line": " grabaci\u00f3n voy momento puede ver sesi\u00f3n ahorita ser informando importante modo diez empieza",
    "cluster_polarity": 0
  },
  "2": {
    "words": [
      {
        "word": "segundos",
        "weight": 0.0988555971702039,
        "ocurrence_times": [
          {
            "start_time": "112.95",
            "end_time": "113.69"
          }
        ]
      },
      {
        "word": "treinta",
        "weight": 0.07962962962962965,
        "ocurrence_times": [
          {
            "start_time": "112.65",
            "end_time": "112.95"
          }
        ]
      },
      {
        "word": "menos",
        "weight": 0.06040366208905535,
        "ocurrence_times": [
          {
            "start_time": "112.25",
            "end_time": "112.57"
          }
        ]
      }
    ],
    "line": " segundos treinta menos",
    "cluster_polarity": 0
  }
}
