entityid|firstname|lastname|phonenumber|context|protocol|username|password|profileclient|enablehint|enablexfer
1|acd151|acd151|2801|loadtest|sip|acd151|0000|7|1|1
1|acd152|acd152|2802|loadtest|sip|acd152|0000|7|1|1
1|acd153|acd153|2803|loadtest|sip|acd153|0000|7|1|1
1|acd154|acd154|2804|loadtest|sip|acd154|0000|7|1|1
1|acd155|acd155|2805|loadtest|sip|acd155|0000|7|1|1
1|acd156|acd156|2806|loadtest|sip|acd156|0000|7|1|1
1|acd157|acd157|2807|loadtest|sip|acd157|0000|7|1|1
1|acd158|acd158|2808|loadtest|sip|acd158|0000|7|1|1
1|acd159|acd159|2809|loadtest|sip|acd159|0000|7|1|1
1|acd160|acd160|2810|loadtest|sip|acd160|0000|7|1|1
1|acd161|acd161|2811|loadtest|sip|acd161|0000|7|1|1
1|acd162|acd162|2812|loadtest|sip|acd162|0000|7|1|1
1|acd163|acd163|2813|loadtest|sip|acd163|0000|7|1|1
1|acd164|acd164|2814|loadtest|sip|acd164|0000|7|1|1
1|acd165|acd165|2815|loadtest|sip|acd165|0000|7|1|1
1|acd166|acd166|2816|loadtest|sip|acd166|0000|7|1|1
1|acd167|acd167|2817|loadtest|sip|acd167|0000|7|1|1
1|acd168|acd168|2818|loadtest|sip|acd168|0000|7|1|1
1|acd169|acd169|2819|loadtest|sip|acd169|0000|7|1|1
1|acd170|acd170|2820|loadtest|sip|acd170|0000|7|1|1
1|acd171|acd171|2821|loadtest|sip|acd171|0000|7|1|1
1|acd172|acd172|2822|loadtest|sip|acd172|0000|7|1|1
1|acd173|acd173|2823|loadtest|sip|acd173|0000|7|1|1
1|acd174|acd174|2824|loadtest|sip|acd174|0000|7|1|1
1|acd175|acd175|2825|loadtest|sip|acd175|0000|7|1|1
1|acd176|acd176|2826|loadtest|sip|acd176|0000|7|1|1
1|acd177|acd177|2827|loadtest|sip|acd177|0000|7|1|1
1|acd178|acd178|2828|loadtest|sip|acd178|0000|7|1|1
1|acd179|acd179|2829|loadtest|sip|acd179|0000|7|1|1
1|acd180|acd180|2830|loadtest|sip|acd180|0000|7|1|1
1|acd181|acd181|2831|loadtest|sip|acd181|0000|7|1|1
1|acd182|acd182|2832|loadtest|sip|acd182|0000|7|1|1
1|acd183|acd183|2833|loadtest|sip|acd183|0000|7|1|1
1|acd184|acd184|2834|loadtest|sip|acd184|0000|7|1|1
1|acd185|acd185|2835|loadtest|sip|acd185|0000|7|1|1
1|acd186|acd186|2836|loadtest|sip|acd186|0000|7|1|1
1|acd187|acd187|2837|loadtest|sip|acd187|0000|7|1|1
1|acd188|acd188|2838|loadtest|sip|acd188|0000|7|1|1
1|acd189|acd189|2839|loadtest|sip|acd189|0000|7|1|1
1|acd190|acd190|2840|loadtest|sip|acd190|0000|7|1|1
1|acd191|acd191|2841|loadtest|sip|acd191|0000|7|1|1
1|acd192|acd192|2842|loadtest|sip|acd192|0000|7|1|1
1|acd193|acd193|2843|loadtest|sip|acd193|0000|7|1|1
1|acd194|acd194|2844|loadtest|sip|acd194|0000|7|1|1
1|acd195|acd195|2845|loadtest|sip|acd195|0000|7|1|1
1|acd196|acd196|2846|loadtest|sip|acd196|0000|7|1|1
1|acd197|acd197|2847|loadtest|sip|acd197|0000|7|1|1
1|acd198|acd198|2848|loadtest|sip|acd198|0000|7|1|1
1|acd199|acd199|2849|loadtest|sip|acd199|0000|7|1|1
1|acd200|acd200|2850|loadtest|sip|acd200|0000|7|1|1
1|acd201|acd201|2851|loadtest|sip|acd201|0000|7|1|1
1|acd202|acd202|2852|loadtest|sip|acd202|0000|7|1|1
1|acd203|acd203|2853|loadtest|sip|acd203|0000|7|1|1
1|acd204|acd204|2854|loadtest|sip|acd204|0000|7|1|1
1|acd205|acd205|2855|loadtest|sip|acd205|0000|7|1|1
1|acd206|acd206|2856|loadtest|sip|acd206|0000|7|1|1
1|acd207|acd207|2857|loadtest|sip|acd207|0000|7|1|1
1|acd208|acd208|2858|loadtest|sip|acd208|0000|7|1|1
1|acd209|acd209|2859|loadtest|sip|acd209|0000|7|1|1
1|acd210|acd210|2860|loadtest|sip|acd210|0000|7|1|1
1|acd211|acd211|2861|loadtest|sip|acd211|0000|7|1|1
1|acd212|acd212|2862|loadtest|sip|acd212|0000|7|1|1
1|acd213|acd213|2863|loadtest|sip|acd213|0000|7|1|1
1|acd214|acd214|2864|loadtest|sip|acd214|0000|7|1|1
1|acd215|acd215|2865|loadtest|sip|acd215|0000|7|1|1
1|acd216|acd216|2866|loadtest|sip|acd216|0000|7|1|1
1|acd217|acd217|2867|loadtest|sip|acd217|0000|7|1|1
1|acd218|acd218|2868|loadtest|sip|acd218|0000|7|1|1
1|acd219|acd219|2869|loadtest|sip|acd219|0000|7|1|1
1|acd220|acd220|2870|loadtest|sip|acd220|0000|7|1|1
1|acd221|acd221|2871|loadtest|sip|acd221|0000|7|1|1
1|acd222|acd222|2872|loadtest|sip|acd222|0000|7|1|1
1|acd223|acd223|2873|loadtest|sip|acd223|0000|7|1|1
1|acd224|acd224|2874|loadtest|sip|acd224|0000|7|1|1
1|acd225|acd225|2875|loadtest|sip|acd225|0000|7|1|1
1|acd226|acd226|2876|loadtest|sip|acd226|0000|7|1|1
1|acd227|acd227|2877|loadtest|sip|acd227|0000|7|1|1
1|acd228|acd228|2878|loadtest|sip|acd228|0000|7|1|1
1|acd229|acd229|2879|loadtest|sip|acd229|0000|7|1|1
1|acd230|acd230|2880|loadtest|sip|acd230|0000|7|1|1
1|acd231|acd231|2881|loadtest|sip|acd231|0000|7|1|1
1|acd232|acd232|2882|loadtest|sip|acd232|0000|7|1|1
1|acd233|acd233|2883|loadtest|sip|acd233|0000|7|1|1
1|acd234|acd234|2884|loadtest|sip|acd234|0000|7|1|1
1|acd235|acd235|2885|loadtest|sip|acd235|0000|7|1|1
1|acd236|acd236|2886|loadtest|sip|acd236|0000|7|1|1
1|acd237|acd237|2887|loadtest|sip|acd237|0000|7|1|1
1|acd238|acd238|2888|loadtest|sip|acd238|0000|7|1|1
1|acd239|acd239|2889|loadtest|sip|acd239|0000|7|1|1
1|acd240|acd240|2890|loadtest|sip|acd240|0000|7|1|1
1|acd241|acd241|2891|loadtest|sip|acd241|0000|7|1|1
1|acd242|acd242|2892|loadtest|sip|acd242|0000|7|1|1
1|acd243|acd243|2893|loadtest|sip|acd243|0000|7|1|1
1|acd244|acd244|2894|loadtest|sip|acd244|0000|7|1|1
1|acd245|acd245|2895|loadtest|sip|acd245|0000|7|1|1
1|acd246|acd246|2896|loadtest|sip|acd246|0000|7|1|1
1|acd247|acd247|2897|loadtest|sip|acd247|0000|7|1|1
1|acd248|acd248|2898|loadtest|sip|acd248|0000|7|1|1
1|acd249|acd249|2899|loadtest|sip|acd249|0000|7|1|1
1|acd250|acd250|2900|loadtest|sip|acd250|0000|7|1|1
1|acd251|acd251|2901|loadtest|sip|acd251|0000|7|1|1
1|acd252|acd252|2902|loadtest|sip|acd252|0000|7|1|1
1|acd253|acd253|2903|loadtest|sip|acd253|0000|7|1|1
1|acd254|acd254|2904|loadtest|sip|acd254|0000|7|1|1
1|acd255|acd255|2905|loadtest|sip|acd255|0000|7|1|1
1|acd256|acd256|2906|loadtest|sip|acd256|0000|7|1|1
1|acd257|acd257|2907|loadtest|sip|acd257|0000|7|1|1
1|acd258|acd258|2908|loadtest|sip|acd258|0000|7|1|1
1|acd259|acd259|2909|loadtest|sip|acd259|0000|7|1|1
1|acd260|acd260|2910|loadtest|sip|acd260|0000|7|1|1
1|acd261|acd261|2911|loadtest|sip|acd261|0000|7|1|1
1|acd262|acd262|2912|loadtest|sip|acd262|0000|7|1|1
1|acd263|acd263|2913|loadtest|sip|acd263|0000|7|1|1
1|acd264|acd264|2914|loadtest|sip|acd264|0000|7|1|1
1|acd265|acd265|2915|loadtest|sip|acd265|0000|7|1|1
1|acd266|acd266|2916|loadtest|sip|acd266|0000|7|1|1
1|acd267|acd267|2917|loadtest|sip|acd267|0000|7|1|1
1|acd268|acd268|2918|loadtest|sip|acd268|0000|7|1|1
1|acd269|acd269|2919|loadtest|sip|acd269|0000|7|1|1
1|acd270|acd270|2920|loadtest|sip|acd270|0000|7|1|1
1|acd271|acd271|2921|loadtest|sip|acd271|0000|7|1|1
1|acd272|acd272|2922|loadtest|sip|acd272|0000|7|1|1
1|acd273|acd273|2923|loadtest|sip|acd273|0000|7|1|1
1|acd274|acd274|2924|loadtest|sip|acd274|0000|7|1|1
1|acd275|acd275|2925|loadtest|sip|acd275|0000|7|1|1
1|acd276|acd276|2926|loadtest|sip|acd276|0000|7|1|1
1|acd277|acd277|2927|loadtest|sip|acd277|0000|7|1|1
1|acd278|acd278|2928|loadtest|sip|acd278|0000|7|1|1
1|acd279|acd279|2929|loadtest|sip|acd279|0000|7|1|1
1|acd280|acd280|2930|loadtest|sip|acd280|0000|7|1|1
1|acd281|acd281|2931|loadtest|sip|acd281|0000|7|1|1
1|acd282|acd282|2932|loadtest|sip|acd282|0000|7|1|1
1|acd283|acd283|2933|loadtest|sip|acd283|0000|7|1|1
1|acd284|acd284|2934|loadtest|sip|acd284|0000|7|1|1
1|acd285|acd285|2935|loadtest|sip|acd285|0000|7|1|1
1|acd286|acd286|2936|loadtest|sip|acd286|0000|7|1|1
1|acd287|acd287|2937|loadtest|sip|acd287|0000|7|1|1
1|acd288|acd288|2938|loadtest|sip|acd288|0000|7|1|1
1|acd289|acd289|2939|loadtest|sip|acd289|0000|7|1|1
1|acd290|acd290|2940|loadtest|sip|acd290|0000|7|1|1
1|acd291|acd291|2941|loadtest|sip|acd291|0000|7|1|1
1|acd292|acd292|2942|loadtest|sip|acd292|0000|7|1|1
1|acd293|acd293|2943|loadtest|sip|acd293|0000|7|1|1
1|acd294|acd294|2944|loadtest|sip|acd294|0000|7|1|1
1|acd295|acd295|2945|loadtest|sip|acd295|0000|7|1|1
1|acd296|acd296|2946|loadtest|sip|acd296|0000|7|1|1
1|acd297|acd297|2947|loadtest|sip|acd297|0000|7|1|1
1|acd298|acd298|2948|loadtest|sip|acd298|0000|7|1|1
1|acd299|acd299|2949|loadtest|sip|acd299|0000|7|1|1
1|acd300|acd300|2950|loadtest|sip|acd300|0000|7|1|1
1|acd301|acd301|2951|loadtest|sip|acd301|0000|7|1|1
1|acd302|acd302|2952|loadtest|sip|acd302|0000|7|1|1
1|acd303|acd303|2953|loadtest|sip|acd303|0000|7|1|1
1|acd304|acd304|2954|loadtest|sip|acd304|0000|7|1|1
1|acd305|acd305|2955|loadtest|sip|acd305|0000|7|1|1
1|acd306|acd306|2956|loadtest|sip|acd306|0000|7|1|1
1|acd307|acd307|2957|loadtest|sip|acd307|0000|7|1|1
1|acd308|acd308|2958|loadtest|sip|acd308|0000|7|1|1
1|acd309|acd309|2959|loadtest|sip|acd309|0000|7|1|1
