<?xml version="1.0" encoding="utf-8"?>
<!-- Generator: Adobe Illustrator 16.0.0, SVG Export Plug-In . SVG Version: 6.00 Build 0)  -->
<!DOCTYPE svg PUBLIC "-//W3C//DTD SVG 1.1//EN" "http://www.w3.org/Graphics/SVG/1.1/DTD/svg11.dtd">
<svg version="1.1" id="Calque_1" xmlns="http://www.w3.org/2000/svg" xmlns:xlink="http://www.w3.org/1999/xlink" x="0px" y="0px"
	 width="460.667px" height="504.5px" viewBox="-19 -32 460.667 504.5" enable-background="new -19 -32 460.667 504.5"
	 xml:space="preserve">
<g>
	<path fill="#A9A28A" d="M327.604,43.465c-11.143-4.797-24.07-2.177-32.787,6.116c-8.719,8.287-11.285,21.628-6.855,32.69
		c0.078,0.194,0.172,0.378,0.254,0.57c1.951-1.47,4.371-2.351,7.002-2.351c1.803,0,3.502,0.42,5.025,1.15
		c2.449-2.679,5.555-4.77,8.992-5.941c-4.398-2.415-7.621-6.807-7.328-12.218c0.4-7.395,6.209-14.657,14.225-14.229
		c7.666,0.414,13.238,5.662,14.123,13.109c0.076,0.341,0.121,0.707,0.098,1.121c0.023,0.417-0.051,0.787-0.133,1.134
		c-0.588,4.583-3.25,8.968-7.141,11.317c6.373,2.203,11.426,7.079,13.385,13.574c-4.174,4.649-9.904,7.924-16.502,9.072
		c-4.9,0.852-9.754,0.204-14.148-1.561c-0.297,0.646-0.658,1.256-1.062,1.833c3.24,1.293,6.723,2.059,10.305,2.202
		c16.795,0.67,30.555-13.568,30.775-30.005C345.666,59.096,338.645,48.213,327.604,43.465z"/>
</g>
<g>
	<path fill="#D75942" d="M182.132,290.261c2.398-5.57,1.089-12.035-3.059-16.395c-4.143-4.359-10.814-5.643-16.346-3.428
		c-5.553,2.227-9.154,7.615-9.391,13.545c-0.334,8.398,6.783,15.279,15.004,15.391C174.315,299.292,179.757,295.778,182.132,290.261
		z M168.341,296.96c-6.262-0.084-11.396-4.576-12.463-10.719c-1.068-6.141,3.024-12.135,8.828-13.951
		c5.993-1.875,12.344,1.227,15.059,6.74c2.758,5.604,0.521,12.531-4.57,15.902C173.157,296.284,170.767,296.927,168.341,296.96z"/>
	<path fill="#D75942" d="M164.904,292.409c0.118,0.441,0.413,0.773,0.824,0.947c0.307,0.16,0.653,0.205,1.005,0.109
		c1.848-0.248,3.694-0.498,5.539-0.75c1.929-0.26,1.184-3.125-0.717-2.867c-0.323,0.041-0.738-0.006-0.922,0.178
		c2.199-2.199,1.562-1.562,3.697-3.697c0.357-0.357,0.489-0.764,0.465-1.143c0-0.016,0.004-0.025,0.004-0.041
		c0-3.018,0-2.074,0-5.105h-0.002c0-0.41,0-0.963,0-1.967c0-2.012-3.016-2.012-3.016,0c0,3.018,0,2.074,0,5.104h0.001
		c0,0.33,0,0.764,0,1.434c-1.622,1.623-1.12,1.121-3.108,3.109c-0.11-0.361,0.025-0.477,0.061-0.691
		c0.316-1.902-2.619-2.713-2.939-0.787c-0.301,1.791-0.609,3.572-0.912,5.367C164.809,291.882,164.816,292.153,164.904,292.409z"/>
	<path fill="#D75942" d="M165.421,282.86c2.08,0,3.767-1.691,3.767-3.779c0-2.09-1.687-3.781-3.767-3.781s-3.766,1.691-3.766,3.781
		C161.655,281.169,163.341,282.86,165.421,282.86z M163.542,278.017c-0.211-0.213-0.211-0.559,0-0.771
		c0.211-0.211,0.556-0.211,0.769,0l1.041,1.045l1.041-1.045c0.212-0.211,0.555-0.211,0.768,0c0.212,0.213,0.212,0.557,0,0.771
		l-1.042,1.045l1.042,1.045c0.212,0.213,0.212,0.559,0,0.771c-0.213,0.213-0.556,0.213-0.768,0l-1.041-1.045l-1.041,1.045
		c-0.212,0.213-0.558,0.213-0.769,0c-0.211-0.211-0.211-0.557,0-0.771l1.041-1.045L163.542,278.017z"/>
</g>
<g>
	<path fill="#A9A28A" d="M75.326,278.487c-2.397,5.57-1.088,12.033,3.059,16.395c4.143,4.359,10.814,5.643,16.346,3.428
		c5.553-2.227,9.154-7.615,9.391-13.547c0.334-8.396-6.783-15.277-15.004-15.389C83.143,269.454,77.701,272.968,75.326,278.487z
		 M89.117,271.788c6.263,0.082,11.396,4.574,12.466,10.717c1.067,6.141-3.025,12.135-8.828,13.951
		c-5.995,1.875-12.345-1.227-15.06-6.74c-2.758-5.604-0.521-12.531,4.57-15.902C84.301,272.464,86.691,271.819,89.117,271.788z"/>
	<path fill="#A9A28A" d="M94.044,276.337c-0.117-0.441-0.412-0.773-0.823-0.947c-0.308-0.16-0.653-0.205-1.005-0.109
		c-1.849,0.248-3.694,0.5-5.54,0.75c-1.929,0.262-1.183,3.127,0.717,2.867c0.322-0.041,0.738,0.006,0.922-0.176
		c-2.2,2.199-1.563,1.562-3.697,3.697c-0.358,0.357-0.49,0.762-0.465,1.143c0,0.014-0.004,0.025-0.004,0.039c0,3.02,0,2.076,0,5.107
		h0.001c0,0.41,0,0.963,0,1.967c0,2.01,3.017,2.01,3.017,0c0-3.018,0-2.074,0-5.105h-0.002c0-0.328,0-0.764,0-1.434
		c1.622-1.623,1.12-1.121,3.108-3.109c0.11,0.361-0.024,0.479-0.06,0.691c-0.317,1.904,2.619,2.713,2.938,0.789
		c0.301-1.791,0.61-3.574,0.912-5.369C94.14,276.866,94.132,276.595,94.044,276.337z"/>
</g>
<g>
	<path fill="#A9A28A" d="M332.602,270.567c-5.57-2.396-12.033-1.088-16.395,3.059c-4.357,4.145-5.641,10.814-3.426,16.346
		c2.227,5.555,7.615,9.156,13.545,9.391c8.396,0.336,15.277-6.783,15.389-15.002C341.637,278.384,338.121,272.942,332.602,270.567z
		 M328.584,296.825c-6.141,1.064-12.135-3.025-13.949-8.83c-1.875-5.992,1.225-12.344,6.738-15.059
		c5.604-2.758,12.531-0.521,15.902,4.57c1.348,2.035,1.994,4.426,2.025,6.852C339.219,290.62,334.725,295.755,328.584,296.825z"/>
	<g>
		<path fill="#A9A28A" d="M329.025,284.378c-0.023-0.002-0.047-0.027-0.07-0.027c-0.02,0-0.041,0-0.061,0
			c-0.535,0-1.104,0.504-1.104,1.049c0,1.318,0,2.508,0,3.842s1.904,1.334,1.904,0c0,0,0-0.666,0-1.541
			c1.17,1.1,2.242,2.201,3.33,3.301c0.896,0.908,2.322-0.498,1.424-1.406c-1.057-1.07-2.1-2.141-3.158-3.213
			c0.518-0.002,1.041-0.004,1.553-0.008c1.266-0.006,1.283-2.008,0.016-2.002C331.594,284.378,330.293,284.372,329.025,284.378z"/>
		<path fill="#A9A28A" d="M325.615,285.583c0-0.021,0.025-0.045,0.025-0.068c0-0.02,0-0.043,0-0.062
			c0-0.535-0.504-1.102-1.049-1.102c-1.316,0-2.508,0-3.842,0s-1.334,1.902,0,1.902c0,0,0.666,0,1.541,0
			c-1.1,1.172-2.201,2.244-3.303,3.332c-0.906,0.896,0.5,2.322,1.406,1.424c1.07-1.059,2.143-2.1,3.213-3.158
			c0.004,0.516,0.006,1.041,0.01,1.551c0.004,1.268,2.006,1.285,2,0.018C325.613,288.153,325.619,286.853,325.615,285.583z"/>
		<path fill="#A9A28A" d="M325.65,282.679c0.014,0.018,0.012,0.051,0.029,0.068c0.014,0.014,0.029,0.029,0.045,0.043
			c0.377,0.379,1.135,0.422,1.52,0.039c0.932-0.934,1.773-1.773,2.717-2.719c0.943-0.943-0.402-2.289-1.348-1.346
			c0,0-0.471,0.473-1.088,1.09c-0.051-1.605-0.031-3.143-0.021-4.689c0.008-1.277-1.992-1.289-2-0.014
			c-0.012,1.506-0.029,2.998-0.039,4.504c-0.367-0.361-0.738-0.73-1.104-1.09c-0.898-0.891-2.328,0.512-1.426,1.404
			C323.834,280.862,324.748,281.786,325.65,282.679z"/>
	</g>
</g>
<g>
	<path fill="#9CB913" d="M233.717,278.487c-2.398,5.57-1.088,12.033,3.059,16.395c4.143,4.359,10.814,5.643,16.346,3.428
		c5.553-2.227,9.154-7.615,9.391-13.547c0.334-8.396-6.783-15.277-15.004-15.389C241.531,269.454,236.092,272.968,233.717,278.487z
		 M247.508,271.788c6.262,0.082,11.395,4.574,12.465,10.717c1.068,6.141-3.025,12.135-8.828,13.951
		c-5.994,1.875-12.344-1.227-15.059-6.74c-2.76-5.604-0.521-12.531,4.568-15.902C242.689,272.464,245.082,271.819,247.508,271.788z"
		/>
	<path fill="#9CB913" d="M250.943,276.337c-0.119-0.441-0.414-0.773-0.824-0.947c-0.307-0.16-0.652-0.205-1.006-0.109
		c-1.848,0.248-3.693,0.5-5.539,0.75c-1.928,0.262-1.182,3.127,0.719,2.867c0.322-0.041,0.736,0.006,0.922-0.176
		c-2.201,2.199-1.564,1.562-3.697,3.697c-0.359,0.357-0.49,0.762-0.465,1.143c0,0.014-0.004,0.025-0.004,0.039
		c0,3.02,0,2.076,0,5.107l0,0c0,0.41,0,0.963,0,1.967c0,2.01,3.016,2.01,3.016,0c0-3.018,0-2.074,0-5.105l0,0
		c0-0.328,0-0.764,0-1.434c1.621-1.623,1.119-1.121,3.107-3.109c0.111,0.361-0.025,0.479-0.061,0.691
		c-0.316,1.904,2.619,2.713,2.939,0.789c0.301-1.791,0.609-3.574,0.912-5.369C251.039,276.866,251.031,276.595,250.943,276.337z"/>
	<path fill="#9CB913" d="M250.422,285.854c-2.076,0-3.762,1.688-3.762,3.766s1.686,3.764,3.762,3.764s3.76-1.686,3.76-3.764
		C254.182,287.54,252.496,285.854,250.422,285.854z M252.572,288.331l-0.713,1.133l-0.525,0.838l-0.713,1.133
		c-0.143,0.227-0.438,0.297-0.668,0.162c-0.004-0.002-0.008-0.004-0.012-0.006h-0.002v-0.002c-0.055-0.027-0.104-0.064-0.146-0.113
		l-0.879-1.012l-0.416-0.477l-0.182-0.207c-0.18-0.203-0.158-0.516,0.047-0.695c0.207-0.18,0.52-0.156,0.697,0.049l0.182,0.205
		l0.416,0.477l0.473,0.545l0.367-0.586l0.523-0.836l0.713-1.133c0.146-0.23,0.449-0.301,0.682-0.156
		C252.646,287.794,252.717,288.099,252.572,288.331z"/>
</g>
<path fill="#A9A28A" d="M94.722,164.139c-5.57-2.397-12.034-1.088-16.395,3.058c-4.359,4.146-5.642,10.814-3.427,16.346
	c2.227,5.556,7.615,9.156,13.545,9.392c8.397,0.334,15.277-6.784,15.39-15.002C103.755,171.956,100.24,166.514,94.722,164.139z
	 M90.702,190.395c-6.14,1.065-12.135-3.024-13.95-8.829c-1.875-5.992,1.226-12.342,6.74-15.058
	c5.603-2.759,12.531-0.523,15.902,4.569c1.348,2.034,1.994,4.427,2.024,6.853C101.337,184.19,96.843,189.325,90.702,190.395z"/>
<g>
	<path fill="#A9A28A" d="M164.6,182.526c0.032,1.536,2.044,2.885,3.446,1.47c1.535-1.552,3.08-3.104,4.617-4.653
		c0.771-0.778,0.78-2.067,0.004-2.843c-1.535-1.537-3.088-3.073-4.625-4.609c-1.41-1.41-3.422-0.059-3.447,1.476L164.6,182.526z"/>
	<g>
		<path fill="#A9A28A" d="M181.923,183.833c2.397-5.571,1.088-12.036-3.059-16.396c-4.145-4.356-10.814-5.641-16.346-3.426
			c-5.555,2.227-9.155,7.615-9.391,13.546c-0.336,8.396,6.784,15.278,15,15.388C174.106,192.862,179.548,189.351,181.923,183.833z
			 M155.667,179.812c-1.067-6.139,3.022-12.134,8.829-13.95c5.99-1.876,12.341,1.228,15.058,6.741
			c2.759,5.603,0.522,12.531-4.57,15.902c-2.035,1.348-4.427,1.993-6.854,2.023C161.869,190.447,156.733,185.954,155.667,179.812z"
			/>
	</g>
</g>
<g>
	<path fill="#9CB913" d="M252.988,164.14c-5.568-2.396-12.033-1.088-16.393,3.059c-4.359,4.145-5.643,10.813-3.428,16.345
		c2.227,5.556,7.615,9.155,13.545,9.392c8.396,0.334,15.277-6.784,15.389-15.002C262.021,171.956,258.508,166.515,252.988,164.14z
		 M248.971,190.396c-6.139,1.065-12.135-3.024-13.949-8.829c-1.875-5.991,1.227-12.342,6.74-15.058
		c5.602-2.759,12.531-0.523,15.9,4.568c1.35,2.035,1.994,4.428,2.025,6.854C259.605,184.191,255.111,189.325,248.971,190.396z"/>
	<path fill="#9CB913" d="M242.156,172.236c-0.787,0-1.58,0.347-2.137,1.01l-0.205,0.206c-2.07,2.677-1.184,7.041,1.783,10.009
		l0.121,0.12c1.867,1.869,4.291,2.914,6.498,2.914c1.299,0,2.521-0.361,3.512-1.129l0.203-0.207c1.16-0.969,1.35-2.66,0.424-3.783
		c-0.506-0.614-1.242-0.931-1.994-0.931c-0.621,0-1.252,0.214-1.773,0.65c-0.389,0.325-0.666,0.732-0.832,1.17l-0.166,0.813
		c-1.01-0.623-2.014-1.457-2.963-2.407l-0.119-0.12c-0.951-0.95-1.781-1.95-2.404-2.959l0.812-0.167
		c0.438-0.166,0.844-0.444,1.168-0.834c0.965-1.159,0.844-2.844-0.279-3.771C243.324,172.428,242.742,172.236,242.156,172.236
		L242.156,172.236z"/>
	<path fill="#9CB913" d="M254.312,178.162c-0.095,0-0.191-0.014-0.287-0.042c-0.528-0.158-0.829-0.716-0.671-1.245
		c0.424-1.416,0.025-2.957-1.04-4.022c-1.058-1.058-2.587-1.462-3.99-1.049c-0.533,0.156-1.086-0.149-1.241-0.679
		s0.149-1.085,0.679-1.241c2.102-0.616,4.392-0.021,5.967,1.555c1.586,1.586,2.177,3.889,1.542,6.009
		C255.141,177.881,254.743,178.161,254.312,178.162z"/>
	<path fill="#9CB913" d="M251.396,178.084c-0.095,0-0.191-0.014-0.287-0.042c-0.529-0.159-0.829-0.716-0.671-1.245
		c0.172-0.574,0.009-1.201-0.427-1.637c-0.432-0.431-1.051-0.599-1.624-0.43c-0.537,0.155-1.086-0.151-1.24-0.68
		c-0.154-0.53,0.149-1.085,0.68-1.24c1.277-0.37,2.654-0.011,3.6,0.936c0.955,0.956,1.312,2.345,0.928,3.625
		C252.225,177.804,251.827,178.084,251.396,178.084z"/>
</g>
<g>
	<path fill="#D75942" d="M320.541,164.004c-5.633,2.244-9.277,7.739-9.43,13.754c-0.152,6.013,3.658,11.636,9.135,13.979
		c5.502,2.354,11.859,1.09,16.219-2.937c6.176-5.702,6.006-15.601,0.273-21.489C332.457,163.143,326.123,161.78,320.541,164.004z
		 M336.266,185.411c-3.588,5.095-10.721,6.44-16.107,3.621c-5.562-2.912-7.859-9.595-5.881-15.414
		c2.01-5.912,8.49-9.231,14.475-8.015c2.395,0.486,4.541,1.72,6.279,3.413C339.398,173.505,339.852,180.312,336.266,185.411z"/>
	<path fill="#D75942" d="M331.236,184.177c0.023,0,0.047,0.025,0.07,0.025c0.02,0,0.041,0,0.061,0c0.537,0,1.104-0.504,1.104-1.048
		c0-1.317,0-2.508,0-3.842c0-1.333-1.902-1.333-1.904,0c0,0,0,0.667,0,1.541c-1.17-1.1-2.242-2.201-3.33-3.302
		c-0.898-0.907-2.322,0.499-1.424,1.406c1.059,1.07,2.1,2.142,3.158,3.213c-0.518,0.004-1.039,0.005-1.551,0.008
		c-1.268,0.006-1.283,2.008-0.018,2.002S329.971,184.181,331.236,184.177z"/>
	<path fill="#D75942" d="M320.496,172.409c-2.967,2.966-3.854,7.332-1.783,10.008l0.207,0.203c0.971,1.158,2.662,1.349,3.785,0.423
		c0.064-0.054,0.125-0.108,0.184-0.166c0.947-0.949,1.008-2.511,0.096-3.604c-0.324-0.388-0.732-0.666-1.17-0.832l-0.812-0.166
		c0.623-1.01,1.457-2.012,2.406-2.962l0.121-0.12c0.004-0.004,0.008-0.008,0.012-0.012c0.945-0.945,1.941-1.771,2.947-2.393
		l0.166,0.812c0.166,0.438,0.445,0.844,0.834,1.167c1.094,0.911,2.652,0.854,3.604-0.096c0.059-0.059,0.113-0.119,0.166-0.184
		c0.924-1.121,0.734-2.812-0.422-3.783l-0.207-0.205c-2.676-2.069-7.039-1.186-10.006,1.781l-0.002,0.002l-0.121,0.12
		C320.498,172.407,320.496,172.407,320.496,172.409L320.496,172.409z"/>
</g>
<g enable-background="new    ">
	<path d="M77.826,199.174h1.758c1.302,0,1.953,0.586,1.953,1.758s-0.651,1.758-1.953,1.758h-0.977v1.953h-0.781V199.174z
		 M78.607,199.955v1.953h0.977c0.781,0,1.172-0.325,1.172-0.977s-0.391-0.977-1.172-0.977H78.607z"/>
	<path d="M83.607,199.174h0.938l1.68,5.469h-0.859l-0.336-1.172h-1.906l-0.336,1.172h-0.859L83.607,199.174z M84.076,200.15
		l-0.73,2.539h1.457L84.076,200.15z"/>
	<path d="M86.615,199.174h0.781v3.516c0,0.781,0.365,1.172,1.094,1.172c0.703,0,1.055-0.391,1.055-1.172v-3.516h0.781v3.516
		c0,1.302-0.612,1.953-1.836,1.953c-1.25,0-1.875-0.651-1.875-1.953V199.174z"/>
	<path d="M94.162,200.135c-0.31-0.12-0.668-0.18-1.074-0.18c-0.729,0-1.094,0.261-1.094,0.781c0,0.391,0.299,0.651,0.898,0.781
		c1.094,0.13,1.641,0.651,1.641,1.562c0,1.042-0.612,1.562-1.836,1.562c-0.651,0-1.181-0.086-1.59-0.258l0.203-0.75
		c0.18,0.06,0.384,0.109,0.613,0.148s0.487,0.065,0.773,0.078c0.703,0,1.055-0.261,1.055-0.781c0-0.394-0.287-0.653-0.859-0.781
		c-1.12-0.128-1.68-0.648-1.68-1.562c0-1.042,0.625-1.562,1.875-1.562c0.495,0,0.913,0.079,1.254,0.238L94.162,200.135z"/>
	<path d="M95.314,199.174h3.125v0.781h-2.344v1.562h2.148v0.781h-2.148v1.562h2.344v0.781h-3.125V199.174z"/>
</g>
<g enable-background="new    ">
	<path d="M160.267,199.174h1.758c1.302,0,1.953,0.586,1.953,1.758s-0.651,1.758-1.953,1.758h-0.977v1.953h-0.781V199.174z
		 M161.048,199.955v1.953h0.977c0.781,0,1.172-0.325,1.172-0.977s-0.391-0.977-1.172-0.977H161.048z"/>
	<path d="M164.759,199.174h0.781v4.688h2.344v0.781h-3.125V199.174z"/>
	<path d="M169.774,199.174h0.938l1.68,5.469h-0.859l-0.336-1.172h-1.906l-0.336,1.172h-0.859L169.774,199.174z M170.243,200.15
		l-0.73,2.539h1.457L170.243,200.15z"/>
	<path d="M172.392,199.174h0.898l1.055,2.227l1.055-2.227h0.898l-1.562,3.125v2.344h-0.781v-2.344L172.392,199.174z"/>
</g>
<g enable-background="new    ">
	<path d="M226.699,199.173h1.758c1.432,0,2.148,0.911,2.148,2.734s-0.717,2.734-2.148,2.734h-1.758V199.173z M227.48,199.954v3.906
		h0.977c0.912,0,1.367-0.651,1.367-1.953s-0.455-1.953-1.367-1.953H227.48z"/>
	<path d="M231.387,199.173h3.125v0.781h-2.344v1.562h2.148v0.781h-2.148v1.562h2.344v0.781h-3.125V199.173z M232.793,197.415h0.859
		l-0.469,1.172h-0.586L232.793,197.415z"/>
	<path d="M238.75,200.138c-0.338-0.122-0.775-0.184-1.309-0.184c-0.912,0-1.367,0.651-1.367,1.953s0.455,1.953,1.367,1.953
		c0.537,0,0.975-0.062,1.312-0.184l0.242,0.688c-0.455,0.185-0.975,0.277-1.555,0.277c-1.432,0-2.148-0.911-2.148-2.734
		s0.717-2.734,2.148-2.734c0.592,0,1.111,0.094,1.562,0.281L238.75,200.138z"/>
	<path d="M239.59,199.173h1.758c1.303,0,1.953,0.586,1.953,1.758c0,0.886-0.377,1.445-1.133,1.68l1.133,2.031h-0.898l-1.055-1.953
		h-0.977v1.953h-0.781V199.173z M240.371,199.954v1.953h0.977c0.781,0,1.172-0.325,1.172-0.977s-0.391-0.977-1.172-0.977H240.371z"
		/>
	<path d="M244.082,201.907c0-1.823,0.717-2.734,2.148-2.734s2.148,0.911,2.148,2.734s-0.717,2.734-2.148,2.734
		S244.082,203.73,244.082,201.907z M246.23,199.954c-0.912,0-1.367,0.651-1.367,1.953s0.455,1.953,1.367,1.953
		s1.367-0.651,1.367-1.953S247.143,199.954,246.23,199.954z"/>
	<path d="M252.617,200.138c-0.338-0.122-0.775-0.184-1.309-0.184c-0.912,0-1.367,0.651-1.367,1.953s0.455,1.953,1.367,1.953
		c0.537,0,0.975-0.062,1.312-0.184l0.242,0.688c-0.455,0.185-0.975,0.277-1.555,0.277c-1.432,0-2.148-0.911-2.148-2.734
		s0.717-2.734,2.148-2.734c0.592,0,1.111,0.094,1.562,0.281L252.617,200.138z"/>
	<path d="M253.457,199.173h0.781v2.344h2.148v-2.344h0.781v5.469h-0.781v-2.344h-2.148v2.344h-0.781V199.173z"/>
	<path d="M257.949,199.173h3.125v0.781h-2.344v1.562h2.148v0.781h-2.148v1.562h2.344v0.781h-3.125V199.173z"/>
	<path d="M261.855,199.173h1.758c1.303,0,1.953,0.586,1.953,1.758c0,0.886-0.377,1.445-1.133,1.68l1.133,2.031h-0.898l-1.055-1.953
		h-0.977v1.953h-0.781V199.173z M262.637,199.954v1.953h0.977c0.781,0,1.172-0.325,1.172-0.977s-0.391-0.977-1.172-0.977H262.637z"
		/>
</g>
<g enable-background="new    ">
	<path d="M304.408,199.173h1.758c1.303,0,1.953,0.586,1.953,1.758c0,0.886-0.377,1.445-1.133,1.68l1.133,2.031h-0.898l-1.055-1.953
		h-0.977v1.953h-0.781V199.173z M305.189,199.954v1.953h0.977c0.781,0,1.172-0.325,1.172-0.977s-0.391-0.977-1.172-0.977H305.189z"
		/>
	<path d="M310.189,199.173h0.938l1.68,5.469h-0.859l-0.336-1.172h-1.906l-0.336,1.172h-0.859L310.189,199.173z M310.658,200.149
		l-0.73,2.539h1.457L310.658,200.149z"/>
	<path d="M316.654,200.138c-0.338-0.122-0.775-0.184-1.309-0.184c-0.912,0-1.367,0.651-1.367,1.953s0.455,1.953,1.367,1.953
		c0.537,0,0.975-0.062,1.312-0.184l0.242,0.688c-0.455,0.185-0.975,0.277-1.555,0.277c-1.432,0-2.148-0.911-2.148-2.734
		s0.717-2.734,2.148-2.734c0.592,0,1.111,0.094,1.562,0.281L316.654,200.138z"/>
	<path d="M320.951,200.138c-0.338-0.122-0.775-0.184-1.309-0.184c-0.912,0-1.367,0.651-1.367,1.953s0.455,1.953,1.367,1.953
		c0.537,0,0.975-0.062,1.312-0.184l0.242,0.688c-0.455,0.185-0.975,0.277-1.555,0.277c-1.432,0-2.148-0.911-2.148-2.734
		s0.717-2.734,2.148-2.734c0.592,0,1.111,0.094,1.562,0.281L320.951,200.138z"/>
	<path d="M321.791,199.173h1.758c1.303,0,1.953,0.586,1.953,1.758c0,0.886-0.377,1.445-1.133,1.68l1.133,2.031h-0.898l-1.055-1.953
		h-0.977v1.953h-0.781V199.173z M322.572,199.954v1.953h0.977c0.781,0,1.172-0.325,1.172-0.977s-0.391-0.977-1.172-0.977H322.572z"
		/>
	<path d="M326.283,201.907c0-1.823,0.717-2.734,2.148-2.734s2.148,0.911,2.148,2.734s-0.717,2.734-2.148,2.734
		S326.283,203.73,326.283,201.907z M328.432,199.954c-0.912,0-1.367,0.651-1.367,1.953s0.455,1.953,1.367,1.953
		s1.367-0.651,1.367-1.953S329.344,199.954,328.432,199.954z"/>
	<path d="M334.818,200.138c-0.338-0.122-0.775-0.184-1.309-0.184c-0.912,0-1.367,0.651-1.367,1.953s0.455,1.953,1.367,1.953
		c0.537,0,0.975-0.062,1.312-0.184l0.242,0.688c-0.455,0.185-0.975,0.277-1.555,0.277c-1.432,0-2.148-0.911-2.148-2.734
		s0.717-2.734,2.148-2.734c0.592,0,1.111,0.094,1.562,0.281L334.818,200.138z"/>
	<path d="M335.658,199.173h0.781v2.344h2.148v-2.344h0.781v5.469h-0.781v-2.344h-2.148v2.344h-0.781V199.173z"/>
	<path d="M340.15,199.173h3.125v0.781h-2.344v1.562h2.148v0.781h-2.148v1.562h2.344v0.781h-3.125V199.173z"/>
	<path d="M344.057,199.173h1.758c1.303,0,1.953,0.586,1.953,1.758c0,0.886-0.377,1.445-1.133,1.68l1.133,2.031h-0.898l-1.055-1.953
		h-0.977v1.953h-0.781V199.173z M344.838,199.954v1.953h0.977c0.781,0,1.172-0.325,1.172-0.977s-0.391-0.977-1.172-0.977H344.838z"
		/>
</g>
<g enable-background="new    ">
	<path d="M68.336,40.953h1.558v7.617h-1.558V40.953z"/>
	<path d="M76.108,42.748c-0.583-0.201-1.232-0.301-1.944-0.301c-1.092,0-1.638,0.771-1.638,2.314s0.546,2.314,1.638,2.314
		c0.709,0,1.359-0.1,1.95-0.301l0.494,1.327c-0.792,0.312-1.606,0.468-2.444,0.468c-2.13,0-3.196-1.27-3.196-3.809
		s1.065-3.809,3.196-3.809c0.856,0,1.676,0.158,2.46,0.473L76.108,42.748z"/>
	<path d="M77.413,44.762c0-2.539,1.065-3.809,3.196-3.809s3.196,1.27,3.196,3.809s-1.065,3.809-3.196,3.809
		S77.413,47.301,77.413,44.762z M80.609,42.447c-1.092,0-1.638,0.771-1.638,2.314s0.546,2.314,1.638,2.314s1.638-0.771,1.638-2.314
		S81.701,42.447,80.609,42.447z"/>
	<path d="M84.879,40.953h1.456l2.573,4.399v-4.399h1.558v7.617h-1.456l-2.573-4.399v4.399h-1.558V40.953z"/>
	<path d="M91.539,40.953h4.78v1.494h-3.223v1.568h2.954v1.492h-2.954v1.568h3.223v1.494h-4.78V40.953z"/>
	<path d="M97.802,46.711c0.645,0.212,1.335,0.334,2.073,0.365c0.802,0,1.203-0.261,1.203-0.783c0-0.387-0.326-0.648-0.978-0.785
		c-1.676-0.186-2.514-0.945-2.514-2.277c0-1.518,0.94-2.277,2.82-2.277c0.706,0,1.375,0.141,2.009,0.42l-0.365,1.38
		c-0.577-0.204-1.125-0.306-1.644-0.306c-0.841,0-1.262,0.261-1.262,0.783c0,0.384,0.344,0.645,1.031,0.785
		c1.64,0.189,2.46,0.948,2.46,2.277c0,1.518-0.922,2.277-2.766,2.277c-0.927,0-1.753-0.146-2.476-0.436L97.802,46.711z"/>
	<path d="M106.675,40.953h1.783l1.294,2.605l1.305-2.605h1.778l-2.003,3.809l2.003,3.809h-1.778l-1.305-2.605l-1.294,2.605h-1.783
		l2.009-3.809L106.675,40.953z"/>
	<path d="M113.91,40.953h1.558v7.617h-1.558V40.953z"/>
	<path d="M116.004,40.953h1.692l1.59,5.27l1.595-5.27h1.692l-2.465,7.617h-1.644L116.004,40.953z"/>
	<path d="M122.987,44.762c0-2.539,1.065-3.809,3.196-3.809s3.196,1.27,3.196,3.809s-1.065,3.809-3.196,3.809
		S122.987,47.301,122.987,44.762z M126.183,42.447c-1.092,0-1.638,0.771-1.638,2.314s0.546,2.314,1.638,2.314
		s1.638-0.771,1.638-2.314S127.275,42.447,126.183,42.447z"/>
</g>
<g enable-background="new    ">
	<path d="M71.646,53.639c-0.338-0.122-0.775-0.184-1.309-0.184c-0.912,0-1.367,0.651-1.367,1.953s0.456,1.953,1.367,1.953
		c0.537,0,0.974-0.062,1.312-0.184l0.242,0.688c-0.456,0.185-0.974,0.277-1.555,0.277c-1.432,0-2.148-0.911-2.148-2.734
		s0.716-2.734,2.148-2.734c0.591,0,1.112,0.094,1.562,0.281L71.646,53.639z"/>
	<path d="M72.486,55.408c0-1.823,0.716-2.734,2.148-2.734s2.148,0.911,2.148,2.734s-0.716,2.734-2.148,2.734
		S72.486,57.231,72.486,55.408z M74.635,53.455c-0.912,0-1.367,0.651-1.367,1.953s0.456,1.953,1.367,1.953s1.367-0.651,1.367-1.953
		S75.546,53.455,74.635,53.455z"/>
	<path d="M77.564,52.674h1.25l1.289,4.297l1.289-4.297h1.25v5.469h-0.781v-4.297l-1.289,4.297h-0.938l-1.289-4.297v4.297h-0.781
		V52.674z"/>
	<path d="M83.424,52.674h1.758c1.302,0,1.953,0.586,1.953,1.758s-0.651,1.758-1.953,1.758h-0.977v1.953h-0.781V52.674z
		 M84.205,53.455v1.953h0.977c0.781,0,1.172-0.325,1.172-0.977s-0.391-0.977-1.172-0.977H84.205z"/>
	<path d="M87.916,52.674h0.781v4.688h2.344v0.781h-3.125V52.674z"/>
	<path d="M91.643,52.674h3.125v0.781h-2.344v1.562h2.148v0.781h-2.148v1.562h2.344v0.781h-3.125V52.674z M93.049,50.916h0.859
		l-0.469,1.172h-0.586L93.049,50.916z"/>
	<path d="M95.549,52.674h1.25l1.289,4.297l1.289-4.297h1.25v5.469h-0.781v-4.297l-1.289,4.297h-0.938l-1.289-4.297v4.297h-0.781
		V52.674z"/>
	<path d="M101.408,52.674h3.125v0.781h-2.344v1.562h2.148v0.781h-2.148v1.562h2.344v0.781h-3.125V52.674z"/>
	<path d="M105.314,52.674h0.781l2.148,3.867v-3.867h0.781v5.469h-0.781l-2.148-3.867v3.867h-0.781V52.674z"/>
	<path d="M109.807,52.674h3.516v0.781h-1.367v4.688h-0.781v-4.688h-1.367V52.674z"/>
	<path d="M118.791,55.018h2.344v0.781h-2.344V55.018z"/>
	<path d="M124.26,52.674h1.25l1.289,4.297l1.289-4.297h1.25v5.469h-0.781v-4.297l-1.289,4.297h-0.938l-1.289-4.297v4.297h-0.781
		V52.674z"/>
	<path d="M131.408,52.674h0.938l1.68,5.469h-0.859l-0.336-1.172h-1.906l-0.336,1.172h-0.859L131.408,52.674z M131.877,53.65
		l-0.73,2.539h1.457L131.877,53.65z"/>
	<path d="M134.416,52.674h1.758c1.302,0,1.953,0.586,1.953,1.758c0,0.886-0.377,1.445-1.133,1.68l1.133,2.031h-0.898l-1.055-1.953
		h-0.977v1.953h-0.781V52.674z M135.197,53.455v1.953h0.977c0.781,0,1.172-0.325,1.172-0.977s-0.391-0.977-1.172-0.977H135.197z"/>
	<path d="M141.963,53.635c-0.31-0.12-0.668-0.18-1.074-0.18c-0.729,0-1.094,0.261-1.094,0.781c0,0.391,0.299,0.651,0.898,0.781
		c1.094,0.13,1.641,0.651,1.641,1.562c0,1.042-0.612,1.562-1.836,1.562c-0.651,0-1.181-0.086-1.59-0.258l0.203-0.75
		c0.18,0.06,0.384,0.109,0.613,0.148s0.487,0.065,0.773,0.078c0.703,0,1.055-0.261,1.055-0.781c0-0.394-0.287-0.653-0.859-0.781
		c-1.12-0.128-1.68-0.648-1.68-1.562c0-1.042,0.625-1.562,1.875-1.562c0.495,0,0.913,0.079,1.254,0.238L141.963,53.635z"/>
	<path d="M145.459,52.912c0.419-0.159,0.902-0.238,1.449-0.238c1.12,0,1.68,0.521,1.68,1.562c0,0.653-0.391,1.2-1.172,1.641
		c-0.781,0.442-1.172,0.938-1.172,1.484h2.344v0.781h-3.125v-0.781c0-0.831,0.391-1.456,1.172-1.875
		c0.781-0.417,1.172-0.833,1.172-1.25c0-0.521-0.299-0.781-0.898-0.781c-0.458,0-0.869,0.06-1.23,0.18L145.459,52.912z"/>
	<path d="M149.369,55.408c0-1.823,0.651-2.734,1.953-2.734s1.953,0.911,1.953,2.734s-0.651,2.734-1.953,2.734
		S149.369,57.231,149.369,55.408z M151.322,53.455c-0.781,0-1.172,0.651-1.172,1.953s0.391,1.953,1.172,1.953
		s1.172-0.651,1.172-1.953S152.104,53.455,151.322,53.455z"/>
	<path d="M154.447,52.869l0.781-0.195v5.469h-0.781V52.869z"/>
	<path d="M156.4,52.674h3.203v0.781h-2.305l-0.039,1.562c0.26-0.261,0.586-0.391,0.977-0.391c1.042,0,1.562,0.573,1.562,1.719
		c0,1.198-0.651,1.797-1.953,1.797c-0.537,0-1.018-0.065-1.445-0.195l0.273-0.781c0.268,0.13,0.659,0.195,1.172,0.195
		c0.781,0,1.172-0.339,1.172-1.016c0-0.625-0.26-0.938-0.781-0.938c-0.391,0-0.781,0.195-1.172,0.586l-0.664-0.195V52.674z"/>
</g>
<g enable-background="new    ">
	<path d="M71.551,306.208c-0.31-0.121-0.668-0.18-1.074-0.18c-0.729,0-1.094,0.26-1.094,0.781c0,0.391,0.299,0.65,0.898,0.781
		c1.094,0.129,1.641,0.65,1.641,1.562c0,1.041-0.612,1.562-1.836,1.562c-0.651,0-1.181-0.086-1.59-0.258l0.203-0.75
		c0.18,0.059,0.384,0.109,0.613,0.148s0.487,0.064,0.773,0.078c0.703,0,1.055-0.262,1.055-0.781c0-0.395-0.287-0.654-0.859-0.781
		c-1.12-0.129-1.68-0.648-1.68-1.562c0-1.043,0.625-1.562,1.875-1.562c0.495,0,0.913,0.078,1.254,0.238L71.551,306.208z"/>
	<path d="M72.703,305.247h0.781v3.516c0,0.781,0.365,1.172,1.094,1.172c0.703,0,1.055-0.391,1.055-1.172v-3.516h0.781v3.516
		c0,1.301-0.612,1.953-1.836,1.953c-1.25,0-1.875-0.652-1.875-1.953V305.247z"/>
	<path d="M77.195,305.247h1.758c1.302,0,1.953,0.586,1.953,1.758s-0.651,1.758-1.953,1.758h-0.977v1.953h-0.781V305.247z
		 M77.977,306.028v1.953h0.977c0.781,0,1.172-0.326,1.172-0.977c0-0.652-0.391-0.977-1.172-0.977H77.977z"/>
	<path d="M81.688,305.247h3.125v0.781h-2.344v1.562h2.148v0.781h-2.148v1.562h2.344v0.781h-3.125V305.247z"/>
	<path d="M85.594,305.247h1.758c1.302,0,1.953,0.586,1.953,1.758c0,0.885-0.377,1.445-1.133,1.68l1.133,2.031h-0.898l-1.055-1.953
		h-0.977v1.953h-0.781V305.247z M86.375,306.028v1.953h0.977c0.781,0,1.172-0.326,1.172-0.977c0-0.652-0.391-0.977-1.172-0.977
		H86.375z"/>
	<path d="M89.695,305.247h0.859l1.289,4.492l1.289-4.492h0.859l-1.68,5.469h-0.938L89.695,305.247z"/>
	<path d="M94.383,305.247h0.781v5.469h-0.781V305.247z"/>
	<path d="M99,306.208c-0.31-0.121-0.668-0.18-1.074-0.18c-0.729,0-1.094,0.26-1.094,0.781c0,0.391,0.299,0.65,0.898,0.781
		c1.094,0.129,1.641,0.65,1.641,1.562c0,1.041-0.612,1.562-1.836,1.562c-0.651,0-1.181-0.086-1.59-0.258l0.203-0.75
		c0.18,0.059,0.384,0.109,0.613,0.148s0.487,0.064,0.773,0.078c0.703,0,1.055-0.262,1.055-0.781c0-0.395-0.287-0.654-0.859-0.781
		c-1.12-0.129-1.68-0.648-1.68-1.562c0-1.043,0.625-1.562,1.875-1.562c0.495,0,0.913,0.078,1.254,0.238L99,306.208z"/>
	<path d="M100.152,305.247h3.125v0.781h-2.344v1.562h2.148v0.781h-2.148v1.562h2.344v0.781h-3.125V305.247z"/>
	<path d="M104.059,305.247h1.758c1.302,0,1.953,0.586,1.953,1.758c0,0.885-0.377,1.445-1.133,1.68l1.133,2.031h-0.898l-1.055-1.953
		h-0.977v1.953h-0.781V305.247z M104.84,306.028v1.953h0.977c0.781,0,1.172-0.326,1.172-0.977c0-0.652-0.391-0.977-1.172-0.977
		H104.84z"/>
</g>
<g enable-background="new    ">
	<path d="M176.727,232.197h1.133v4.453h2.344v1.086h-3.477V232.197z"/>
	<path d="M180.836,232.197h3.477v1.086h-2.344v1.141h2.148v1.086h-2.148v1.141h2.344v1.086h-3.477V232.197z"/>
	<path d="M185.391,236.385c0.469,0.153,0.971,0.242,1.508,0.266c0.583,0,0.875-0.19,0.875-0.57c0-0.281-0.237-0.472-0.711-0.57
		c-1.219-0.136-1.828-0.688-1.828-1.656c0-1.104,0.684-1.656,2.051-1.656c0.513,0,1,0.102,1.461,0.305l-0.266,1.004
		c-0.419-0.148-0.818-0.223-1.195-0.223c-0.612,0-0.918,0.19-0.918,0.57c0,0.278,0.25,0.469,0.75,0.57
		c1.193,0.138,1.789,0.69,1.789,1.656c0,1.104-0.67,1.656-2.012,1.656c-0.674,0-1.275-0.105-1.801-0.316L185.391,236.385z"/>
	<path d="M191.844,232.197h3.867v1.086h-1.367v4.453h-1.133v-4.453h-1.367V232.197z"/>
	<path d="M196.492,232.197h1.934c1.419,0,2.129,0.613,2.129,1.84c0,0.927-0.349,1.493-1.047,1.699l1.176,2h-1.309l-1.055-1.855
		h-0.695v1.855h-1.133V232.197z M197.625,233.283v1.512h0.801c0.664,0,0.996-0.253,0.996-0.758c0-0.503-0.332-0.754-0.996-0.754
		H197.625z"/>
	<path d="M202.863,232.197h1.195l1.793,5.539h-1.23l-0.336-1.113h-1.645l-0.336,1.113h-1.23L202.863,232.197z M203.461,233.904
		l-0.496,1.633h0.992L203.461,233.904z"/>
	<path d="M206.152,232.197h1.059l1.871,3.199v-3.199h1.133v5.539h-1.059l-1.871-3.199v3.199h-1.133V232.197z"/>
	<path d="M211.293,236.385c0.469,0.153,0.971,0.242,1.508,0.266c0.583,0,0.875-0.19,0.875-0.57c0-0.281-0.237-0.472-0.711-0.57
		c-1.219-0.136-1.828-0.688-1.828-1.656c0-1.104,0.684-1.656,2.051-1.656c0.513,0,1,0.102,1.461,0.305l-0.266,1.004
		c-0.419-0.148-0.818-0.223-1.195-0.223c-0.612,0-0.918,0.19-0.918,0.57c0,0.278,0.25,0.469,0.75,0.57
		c1.193,0.138,1.789,0.69,1.789,1.656c0,1.104-0.67,1.656-2.012,1.656c-0.674,0-1.275-0.105-1.801-0.316L211.293,236.385z"/>
	<path d="M215.59,232.197h3.476v1.086h-2.343v1.141h2.148v1.086h-2.148v2.227h-1.133V232.197z"/>
	<path d="M219.847,232.197h3.477v1.086h-2.344v1.141h2.149v1.086h-2.149v1.141h2.344v1.086h-3.477V232.197z"/>
	<path d="M224.105,232.197h1.934c1.42,0,2.129,0.613,2.129,1.84c0,0.927-0.348,1.493-1.047,1.699l1.176,2h-1.309l-1.055-1.855
		h-0.695v1.855h-1.133V232.197z M225.238,233.283v1.512h0.801c0.664,0,0.996-0.253,0.996-0.758c0-0.503-0.332-0.754-0.996-0.754
		H225.238z"/>
	<path d="M229.078,232.197h3.867v1.086h-1.367v4.453h-1.133v-4.453h-1.367V232.197z"/>
	<path d="M234.023,236.385c0.469,0.153,0.973,0.242,1.508,0.266c0.584,0,0.875-0.19,0.875-0.57c0-0.281-0.236-0.472-0.711-0.57
		c-1.219-0.136-1.828-0.688-1.828-1.656c0-1.104,0.684-1.656,2.051-1.656c0.514,0,1,0.102,1.461,0.305l-0.266,1.004
		c-0.418-0.148-0.816-0.223-1.195-0.223c-0.611,0-0.918,0.19-0.918,0.57c0,0.278,0.25,0.469,0.75,0.57
		c1.193,0.138,1.789,0.69,1.789,1.656c0,1.104-0.67,1.656-2.012,1.656c-0.674,0-1.273-0.105-1.801-0.316L234.023,236.385z"/>
</g>
<g enable-background="new    ">
	<path d="M154.817,305.247h0.938l1.68,5.469h-0.859l-0.336-1.172h-1.906l-0.336,1.172h-0.859L154.817,305.247z M155.286,306.224
		l-0.73,2.539h1.457L155.286,306.224z"/>
	<path d="M157.825,305.247h0.781l2.148,3.867v-3.867h0.781v5.469h-0.781l-2.148-3.867v3.867h-0.781V305.247z"/>
	<path d="M162.317,305.247h0.781l2.148,3.867v-3.867h0.781v5.469h-0.781l-2.148-3.867v3.867h-0.781V305.247z"/>
	<path d="M166.81,305.247h0.781v3.516c0,0.781,0.365,1.172,1.094,1.172c0.703,0,1.055-0.391,1.055-1.172v-3.516h0.781v3.516
		c0,1.301-0.612,1.953-1.836,1.953c-1.25,0-1.875-0.652-1.875-1.953V305.247z"/>
	<path d="M171.302,305.247h0.781v4.688h2.344v0.781h-3.125V305.247z"/>
	<path d="M175.028,305.247h3.125v0.781h-2.344v1.562h2.148v0.781h-2.148v1.562h2.344v0.781h-3.125V305.247z"/>
	<path d="M178.935,305.247h1.758c1.302,0,1.953,0.586,1.953,1.758c0,0.885-0.377,1.445-1.133,1.68l1.133,2.031h-0.898l-1.055-1.953
		h-0.977v1.953h-0.781V305.247z M179.716,306.028v1.953h0.977c0.781,0,1.172-0.326,1.172-0.977c0-0.652-0.391-0.977-1.172-0.977
		H179.716z"/>
</g>
<g enable-background="new    ">
	<path d="M230.611,306.212c-0.338-0.123-0.775-0.184-1.309-0.184c-0.912,0-1.367,0.65-1.367,1.953c0,1.301,0.455,1.953,1.367,1.953
		c0.537,0,0.975-0.062,1.312-0.184l0.242,0.688c-0.455,0.184-0.975,0.277-1.555,0.277c-1.432,0-2.148-0.912-2.148-2.734
		c0-1.824,0.717-2.734,2.148-2.734c0.592,0,1.111,0.094,1.562,0.281L230.611,306.212z"/>
	<path d="M231.451,307.981c0-1.824,0.717-2.734,2.148-2.734s2.148,0.91,2.148,2.734c0,1.822-0.717,2.734-2.148,2.734
		S231.451,309.804,231.451,307.981z M233.6,306.028c-0.912,0-1.367,0.65-1.367,1.953c0,1.301,0.455,1.953,1.367,1.953
		s1.367-0.652,1.367-1.953C234.967,306.679,234.512,306.028,233.6,306.028z"/>
	<path d="M236.529,305.247h1.25l1.289,4.297l1.289-4.297h1.25v5.469h-0.781v-4.297l-1.289,4.297H238.6l-1.289-4.297v4.297h-0.781
		V305.247z"/>
	<path d="M242.389,305.247h1.758c1.303,0,1.953,0.586,1.953,1.758s-0.65,1.758-1.953,1.758h-0.977v1.953h-0.781V305.247z
		 M243.17,306.028v1.953h0.977c0.781,0,1.172-0.326,1.172-0.977c0-0.652-0.391-0.977-1.172-0.977H243.17z"/>
	<path d="M246.881,305.247h0.781v4.688h2.344v0.781h-3.125V305.247z"/>
	<path d="M250.607,305.247h3.125v0.781h-2.344v1.562h2.148v0.781h-2.148v1.562h2.344v0.781h-3.125V305.247z M252.014,303.489h0.859
		l-0.469,1.172h-0.586L252.014,303.489z"/>
	<path d="M254.514,305.247h3.516v0.781h-1.367v4.688h-0.781v-4.688h-1.367V305.247z"/>
	<path d="M258.811,305.247h3.125v0.781h-2.344v1.562h2.148v0.781h-2.148v1.562h2.344v0.781h-3.125V305.247z"/>
	<path d="M262.717,305.247h1.758c1.303,0,1.953,0.586,1.953,1.758c0,0.885-0.377,1.445-1.133,1.68l1.133,2.031h-0.898l-1.055-1.953
		h-0.977v1.953h-0.781V305.247z M263.498,306.028v1.953h0.977c0.781,0,1.172-0.326,1.172-0.977c0-0.652-0.391-0.977-1.172-0.977
		H263.498z"/>
</g>
<g enable-background="new    ">
	<path d="M307.979,306.212c-0.338-0.123-0.775-0.184-1.309-0.184c-0.912,0-1.367,0.65-1.367,1.953c0,1.301,0.455,1.953,1.367,1.953
		c0.537,0,0.975-0.062,1.312-0.184l0.242,0.688c-0.455,0.184-0.975,0.277-1.555,0.277c-1.432,0-2.148-0.912-2.148-2.734
		c0-1.824,0.717-2.734,2.148-2.734c0.592,0,1.111,0.094,1.562,0.281L307.979,306.212z"/>
	<path d="M308.818,307.981c0-1.824,0.717-2.734,2.148-2.734s2.148,0.91,2.148,2.734c0,1.822-0.717,2.734-2.148,2.734
		S308.818,309.804,308.818,307.981z M310.967,306.028c-0.912,0-1.367,0.65-1.367,1.953c0,1.301,0.455,1.953,1.367,1.953
		s1.367-0.652,1.367-1.953C312.334,306.679,311.879,306.028,310.967,306.028z"/>
	<path d="M313.896,305.247h0.781l2.148,3.867v-3.867h0.781v5.469h-0.781l-2.148-3.867v3.867h-0.781V305.247z"/>
	<path d="M318.389,305.247h3.125v0.781h-2.344v1.562h2.148v0.781h-2.148v2.344h-0.781V305.247z"/>
	<path d="M322.295,305.247h3.125v0.781h-2.344v1.562h2.148v0.781h-2.148v1.562h2.344v0.781h-3.125V305.247z M323.701,303.489h0.859
		l-0.469,1.172h-0.586L323.701,303.489z"/>
	<path d="M326.201,305.247h1.758c1.303,0,1.953,0.586,1.953,1.758c0,0.885-0.377,1.445-1.133,1.68l1.133,2.031h-0.898l-1.055-1.953
		h-0.977v1.953h-0.781V305.247z M326.982,306.028v1.953h0.977c0.781,0,1.172-0.326,1.172-0.977c0-0.652-0.391-0.977-1.172-0.977
		H326.982z"/>
	<path d="M330.693,305.247h3.125v0.781h-2.344v1.562h2.148v0.781h-2.148v1.562h2.344v0.781h-3.125V305.247z"/>
	<path d="M334.6,305.247h0.781l2.148,3.867v-3.867h0.781v5.469h-0.781l-2.148-3.867v3.867H334.6V305.247z"/>
	<path d="M342.549,306.212c-0.338-0.123-0.775-0.184-1.309-0.184c-0.912,0-1.367,0.65-1.367,1.953c0,1.301,0.455,1.953,1.367,1.953
		c0.537,0,0.975-0.062,1.312-0.184l0.242,0.688c-0.455,0.184-0.975,0.277-1.555,0.277c-1.432,0-2.148-0.912-2.148-2.734
		c0-1.824,0.717-2.734,2.148-2.734c0.592,0,1.111,0.094,1.562,0.281L342.549,306.212z"/>
	<path d="M343.389,305.247h3.125v0.781h-2.344v1.562h2.148v0.781h-2.148v1.562h2.344v0.781h-3.125V305.247z"/>
</g>
<line fill="none" stroke="#000000" stroke-width="0.5" stroke-miterlimit="10" x1="68.858" y1="243.383" x2="346.859" y2="243.383"/>
<path fill="#A9A28A" d="M94.868,171.172c0-0.257-0.068-0.507-0.208-0.743c-0.268-0.491-0.765-0.79-1.304-0.79
	c-0.091,0-0.184,0.009-0.275,0.026l-8.038,1.589c-0.213,0.041-0.414,0.129-0.597,0.264c-0.43,0.287-0.678,0.749-0.678,1.247v7.903
	c-0.004,0-0.008-0.001-0.012-0.001c-1.666,0-3.016,0.942-3.016,2.106c0,1.163,1.351,2.107,3.016,2.107s3.015-0.944,3.015-2.107
	c0-0.036-0.013-0.069-0.015-0.104l0.015-0.135v-8.561l5.094-1.008v6.106c-0.013,0-0.026-0.003-0.039-0.003
	c-1.666,0-3.016,0.943-3.016,2.107c0,1.163,1.351,2.106,3.016,2.106s3.015-0.943,3.015-2.106c0-0.018-0.006-0.032-0.006-0.048
	c0.008-0.064,0.033-0.123,0.033-0.189V171.172z"/>
<g>
	<g>
		<path fill="#E77B39" d="M75.001,400.019l-1.744-2.693l1.623-2.422c0.304-0.453,0.468-0.816,0.471-1.129l0,0v-0.01v-0.02h-0.001
			c-0.005-0.201-0.094-0.389-0.248-0.531c-0.16-0.154-0.379-0.232-0.619-0.232c-0.005,0-0.008,0-0.009,0
			c-0.133,0-0.259,0.023-0.369,0.072c-0.109,0.049-0.209,0.121-0.293,0.217c-0.08,0.088-0.161,0.195-0.243,0.324
			c-0.079,0.123-0.174,0.271-0.287,0.445l-1.24,1.873l-1.154-1.875c-0.238-0.385-0.421-0.65-0.569-0.809
			c-0.161-0.174-0.395-0.256-0.658-0.254c-0.001,0-0.002,0-0.002,0c-0.237-0.002-0.453,0.076-0.621,0.229
			c-0.167,0.145-0.266,0.334-0.266,0.537v0.004v0.004l0,0c0.001,0.18,0.044,0.361,0.123,0.547c0.081,0.18,0.195,0.391,0.349,0.635
			l1.544,2.391l-1.849,2.689l0.116,0.08l-0.116-0.08c-0.289,0.426-0.446,0.795-0.448,1.127l0,0c-0.001,0.266,0.077,0.498,0.25,0.658
			c0.161,0.152,0.377,0.229,0.612,0.229h0.001h0.001h0.016h0.001c0.143-0.002,0.272-0.025,0.388-0.072
			c0.116-0.051,0.22-0.119,0.307-0.203c0.079-0.08,0.147-0.162,0.206-0.248c0.053-0.078,0.14-0.213,0.265-0.408l1.468-2.232
			l1.373,2.168c0.19,0.291,0.32,0.486,0.391,0.59c0.08,0.115,0.187,0.215,0.313,0.291c0.139,0.084,0.302,0.121,0.482,0.121h0.003
			c0.17,0,0.329-0.037,0.469-0.113c0.143-0.076,0.255-0.186,0.333-0.318c0.078-0.133,0.118-0.283,0.118-0.439
			c0-0.168-0.042-0.34-0.121-0.516C75.285,400.472,75.165,400.267,75.001,400.019z"/>
		<path fill="#E77B39" d="M77.132,395.331L77.132,395.331c-0.001,0-0.002,0-0.002,0c-0.263-0.002-0.498,0.096-0.665,0.281
			c-0.177,0.193-0.255,0.467-0.255,0.801l-0.006,4.516l0,0v0.004c-0.002,0.328,0.076,0.604,0.251,0.801
			c0.166,0.197,0.403,0.301,0.668,0.297h0.058l0.002-0.002c0.24-0.012,0.455-0.107,0.616-0.283c0.183-0.197,0.265-0.479,0.265-0.814
			l0.007-4.564l0,0v-0.004v-0.004l0,0c-0.001-0.301-0.086-0.559-0.265-0.746C77.632,395.427,77.395,395.331,77.132,395.331z"/>
		<path fill="#E77B39" d="M77.786,393.282c-0.181-0.15-0.398-0.229-0.635-0.229l0,0c-0.243-0.002-0.47,0.086-0.651,0.25
			c-0.187,0.166-0.287,0.396-0.288,0.648c0,0.004,0,0.006,0,0.008l0,0h0.001h-0.001c-0.001,0.273,0.092,0.516,0.284,0.68
			c0.177,0.156,0.402,0.236,0.65,0.236l0,0h0.001h0.002h0.033h0.002c0.229-0.006,0.438-0.088,0.607-0.24
			c0.188-0.164,0.282-0.402,0.281-0.674l0,0l0,0c0-0.004,0-0.008,0-0.014v-0.002l0,0C78.071,393.675,77.976,393.438,77.786,393.282z
			"/>
		<path fill="#E77B39" d="M86.28,394.212c0.025-0.107,0.038-0.211,0.038-0.309v-0.002v-0.023v-0.002
			c-0.005-0.141-0.049-0.279-0.125-0.41c-0.083-0.143-0.202-0.258-0.346-0.342c-0.146-0.086-0.307-0.129-0.475-0.129H85.37h-0.001
			h-0.003c-0.221,0-0.413,0.051-0.561,0.172c-0.131,0.105-0.229,0.23-0.289,0.371c-0.054,0.125-0.129,0.336-0.23,0.639l-1.801,5.33
			l-1.779-5.295c-0.129-0.398-0.257-0.695-0.391-0.895c-0.151-0.227-0.419-0.332-0.736-0.332h-0.001
			c-0.271,0-0.515,0.098-0.695,0.285c-0.18,0.18-0.279,0.4-0.278,0.637c0,0.002,0,0.002,0,0.004c0,0.09,0.014,0.193,0.039,0.311
			c0.028,0.119,0.061,0.227,0.1,0.33c0.035,0.096,0.069,0.193,0.106,0.293l2.012,5.498c0.071,0.213,0.146,0.414,0.219,0.605
			c0.076,0.197,0.165,0.375,0.27,0.531c0.111,0.168,0.259,0.305,0.437,0.406c0.186,0.104,0.407,0.154,0.656,0.154h0.003h0.002l0,0
			h0.004l0,0c0.245,0,0.465-0.051,0.649-0.158c0.176-0.102,0.322-0.234,0.431-0.398c0.104-0.152,0.192-0.332,0.27-0.529
			c0.074-0.193,0.147-0.396,0.223-0.609l2.06-5.535c0.034-0.102,0.07-0.199,0.104-0.295
			C86.225,394.417,86.255,394.315,86.28,394.212z"/>
		<path fill="#E77B39" d="M94.271,395.14c-0.333-0.682-0.832-1.213-1.485-1.584c-0.654-0.371-1.435-0.553-2.33-0.555h-0.012
			c-0.659,0-1.253,0.104-1.779,0.311c-0.526,0.209-0.979,0.514-1.348,0.91c-0.37,0.396-0.651,0.877-0.844,1.438
			c-0.194,0.559-0.289,1.174-0.291,1.838c-0.001,0.008,0,0.01-0.001,0.012c0,0.645,0.092,1.248,0.272,1.809
			c0.186,0.564,0.459,1.053,0.822,1.457c0.366,0.406,0.821,0.723,1.363,0.943c0.544,0.223,1.154,0.332,1.836,0.334
			c0.007,0,0.009,0,0.009,0c0.677,0,1.284-0.107,1.819-0.32c0.535-0.215,0.99-0.527,1.359-0.938
			c0.369-0.408,0.646-0.891,0.828-1.443c0.184-0.551,0.275-1.162,0.276-1.832v-0.008l-0.001-0.002
			C94.769,396.61,94.605,395.817,94.271,395.14z M92.433,399.14c-0.21,0.439-0.484,0.752-0.826,0.957
			c-0.346,0.205-0.725,0.309-1.139,0.309h-0.002c-0.325,0-0.619-0.061-0.889-0.182c-0.269-0.117-0.504-0.295-0.715-0.539
			c-0.206-0.238-0.369-0.543-0.486-0.918c-0.113-0.373-0.174-0.793-0.174-1.262l0,0l0,0l0.001-0.004
			c0-0.467,0.062-0.885,0.177-1.252c0.119-0.371,0.276-0.666,0.473-0.896c0.197-0.23,0.431-0.406,0.703-0.525
			c0.271-0.121,0.568-0.182,0.891-0.182l0,0c0.467,0.002,0.863,0.111,1.21,0.33s0.613,0.537,0.806,0.973
			c0.188,0.432,0.285,0.949,0.285,1.553c0,0.004,0,0.008,0.002,0.008C92.747,398.163,92.64,398.708,92.433,399.14z M92.889,397.505
			L92.889,397.505L92.889,397.505L92.889,397.505z M90.452,393.14L90.452,393.14L90.452,393.14L90.452,393.14z"/>
		<polygon fill="#E77B39" points="96.153,392.966 95.962,393.692 95.772,392.966 95.438,392.964 95.437,394.019 95.638,394.019 
			95.64,393.179 95.863,394.019 96.056,394.019 96.285,393.179 96.283,394.019 96.488,394.019 96.489,392.966 		"/>
		<polygon fill="#E77B39" points="94.454,393.147 94.781,393.147 94.779,394.019 94.993,394.019 94.995,393.147 95.312,393.149 
			95.312,392.964 94.456,392.964 		"/>
	</g>
	<g>
		<path fill="#E77B39" d="M95.026,411.507H69.952c-0.812,0-1.472-0.66-1.472-1.473s0.659-1.473,1.472-1.473h25.074
			c0.812,0,1.473,0.66,1.473,1.473S95.839,411.507,95.026,411.507z"/>
		<path fill="#E77B39" d="M95.026,386.45H69.952c-0.812,0-1.472-0.658-1.472-1.473c0-0.812,0.659-1.471,1.472-1.471h25.074
			c0.812,0,1.473,0.658,1.473,1.471C96.499,385.792,95.839,386.45,95.026,386.45z"/>
	</g>
</g>
</svg>
