<?xml version="1.0" encoding="UTF-8" standalone="no"?>
<!-- Created with Inkscape (http://www.inkscape.org/) -->

<svg
   xmlns:dc="http://purl.org/dc/elements/1.1/"
   xmlns:cc="http://creativecommons.org/ns#"
   xmlns:rdf="http://www.w3.org/1999/02/22-rdf-syntax-ns#"
   xmlns:svg="http://www.w3.org/2000/svg"
   xmlns="http://www.w3.org/2000/svg"
   xmlns:sodipodi="http://sodipodi.sourceforge.net/DTD/sodipodi-0.dtd"
   xmlns:inkscape="http://www.inkscape.org/namespaces/inkscape"
   width="258.9581"
   height="357.93845"
   id="svg2"
   version="1.1"
   inkscape:version="0.48.5 r10040"
   sodipodi:docname="Oreille.V5.svg">
  <defs
     id="defs4" />
  <sodipodi:namedview
     id="base"
     pagecolor="#ffffff"
     bordercolor="#666666"
     borderopacity="1.0"
     inkscape:pageopacity="0.0"
     inkscape:pageshadow="2"
     inkscape:zoom="0.23739598"
     inkscape:cx="1175.9259"
     inkscape:cy="645.19925"
     inkscape:document-units="px"
     inkscape:current-layer="layer1"
     showgrid="false"
     inkscape:window-width="1600"
     inkscape:window-height="876"
     inkscape:window-x="0"
     inkscape:window-y="24"
     inkscape:window-maximized="1"
     fit-margin-top="0"
     fit-margin-left="0"
     fit-margin-right="0"
     fit-margin-bottom="0" />
  <metadata
     id="metadata7">
    <rdf:RDF>
      <cc:Work
         rdf:about="">
        <dc:format>image/svg+xml</dc:format>
        <dc:type
           rdf:resource="http://purl.org/dc/dcmitype/StillImage" />
        <dc:title></dc:title>
      </cc:Work>
    </rdf:RDF>
  </metadata>
  <g
     inkscape:label="Calque 1"
     inkscape:groupmode="layer"
     id="layer1"
     transform="translate(-248.68935,-344.67051)">
    <path
       style="fill:#e77d39;fill-opacity:1;stroke:#e77d39;stroke-width:12.54947758;stroke-linecap:butt;stroke-linejoin:round;stroke-miterlimit:4;stroke-opacity:1;stroke-dasharray:none"
       d="m 269.08849,582.99615 c -38.90304,16.2005 10.86199,132.16991 77.46481,110.43142 44.65843,-41.95709 3.04275,-62.45586 84.64265,-95.58621 76.38375,-23.37941 72.0341,-89.43801 68.69562,-140.28847 -22.89429,-144.26212 -290.43479,-141.13284 -214.50881,3.43564 21.14934,-73.09012 39.53544,-72.8661 89.1571,-76.42208 56.8986,-0.52749 89.16929,36.01586 95.66605,65.41102 7.27493,33.14498 14.38457,48.63429 -6.69794,89.07229 -30.91538,35.66671 -47.26477,29.23262 -86.16853,55.1101 -27.72241,13.88712 -10.20593,64.461 -49.03904,65.39861 -14.27313,-0.13183 -40.56152,-14.4542 -42.89652,-31.48685 -2.335,-17.03265 -2.74052,-27.87748 -2.74052,-27.87748 z"
       id="path4684"
       inkscape:connector-curvature="0"
       sodipodi:nodetypes="cccccccccczcc" />
    <path
       style="fill:#e77d39;fill-opacity:1;stroke:#e77d39;stroke-width:12.54947758;stroke-linecap:butt;stroke-linejoin:miter;stroke-miterlimit:4;stroke-opacity:1;stroke-dasharray:none"
       d="m 453.45546,486.20319 c -10.48886,-20.45588 -5.52857,-35.68061 -34.02927,-62.23538 -36.83594,-15.0016 -49.48201,-17.98979 -86.33974,8.79962 12.28896,58.4499 -5.5842,19.5816 -17.6527,68.82426 18.33628,4.14866 23.23154,17.59854 21.94836,35.32392 -9.9907,10.14054 -29.27202,17.13523 -17.39451,34.68046 l 21.27546,12.27526 13.49449,-10.64457 c 30.16666,-23.62323 17.207,-28.76585 19.32018,-40.36753 -19.71873,-31.68431 -23.64421,-38.32548 -18.1605,-63.20125 -4.71605,-55.28728 36.13333,-34.49252 55.58198,-30.62477 20.62883,11.09882 27.99666,30.02989 41.95625,47.16998 z"
       id="path4686"
       inkscape:connector-curvature="0"
       sodipodi:nodetypes="cccccccccccc" />
    <path
       style="fill:#e77d39;fill-opacity:1;stroke:#e77d39;stroke-width:12.67688656;stroke-linecap:round;stroke-linejoin:round;stroke-miterlimit:4;stroke-opacity:1;stroke-dasharray:none"
       d="m 263.58726,624.61599 c -0.67135,-3.89021 -1.15432,-9.33276 -1.07326,-12.09452 0.17333,-5.9061 4.5886,-19.70526 5.3071,-16.58642 0.69019,2.99598 -1.34379,35.03869 -2.24877,35.42649 -0.42045,0.18017 -1.31373,-2.85533 -1.98507,-6.74555 z"
       id="path4763"
       inkscape:connector-curvature="0" />
  </g>
</svg>
