<?xml version="1.0" encoding="utf-8"?>
<!-- Generator: Adobe Illustrator 16.0.0, SVG Export Plug-In . SVG Version: 6.00 Build 0)  -->
<!DOCTYPE svg PUBLIC "-//W3C//DTD SVG 1.1//EN" "http://www.w3.org/Graphics/SVG/1.1/DTD/svg11.dtd">
<svg version="1.1" id="Calque_1" xmlns="http://www.w3.org/2000/svg" xmlns:xlink="http://www.w3.org/1999/xlink" x="0px" y="0px"
	 width="449px" height="510px" viewBox="0 0 449 510" enable-background="new 0 0 449 510" xml:space="preserve">
<g>
	<path d="M349.578,63.119c-11.142-4.797-24.07-2.177-32.787,6.116c-8.719,8.287-11.285,21.628-6.854,32.69
		c0.077,0.194,0.172,0.378,0.254,0.57c1.95-1.47,4.371-2.351,7.002-2.351c1.803,0,3.502,0.42,5.024,1.15
		c2.449-2.679,5.556-4.77,8.992-5.941c-4.397-2.415-7.621-6.807-7.328-12.218c0.4-7.395,6.209-14.657,14.226-14.229
		c7.666,0.414,13.237,5.662,14.123,13.109c0.075,0.341,0.12,0.707,0.098,1.121c0.022,0.417-0.051,0.787-0.133,1.134
		c-0.588,4.583-3.25,8.968-7.142,11.317c6.373,2.203,11.427,7.079,13.386,13.574c-4.175,4.649-9.904,7.924-16.502,9.072
		c-4.9,0.852-9.755,0.204-14.148-1.561c-0.297,0.646-0.658,1.256-1.062,1.833c3.24,1.293,6.722,2.059,10.304,2.202
		c16.795,0.67,30.555-13.568,30.776-30.005C367.641,78.75,360.619,67.867,349.578,63.119z"/>
</g>
<g>
	<path d="M204.107,309.915c2.398-5.57,1.089-12.034-3.059-16.395c-4.143-4.358-10.814-5.643-16.346-3.428
		c-5.553,2.228-9.154,7.615-9.391,13.546c-0.334,8.397,6.783,15.278,15.004,15.39C196.291,318.947,201.732,315.434,204.107,309.915z
		 M190.316,316.614c-6.262-0.083-11.396-4.576-12.463-10.719c-1.068-6.14,3.024-12.135,8.828-13.95
		c5.993-1.875,12.344,1.227,15.059,6.739c2.758,5.604,0.521,12.531-4.57,15.903C195.133,315.938,192.742,316.582,190.316,316.614z"
		/>
	<path d="M186.88,312.063c0.118,0.441,0.413,0.774,0.824,0.948c0.307,0.159,0.653,0.205,1.005,0.109
		c1.848-0.248,3.694-0.499,5.539-0.75c1.929-0.261,1.184-3.126-0.717-2.867c-0.323,0.041-0.738-0.007-0.922,0.177
		c2.199-2.198,1.562-1.562,3.697-3.696c0.357-0.358,0.489-0.764,0.465-1.144c0-0.015,0.004-0.025,0.004-0.04
		c0-3.018,0-2.075,0-5.105h-0.002c0-0.41,0-0.964,0-1.968c0-2.012-3.016-2.012-3.016,0c0,3.018,0,2.074,0,5.104h0.001
		c0,0.329,0,0.763,0,1.434c-1.622,1.622-1.12,1.12-3.108,3.108c-0.11-0.361,0.025-0.477,0.061-0.69
		c0.316-1.902-2.619-2.713-2.939-0.788c-0.301,1.791-0.609,3.573-0.912,5.367C186.784,311.537,186.792,311.808,186.88,312.063z"/>
	<path d="M187.396,302.515c2.08,0,3.767-1.691,3.767-3.779c0-2.09-1.687-3.781-3.767-3.781s-3.766,1.691-3.766,3.781
		C183.631,300.824,185.316,302.515,187.396,302.515z M185.518,297.671c-0.211-0.213-0.211-0.558,0-0.771
		c0.211-0.212,0.556-0.212,0.769,0l1.041,1.045l1.041-1.045c0.212-0.212,0.555-0.212,0.768,0c0.212,0.212,0.212,0.557,0,0.771
		l-1.042,1.045l1.042,1.046c0.212,0.213,0.212,0.559,0,0.771c-0.213,0.213-0.556,0.213-0.768,0l-1.041-1.045l-1.041,1.045
		c-0.212,0.213-0.558,0.213-0.769,0c-0.211-0.212-0.211-0.557,0-0.771l1.041-1.046L185.518,297.671z"/>
</g>
<g>
	<path d="M97.302,298.142c-2.397,5.57-1.088,12.034,3.059,16.396c4.143,4.358,10.814,5.642,16.346,3.427
		c5.553-2.227,9.154-7.615,9.391-13.546c0.334-8.397-6.783-15.278-15.004-15.389C105.118,289.109,99.677,292.623,97.302,298.142z
		 M111.093,291.442c6.263,0.083,11.396,4.575,12.466,10.718c1.067,6.14-3.025,12.135-8.828,13.951
		c-5.995,1.875-12.345-1.228-15.06-6.74c-2.758-5.604-0.521-12.531,4.57-15.903C106.277,292.119,108.667,291.475,111.093,291.442z"
		/>
	<path d="M116.02,295.992c-0.117-0.441-0.412-0.774-0.823-0.948c-0.308-0.159-0.653-0.205-1.005-0.109
		c-1.849,0.249-3.694,0.5-5.54,0.75c-1.929,0.262-1.183,3.127,0.717,2.867c0.322-0.041,0.738,0.007,0.922-0.176
		c-2.2,2.199-1.563,1.562-3.697,3.697c-0.358,0.357-0.49,0.762-0.465,1.143c0,0.014-0.004,0.026-0.004,0.04c0,3.019,0,2.075,0,5.106
		h0.001c0,0.411,0,0.964,0,1.968c0,2.01,3.017,2.01,3.017,0c0-3.019,0-2.075,0-5.106h-0.002c0-0.328,0-0.763,0-1.434
		c1.622-1.622,1.12-1.12,3.108-3.108c0.11,0.361-0.024,0.478-0.06,0.691c-0.317,1.903,2.619,2.712,2.938,0.789
		c0.301-1.792,0.61-3.575,0.912-5.369C116.115,296.521,116.107,296.25,116.02,295.992z"/>
</g>
<g>
	<path d="M354.577,290.223c-5.57-2.396-12.034-1.088-16.395,3.059c-4.358,4.145-5.642,10.814-3.427,16.345
		c2.228,5.556,7.615,9.156,13.545,9.392c8.397,0.335,15.277-6.784,15.39-15.002C363.611,298.039,360.096,292.598,354.577,290.223z
		 M350.559,316.479c-6.14,1.064-12.135-3.025-13.949-8.83c-1.875-5.992,1.226-12.343,6.739-15.058
		c5.603-2.759,12.531-0.522,15.902,4.569c1.348,2.036,1.994,4.427,2.025,6.853C361.194,310.275,356.699,315.41,350.559,316.479z"/>
	<g>
		<path d="M351,304.032c-0.022-0.001-0.046-0.026-0.069-0.026c-0.021,0-0.042,0-0.062,0c-0.535,0-1.103,0.504-1.103,1.048
			c0,1.318,0,2.508,0,3.842s1.903,1.334,1.903,0c0,0,0-0.666,0-1.54c1.171,1.1,2.243,2.2,3.331,3.301
			c0.896,0.908,2.321-0.499,1.424-1.406c-1.058-1.071-2.1-2.142-3.158-3.213c0.517-0.003,1.04-0.005,1.552-0.008
			c1.266-0.006,1.284-2.009,0.016-2.002C353.569,304.033,352.269,304.026,351,304.032z"/>
		<path d="M347.59,305.238c0.001-0.022,0.025-0.045,0.025-0.069c0-0.02,0-0.042,0-0.062c0-0.536-0.504-1.103-1.048-1.103
			c-1.317,0-2.509,0-3.843,0c-1.333,0-1.333,1.903,0,1.903c0,0,0.667,0,1.541,0c-1.1,1.171-2.2,2.244-3.302,3.332
			c-0.907,0.896,0.499,2.321,1.406,1.424c1.07-1.059,2.142-2.1,3.213-3.158c0.004,0.516,0.005,1.04,0.009,1.551
			c0.005,1.267,2.007,1.284,2.001,0.017C347.588,307.808,347.595,306.507,347.59,305.238z"/>
		<path d="M347.625,302.334c0.015,0.017,0.013,0.05,0.029,0.067c0.015,0.015,0.029,0.029,0.045,0.044
			c0.378,0.378,1.135,0.422,1.52,0.038c0.933-0.933,1.773-1.773,2.718-2.718c0.943-0.943-0.403-2.289-1.348-1.346
			c0,0-0.472,0.472-1.089,1.089c-0.051-1.605-0.03-3.143-0.021-4.689c0.008-1.276-1.993-1.289-2-0.014
			c-0.012,1.506-0.03,2.999-0.039,4.505c-0.367-0.361-0.739-0.731-1.104-1.091c-0.898-0.891-2.328,0.512-1.427,1.405
			C345.809,300.517,346.724,301.441,347.625,302.334z"/>
	</g>
</g>
<g>
	<path d="M255.691,298.142c-2.398,5.57-1.088,12.034,3.059,16.396c4.143,4.358,10.814,5.642,16.346,3.427
		c5.553-2.227,9.154-7.615,9.392-13.546c0.334-8.397-6.783-15.278-15.005-15.389C263.507,289.109,258.066,292.623,255.691,298.142z
		 M269.482,291.442c6.262,0.083,11.396,4.575,12.465,10.718c1.068,6.14-3.025,12.135-8.828,13.951
		c-5.994,1.875-12.344-1.228-15.059-6.74c-2.759-5.604-0.521-12.531,4.569-15.903C264.665,292.119,267.057,291.475,269.482,291.442z
		"/>
	<path d="M272.918,295.992c-0.118-0.441-0.413-0.774-0.824-0.948c-0.307-0.159-0.652-0.205-1.005-0.109
		c-1.848,0.249-3.694,0.5-5.539,0.75c-1.929,0.262-1.183,3.127,0.718,2.867c0.322-0.041,0.737,0.007,0.922-0.176
		c-2.2,2.199-1.563,1.562-3.697,3.697c-0.358,0.357-0.49,0.762-0.465,1.143c0,0.014-0.004,0.026-0.004,0.04c0,3.019,0,2.075,0,5.106
		l0,0c0,0.411,0,0.964,0,1.968c0,2.01,3.017,2.01,3.017,0c0-3.019,0-2.075,0-5.106h-0.001c0-0.328,0-0.763,0-1.434
		c1.622-1.622,1.12-1.12,3.107-3.108c0.111,0.361-0.024,0.478-0.06,0.691c-0.317,1.903,2.619,2.712,2.938,0.789
		c0.302-1.792,0.61-3.575,0.912-5.369C273.014,296.521,273.006,296.25,272.918,295.992z"/>
	<path d="M272.396,305.51c-2.076,0-3.761,1.687-3.761,3.765s1.685,3.764,3.761,3.764s3.761-1.686,3.761-3.764
		C276.156,307.195,274.472,305.51,272.396,305.51z M274.547,307.985l-0.713,1.134l-0.525,0.837l-0.712,1.133
		c-0.144,0.228-0.438,0.297-0.669,0.162c-0.004-0.002-0.007-0.004-0.012-0.006h-0.001c0,0,0-0.001-0.001-0.001
		c-0.055-0.028-0.104-0.065-0.146-0.114l-0.879-1.011l-0.416-0.478l-0.182-0.206c-0.18-0.204-0.157-0.517,0.048-0.695
		c0.206-0.18,0.519-0.156,0.696,0.048l0.183,0.206l0.416,0.477l0.472,0.544l0.367-0.585l0.524-0.836l0.713-1.134
		c0.146-0.23,0.449-0.301,0.681-0.155C274.621,307.449,274.691,307.754,274.547,307.985z"/>
</g>
<path d="M116.697,183.793c-5.57-2.397-12.034-1.088-16.395,3.058c-4.359,4.146-5.642,10.814-3.427,16.346
	c2.227,5.556,7.615,9.156,13.545,9.392c8.397,0.334,15.277-6.784,15.39-15.002C125.73,191.61,122.216,186.168,116.697,183.793z
	 M112.678,210.049c-6.14,1.065-12.135-3.024-13.95-8.829c-1.875-5.992,1.226-12.342,6.74-15.058
	c5.603-2.759,12.531-0.523,15.902,4.569c1.348,2.034,1.994,4.427,2.024,6.853C123.312,203.845,118.818,208.979,112.678,210.049z"/>
<g>
	<path d="M186.575,202.181c0.032,1.536,2.044,2.885,3.446,1.47c1.535-1.552,3.08-3.104,4.617-4.653
		c0.771-0.778,0.78-2.067,0.004-2.843c-1.535-1.537-3.088-3.073-4.625-4.609c-1.41-1.41-3.422-0.059-3.447,1.476L186.575,202.181z"
		/>
	<g>
		<path d="M203.898,203.487c2.397-5.571,1.088-12.036-3.059-16.396c-4.145-4.356-10.814-5.641-16.346-3.426
			c-5.555,2.227-9.155,7.615-9.391,13.546c-0.336,8.396,6.784,15.278,15,15.388C196.082,212.517,201.523,209.005,203.898,203.487z
			 M177.643,199.466c-1.067-6.139,3.022-12.134,8.829-13.95c5.99-1.876,12.341,1.228,15.058,6.741
			c2.759,5.603,0.522,12.531-4.57,15.902c-2.035,1.348-4.427,1.993-6.854,2.023C183.845,210.102,178.709,205.608,177.643,199.466z"
			/>
	</g>
</g>
<g>
	<path d="M274.964,183.794c-5.569-2.396-12.034-1.088-16.394,3.059c-4.359,4.145-5.643,10.813-3.428,16.345
		c2.228,5.556,7.615,9.155,13.545,9.392c8.397,0.334,15.277-6.784,15.39-15.002C283.997,191.61,280.482,186.169,274.964,183.794z
		 M270.946,210.05c-6.14,1.065-12.136-3.024-13.95-8.829c-1.875-5.991,1.227-12.342,6.74-15.058
		c5.602-2.759,12.531-0.523,15.901,4.568c1.349,2.035,1.994,4.428,2.025,6.854C281.58,203.846,277.086,208.979,270.946,210.05z"/>
	<path d="M264.131,191.891c-0.787,0-1.58,0.347-2.137,1.01l-0.205,0.206c-2.069,2.677-1.184,7.041,1.784,10.009l0.12,0.12
		c1.867,1.869,4.291,2.914,6.498,2.914c1.299,0,2.521-0.361,3.513-1.129l0.203-0.207c1.159-0.969,1.349-2.66,0.424-3.783
		c-0.507-0.614-1.243-0.931-1.995-0.931c-0.62,0-1.251,0.214-1.773,0.65c-0.389,0.325-0.666,0.732-0.832,1.17l-0.166,0.813
		c-1.01-0.623-2.013-1.457-2.963-2.407l-0.119-0.12c-0.95-0.95-1.781-1.95-2.404-2.959l0.812-0.167
		c0.438-0.166,0.844-0.444,1.168-0.834c0.965-1.159,0.844-2.844-0.279-3.771C265.3,192.082,264.717,191.891,264.131,191.891
		L264.131,191.891z"/>
	<path d="M276.288,197.816c-0.095,0-0.19-0.014-0.286-0.042c-0.529-0.158-0.83-0.715-0.672-1.244
		c0.423-1.417,0.024-2.958-1.041-4.022c-1.057-1.059-2.588-1.461-3.99-1.049c-0.533,0.154-1.086-0.149-1.241-0.679
		s0.149-1.085,0.679-1.241c2.109-0.616,4.394-0.021,5.967,1.555c1.586,1.584,2.177,3.887,1.543,6.009
		C277.116,197.535,276.719,197.816,276.288,197.816z"/>
	<path d="M273.371,197.739c-0.095,0-0.191-0.014-0.287-0.042c-0.529-0.159-0.829-0.716-0.671-1.245
		c0.172-0.575,0.009-1.202-0.427-1.636c-0.432-0.432-1.05-0.597-1.623-0.43c-0.531,0.156-1.085-0.15-1.24-0.68
		c-0.154-0.53,0.149-1.085,0.68-1.24c1.271-0.372,2.649-0.013,3.599,0.936c0.956,0.955,1.312,2.344,0.928,3.625
		C274.199,197.458,273.802,197.739,273.371,197.739z"/>
</g>
<g>
	<path d="M342.517,183.658c-5.634,2.244-9.277,7.739-9.43,13.754c-0.152,6.013,3.658,11.636,9.135,13.979
		c5.502,2.354,11.858,1.09,16.219-2.937c6.175-5.702,6.006-15.601,0.272-21.489C354.432,182.797,348.099,181.435,342.517,183.658z
		 M358.241,205.065c-3.588,5.095-10.721,6.44-16.107,3.621c-5.562-2.912-7.859-9.595-5.882-15.414
		c2.011-5.912,8.491-9.231,14.476-8.015c2.394,0.486,4.541,1.72,6.278,3.413C361.374,193.159,361.827,199.967,358.241,205.065z"/>
	<path d="M353.211,203.831c0.024,0,0.047,0.025,0.07,0.025c0.021,0,0.041,0,0.062,0c0.536,0,1.103-0.504,1.103-1.048
		c0.001-1.317,0-2.508,0-3.842c0-1.333-1.902-1.333-1.903,0c0,0,0,0.667,0,1.541c-1.171-1.1-2.242-2.201-3.331-3.302
		c-0.897-0.907-2.321,0.499-1.424,1.406c1.059,1.07,2.1,2.142,3.158,3.213c-0.517,0.004-1.039,0.005-1.55,0.008
		c-1.268,0.006-1.284,2.008-0.018,2.002C350.644,203.829,351.945,203.835,353.211,203.831z"/>
	<path d="M342.471,192.063c-2.966,2.966-3.854,7.332-1.782,10.008l0.207,0.203c0.97,1.158,2.661,1.349,3.784,0.423
		c0.064-0.054,0.125-0.108,0.184-0.166c0.948-0.949,1.008-2.511,0.096-3.604c-0.324-0.388-0.731-0.666-1.17-0.832l-0.812-0.166
		c0.623-1.01,1.456-2.012,2.405-2.962l0.121-0.12c0.005-0.004,0.008-0.008,0.012-0.012c0.945-0.945,1.941-1.771,2.947-2.393
		l0.166,0.812c0.166,0.438,0.446,0.844,0.835,1.167c1.093,0.911,2.652,0.854,3.604-0.096c0.058-0.059,0.112-0.119,0.166-0.184
		c0.924-1.121,0.733-2.812-0.422-3.783l-0.207-0.205c-2.676-2.069-7.039-1.186-10.006,1.781c-0.001,0-0.002,0.002-0.003,0.002
		l-0.121,0.12C342.473,192.062,342.472,192.062,342.471,192.063L342.471,192.063z"/>
</g>
<g enable-background="new    ">
	<path d="M99.802,218.828h1.758c1.302,0,1.953,0.586,1.953,1.758s-0.651,1.758-1.953,1.758h-0.977v1.953h-0.781V218.828z
		 M100.583,219.609v1.953h0.977c0.781,0,1.172-0.325,1.172-0.977s-0.391-0.977-1.172-0.977H100.583z"/>
	<path d="M105.583,218.828h0.938l1.68,5.469h-0.859l-0.336-1.172h-1.906l-0.336,1.172h-0.859L105.583,218.828z M106.052,219.805
		l-0.73,2.539h1.457L106.052,219.805z"/>
	<path d="M108.591,218.828h0.781v3.516c0,0.781,0.365,1.172,1.094,1.172c0.703,0,1.055-0.391,1.055-1.172v-3.516h0.781v3.516
		c0,1.302-0.612,1.953-1.836,1.953c-1.25,0-1.875-0.651-1.875-1.953V218.828z"/>
	<path d="M116.138,219.789c-0.31-0.12-0.668-0.18-1.074-0.18c-0.729,0-1.094,0.261-1.094,0.781c0,0.391,0.299,0.651,0.898,0.781
		c1.094,0.13,1.641,0.651,1.641,1.562c0,1.042-0.612,1.562-1.836,1.562c-0.651,0-1.181-0.086-1.59-0.258l0.203-0.75
		c0.18,0.06,0.384,0.109,0.613,0.148s0.487,0.065,0.773,0.078c0.703,0,1.055-0.261,1.055-0.781c0-0.394-0.287-0.653-0.859-0.781
		c-1.12-0.128-1.68-0.648-1.68-1.562c0-1.042,0.625-1.562,1.875-1.562c0.495,0,0.913,0.079,1.254,0.238L116.138,219.789z"/>
	<path d="M117.29,218.828h3.125v0.781h-2.344v1.562h2.148v0.781h-2.148v1.562h2.344v0.781h-3.125V218.828z"/>
</g>
<g enable-background="new    ">
	<path d="M182.242,218.828H184c1.302,0,1.953,0.586,1.953,1.758s-0.651,1.758-1.953,1.758h-0.977v1.953h-0.781V218.828z
		 M183.023,219.609v1.953H184c0.781,0,1.172-0.325,1.172-0.977s-0.391-0.977-1.172-0.977H183.023z"/>
	<path d="M186.734,218.828h0.781v4.688h2.344v0.781h-3.125V218.828z"/>
	<path d="M191.75,218.828h0.938l1.68,5.469h-0.859l-0.336-1.172h-1.906l-0.336,1.172h-0.859L191.75,218.828z M192.219,219.805
		l-0.73,2.539h1.457L192.219,219.805z"/>
	<path d="M194.367,218.828h0.898l1.055,2.227l1.055-2.227h0.898l-1.562,3.125v2.344h-0.781v-2.344L194.367,218.828z"/>
</g>
<g enable-background="new    ">
	<path d="M248.674,218.827h1.758c1.432,0,2.148,0.911,2.148,2.734s-0.717,2.734-2.148,2.734h-1.758V218.827z M249.455,219.608v3.906
		h0.977c0.912,0,1.367-0.651,1.367-1.953s-0.455-1.953-1.367-1.953H249.455z"/>
	<path d="M253.361,218.827h3.125v0.781h-2.344v1.562h2.148v0.781h-2.148v1.562h2.344v0.781h-3.125V218.827z M254.768,217.069h0.859
		l-0.469,1.172h-0.586L254.768,217.069z"/>
	<path d="M260.725,219.792c-0.338-0.122-0.775-0.184-1.309-0.184c-0.912,0-1.367,0.651-1.367,1.953s0.455,1.953,1.367,1.953
		c0.537,0,0.975-0.062,1.312-0.184l0.242,0.688c-0.455,0.185-0.975,0.277-1.555,0.277c-1.432,0-2.148-0.911-2.148-2.734
		s0.717-2.734,2.148-2.734c0.592,0,1.111,0.094,1.562,0.281L260.725,219.792z"/>
	<path d="M261.564,218.827h1.758c1.303,0,1.953,0.586,1.953,1.758c0,0.886-0.377,1.445-1.133,1.68l1.133,2.031h-0.898l-1.055-1.953
		h-0.977v1.953h-0.781V218.827z M262.346,219.608v1.953h0.977c0.781,0,1.172-0.325,1.172-0.977s-0.391-0.977-1.172-0.977H262.346z"
		/>
	<path d="M266.057,221.562c0-1.823,0.717-2.734,2.148-2.734s2.148,0.911,2.148,2.734s-0.717,2.734-2.148,2.734
		S266.057,223.385,266.057,221.562z M268.205,219.608c-0.912,0-1.367,0.651-1.367,1.953s0.455,1.953,1.367,1.953
		s1.367-0.651,1.367-1.953S269.117,219.608,268.205,219.608z"/>
	<path d="M274.592,219.792c-0.338-0.122-0.775-0.184-1.309-0.184c-0.912,0-1.367,0.651-1.367,1.953s0.455,1.953,1.367,1.953
		c0.537,0,0.975-0.062,1.312-0.184l0.242,0.688c-0.455,0.185-0.975,0.277-1.555,0.277c-1.432,0-2.148-0.911-2.148-2.734
		s0.717-2.734,2.148-2.734c0.592,0,1.111,0.094,1.562,0.281L274.592,219.792z"/>
	<path d="M275.432,218.827h0.781v2.344h2.148v-2.344h0.781v5.469h-0.781v-2.344h-2.148v2.344h-0.781V218.827z"/>
	<path d="M279.924,218.827h3.125v0.781h-2.344v1.562h2.148v0.781h-2.148v1.562h2.344v0.781h-3.125V218.827z"/>
	<path d="M283.83,218.827h1.758c1.303,0,1.953,0.586,1.953,1.758c0,0.886-0.377,1.445-1.133,1.68l1.133,2.031h-0.898l-1.055-1.953
		h-0.977v1.953h-0.781V218.827z M284.611,219.608v1.953h0.977c0.781,0,1.172-0.325,1.172-0.977s-0.391-0.977-1.172-0.977H284.611z"
		/>
</g>
<g enable-background="new    ">
	<path d="M326.383,218.827h1.758c1.303,0,1.953,0.586,1.953,1.758c0,0.886-0.377,1.445-1.133,1.68l1.133,2.031h-0.898l-1.055-1.953
		h-0.977v1.953h-0.781V218.827z M327.164,219.608v1.953h0.977c0.781,0,1.172-0.325,1.172-0.977s-0.391-0.977-1.172-0.977H327.164z"
		/>
	<path d="M332.164,218.827h0.938l1.68,5.469h-0.859l-0.336-1.172h-1.906l-0.336,1.172h-0.859L332.164,218.827z M332.633,219.804
		l-0.73,2.539h1.457L332.633,219.804z"/>
	<path d="M338.629,219.792c-0.338-0.122-0.775-0.184-1.309-0.184c-0.912,0-1.367,0.651-1.367,1.953s0.455,1.953,1.367,1.953
		c0.537,0,0.975-0.062,1.312-0.184l0.242,0.688c-0.455,0.185-0.975,0.277-1.555,0.277c-1.432,0-2.148-0.911-2.148-2.734
		s0.717-2.734,2.148-2.734c0.592,0,1.111,0.094,1.562,0.281L338.629,219.792z"/>
	<path d="M342.926,219.792c-0.338-0.122-0.775-0.184-1.309-0.184c-0.912,0-1.367,0.651-1.367,1.953s0.455,1.953,1.367,1.953
		c0.537,0,0.975-0.062,1.312-0.184l0.242,0.688c-0.455,0.185-0.975,0.277-1.555,0.277c-1.432,0-2.148-0.911-2.148-2.734
		s0.717-2.734,2.148-2.734c0.592,0,1.111,0.094,1.562,0.281L342.926,219.792z"/>
	<path d="M343.766,218.827h1.758c1.303,0,1.953,0.586,1.953,1.758c0,0.886-0.377,1.445-1.133,1.68l1.133,2.031h-0.898l-1.055-1.953
		h-0.977v1.953h-0.781V218.827z M344.547,219.608v1.953h0.977c0.781,0,1.172-0.325,1.172-0.977s-0.391-0.977-1.172-0.977H344.547z"
		/>
	<path d="M348.258,221.562c0-1.823,0.717-2.734,2.148-2.734s2.148,0.911,2.148,2.734s-0.717,2.734-2.148,2.734
		S348.258,223.385,348.258,221.562z M350.406,219.608c-0.912,0-1.367,0.651-1.367,1.953s0.455,1.953,1.367,1.953
		s1.367-0.651,1.367-1.953S351.318,219.608,350.406,219.608z"/>
	<path d="M356.793,219.792c-0.338-0.122-0.775-0.184-1.309-0.184c-0.912,0-1.367,0.651-1.367,1.953s0.455,1.953,1.367,1.953
		c0.537,0,0.975-0.062,1.312-0.184l0.242,0.688c-0.455,0.185-0.975,0.277-1.555,0.277c-1.432,0-2.148-0.911-2.148-2.734
		s0.717-2.734,2.148-2.734c0.592,0,1.111,0.094,1.562,0.281L356.793,219.792z"/>
	<path d="M357.633,218.827h0.781v2.344h2.148v-2.344h0.781v5.469h-0.781v-2.344h-2.148v2.344h-0.781V218.827z"/>
	<path d="M362.125,218.827h3.125v0.781h-2.344v1.562h2.148v0.781h-2.148v1.562h2.344v0.781h-3.125V218.827z"/>
	<path d="M366.031,218.827h1.758c1.303,0,1.953,0.586,1.953,1.758c0,0.886-0.377,1.445-1.133,1.68l1.133,2.031h-0.898l-1.055-1.953
		h-0.977v1.953h-0.781V218.827z M366.812,219.608v1.953h0.977c0.781,0,1.172-0.325,1.172-0.977s-0.391-0.977-1.172-0.977H366.812z"
		/>
</g>
<g enable-background="new    ">
	<path d="M90.312,60.607h1.558v7.617h-1.558V60.607z"/>
	<path d="M98.083,62.402c-0.583-0.201-1.232-0.301-1.944-0.301c-1.092,0-1.638,0.771-1.638,2.314s0.546,2.314,1.638,2.314
		c0.709,0,1.359-0.1,1.95-0.301l0.494,1.327c-0.792,0.312-1.606,0.468-2.444,0.468c-2.13,0-3.196-1.27-3.196-3.809
		s1.065-3.809,3.196-3.809c0.856,0,1.676,0.158,2.46,0.473L98.083,62.402z"/>
	<path d="M99.389,64.416c0-2.539,1.065-3.809,3.196-3.809s3.196,1.27,3.196,3.809s-1.065,3.809-3.196,3.809
		S99.389,66.955,99.389,64.416z M102.584,62.102c-1.092,0-1.638,0.771-1.638,2.314s0.546,2.314,1.638,2.314s1.638-0.771,1.638-2.314
		S103.677,62.102,102.584,62.102z"/>
	<path d="M106.854,60.607h1.456l2.573,4.399v-4.399h1.558v7.617h-1.456l-2.573-4.399v4.399h-1.558V60.607z"/>
	<path d="M113.515,60.607h4.78v1.494h-3.223v1.568h2.954v1.492h-2.954v1.568h3.223v1.494h-4.78V60.607z"/>
	<path d="M119.777,66.365c0.645,0.212,1.335,0.334,2.073,0.365c0.802,0,1.203-0.261,1.203-0.783c0-0.387-0.326-0.648-0.978-0.785
		c-1.676-0.186-2.514-0.945-2.514-2.277c0-1.518,0.94-2.277,2.82-2.277c0.706,0,1.375,0.141,2.009,0.42l-0.365,1.38
		c-0.577-0.204-1.125-0.306-1.644-0.306c-0.841,0-1.262,0.261-1.262,0.783c0,0.384,0.344,0.645,1.031,0.785
		c1.64,0.189,2.46,0.948,2.46,2.277c0,1.518-0.922,2.277-2.766,2.277c-0.927,0-1.753-0.146-2.476-0.436L119.777,66.365z"/>
	<path d="M128.65,60.607h1.783l1.294,2.605l1.305-2.605h1.778l-2.003,3.809l2.003,3.809h-1.778l-1.305-2.605l-1.294,2.605h-1.783
		l2.009-3.809L128.65,60.607z"/>
	<path d="M135.885,60.607h1.558v7.617h-1.558V60.607z"/>
	<path d="M137.98,60.607h1.692l1.59,5.27l1.595-5.27h1.692l-2.465,7.617h-1.644L137.98,60.607z"/>
	<path d="M144.962,64.416c0-2.539,1.065-3.809,3.196-3.809s3.196,1.27,3.196,3.809s-1.065,3.809-3.196,3.809
		S144.962,66.955,144.962,64.416z M148.158,62.102c-1.092,0-1.638,0.771-1.638,2.314s0.546,2.314,1.638,2.314
		s1.638-0.771,1.638-2.314S149.25,62.102,148.158,62.102z"/>
</g>
<g enable-background="new    ">
	<path d="M93.622,73.293c-0.338-0.122-0.775-0.184-1.309-0.184c-0.912,0-1.367,0.651-1.367,1.953s0.456,1.953,1.367,1.953
		c0.537,0,0.974-0.062,1.312-0.184l0.242,0.688c-0.456,0.185-0.974,0.277-1.555,0.277c-1.432,0-2.148-0.911-2.148-2.734
		s0.716-2.734,2.148-2.734c0.591,0,1.112,0.094,1.562,0.281L93.622,73.293z"/>
	<path d="M94.462,75.062c0-1.823,0.716-2.734,2.148-2.734s2.148,0.911,2.148,2.734s-0.716,2.734-2.148,2.734
		S94.462,76.886,94.462,75.062z M96.61,73.109c-0.912,0-1.367,0.651-1.367,1.953s0.456,1.953,1.367,1.953s1.367-0.651,1.367-1.953
		S97.522,73.109,96.61,73.109z"/>
	<path d="M99.54,72.328h1.25l1.289,4.297l1.289-4.297h1.25v5.469h-0.781V73.5l-1.289,4.297h-0.938l-1.289-4.297v4.297H99.54V72.328z
		"/>
	<path d="M105.399,72.328h1.758c1.302,0,1.953,0.586,1.953,1.758s-0.651,1.758-1.953,1.758h-0.977v1.953h-0.781V72.328z
		 M106.181,73.109v1.953h0.977c0.781,0,1.172-0.325,1.172-0.977s-0.391-0.977-1.172-0.977H106.181z"/>
	<path d="M109.892,72.328h0.781v4.688h2.344v0.781h-3.125V72.328z"/>
	<path d="M113.618,72.328h3.125v0.781h-2.344v1.562h2.148v0.781h-2.148v1.562h2.344v0.781h-3.125V72.328z M115.024,70.57h0.859
		l-0.469,1.172h-0.586L115.024,70.57z"/>
	<path d="M117.524,72.328h1.25l1.289,4.297l1.289-4.297h1.25v5.469h-0.781V73.5l-1.289,4.297h-0.938l-1.289-4.297v4.297h-0.781
		V72.328z"/>
	<path d="M123.384,72.328h3.125v0.781h-2.344v1.562h2.148v0.781h-2.148v1.562h2.344v0.781h-3.125V72.328z"/>
	<path d="M127.29,72.328h0.781l2.148,3.867v-3.867h0.781v5.469h-0.781l-2.148-3.867v3.867h-0.781V72.328z"/>
	<path d="M131.782,72.328h3.516v0.781h-1.367v4.688h-0.781v-4.688h-1.367V72.328z"/>
	<path d="M140.767,74.672h2.344v0.781h-2.344V74.672z"/>
	<path d="M146.235,72.328h1.25l1.289,4.297l1.289-4.297h1.25v5.469h-0.781V73.5l-1.289,4.297h-0.938l-1.289-4.297v4.297h-0.781
		V72.328z"/>
	<path d="M153.384,72.328h0.938l1.68,5.469h-0.859l-0.336-1.172h-1.906l-0.336,1.172h-0.859L153.384,72.328z M153.853,73.305
		l-0.73,2.539h1.457L153.853,73.305z"/>
	<path d="M156.392,72.328h1.758c1.302,0,1.953,0.586,1.953,1.758c0,0.886-0.377,1.445-1.133,1.68l1.133,2.031h-0.898l-1.055-1.953
		h-0.977v1.953h-0.781V72.328z M157.173,73.109v1.953h0.977c0.781,0,1.172-0.325,1.172-0.977s-0.391-0.977-1.172-0.977H157.173z"/>
	<path d="M163.938,73.289c-0.31-0.12-0.668-0.18-1.074-0.18c-0.729,0-1.094,0.261-1.094,0.781c0,0.391,0.299,0.651,0.898,0.781
		c1.094,0.13,1.641,0.651,1.641,1.562c0,1.042-0.612,1.562-1.836,1.562c-0.651,0-1.181-0.086-1.59-0.258l0.203-0.75
		c0.18,0.06,0.384,0.109,0.613,0.148s0.487,0.065,0.773,0.078c0.703,0,1.055-0.261,1.055-0.781c0-0.394-0.287-0.653-0.859-0.781
		c-1.12-0.128-1.68-0.648-1.68-1.562c0-1.042,0.625-1.562,1.875-1.562c0.495,0,0.913,0.079,1.254,0.238L163.938,73.289z"/>
	<path d="M167.435,72.566c0.419-0.159,0.902-0.238,1.449-0.238c1.12,0,1.68,0.521,1.68,1.562c0,0.653-0.391,1.2-1.172,1.641
		c-0.781,0.442-1.172,0.938-1.172,1.484h2.344v0.781h-3.125v-0.781c0-0.831,0.391-1.456,1.172-1.875
		c0.781-0.417,1.172-0.833,1.172-1.25c0-0.521-0.299-0.781-0.898-0.781c-0.458,0-0.869,0.06-1.23,0.18L167.435,72.566z"/>
	<path d="M171.345,75.062c0-1.823,0.651-2.734,1.953-2.734s1.953,0.911,1.953,2.734s-0.651,2.734-1.953,2.734
		S171.345,76.886,171.345,75.062z M173.298,73.109c-0.781,0-1.172,0.651-1.172,1.953s0.391,1.953,1.172,1.953
		s1.172-0.651,1.172-1.953S174.079,73.109,173.298,73.109z"/>
	<path d="M176.423,72.523l0.781-0.195v5.469h-0.781V72.523z"/>
	<path d="M178.376,72.328h3.203v0.781h-2.305l-0.039,1.562c0.26-0.261,0.586-0.391,0.977-0.391c1.042,0,1.562,0.573,1.562,1.719
		c0,1.198-0.651,1.797-1.953,1.797c-0.537,0-1.018-0.065-1.445-0.195l0.273-0.781c0.268,0.13,0.659,0.195,1.172,0.195
		c0.781,0,1.172-0.339,1.172-1.016c0-0.625-0.26-0.938-0.781-0.938c-0.391,0-0.781,0.195-1.172,0.586l-0.664-0.195V72.328z"/>
</g>
<g enable-background="new    ">
	<path d="M93.526,325.862c-0.31-0.12-0.668-0.18-1.074-0.18c-0.729,0-1.094,0.261-1.094,0.781c0,0.391,0.299,0.651,0.898,0.781
		c1.094,0.13,1.641,0.651,1.641,1.562c0,1.042-0.612,1.562-1.836,1.562c-0.651,0-1.181-0.086-1.59-0.258l0.203-0.75
		c0.18,0.06,0.384,0.109,0.613,0.148s0.487,0.065,0.773,0.078c0.703,0,1.055-0.261,1.055-0.781c0-0.394-0.287-0.653-0.859-0.781
		c-1.12-0.128-1.68-0.648-1.68-1.562c0-1.042,0.625-1.562,1.875-1.562c0.495,0,0.913,0.079,1.254,0.238L93.526,325.862z"/>
	<path d="M94.679,324.901h0.781v3.516c0,0.781,0.365,1.172,1.094,1.172c0.703,0,1.055-0.391,1.055-1.172v-3.516h0.781v3.516
		c0,1.302-0.612,1.953-1.836,1.953c-1.25,0-1.875-0.651-1.875-1.953V324.901z"/>
	<path d="M99.171,324.901h1.758c1.302,0,1.953,0.586,1.953,1.758s-0.651,1.758-1.953,1.758h-0.977v1.953h-0.781V324.901z
		 M99.952,325.683v1.953h0.977c0.781,0,1.172-0.325,1.172-0.977s-0.391-0.977-1.172-0.977H99.952z"/>
	<path d="M103.663,324.901h3.125v0.781h-2.344v1.562h2.148v0.781h-2.148v1.562h2.344v0.781h-3.125V324.901z"/>
	<path d="M107.569,324.901h1.758c1.302,0,1.953,0.586,1.953,1.758c0,0.886-0.377,1.445-1.133,1.68l1.133,2.031h-0.898l-1.055-1.953
		h-0.977v1.953h-0.781V324.901z M108.351,325.683v1.953h0.977c0.781,0,1.172-0.325,1.172-0.977s-0.391-0.977-1.172-0.977H108.351z"
		/>
	<path d="M111.671,324.901h0.859l1.289,4.492l1.289-4.492h0.859l-1.68,5.469h-0.938L111.671,324.901z"/>
	<path d="M116.358,324.901h0.781v5.469h-0.781V324.901z"/>
	<path d="M120.976,325.862c-0.31-0.12-0.668-0.18-1.074-0.18c-0.729,0-1.094,0.261-1.094,0.781c0,0.391,0.299,0.651,0.898,0.781
		c1.094,0.13,1.641,0.651,1.641,1.562c0,1.042-0.612,1.562-1.836,1.562c-0.651,0-1.181-0.086-1.59-0.258l0.203-0.75
		c0.18,0.06,0.384,0.109,0.613,0.148s0.487,0.065,0.773,0.078c0.703,0,1.055-0.261,1.055-0.781c0-0.394-0.287-0.653-0.859-0.781
		c-1.12-0.128-1.68-0.648-1.68-1.562c0-1.042,0.625-1.562,1.875-1.562c0.495,0,0.913,0.079,1.254,0.238L120.976,325.862z"/>
	<path d="M122.128,324.901h3.125v0.781h-2.344v1.562h2.148v0.781h-2.148v1.562h2.344v0.781h-3.125V324.901z"/>
	<path d="M126.034,324.901h1.758c1.302,0,1.953,0.586,1.953,1.758c0,0.886-0.377,1.445-1.133,1.68l1.133,2.031h-0.898l-1.055-1.953
		h-0.977v1.953h-0.781V324.901z M126.815,325.683v1.953h0.977c0.781,0,1.172-0.325,1.172-0.977s-0.391-0.977-1.172-0.977H126.815z"
		/>
</g>
<g enable-background="new    ">
	<path d="M198.702,251.852h1.133v4.453h2.344v1.086h-3.477V251.852z"/>
	<path d="M202.812,251.852h3.477v1.086h-2.344v1.141h2.148v1.086h-2.148v1.141h2.344v1.086h-3.477V251.852z"/>
	<path d="M207.366,256.039c0.469,0.153,0.971,0.242,1.508,0.266c0.583,0,0.875-0.19,0.875-0.57c0-0.281-0.237-0.472-0.711-0.57
		c-1.219-0.136-1.828-0.688-1.828-1.656c0-1.104,0.684-1.656,2.051-1.656c0.513,0,1,0.102,1.461,0.305l-0.266,1.004
		c-0.419-0.148-0.818-0.223-1.195-0.223c-0.612,0-0.918,0.19-0.918,0.57c0,0.278,0.25,0.469,0.75,0.57
		c1.193,0.138,1.789,0.69,1.789,1.656c0,1.104-0.67,1.656-2.012,1.656c-0.674,0-1.275-0.105-1.801-0.316L207.366,256.039z"/>
	<path d="M213.819,251.852h3.867v1.086h-1.367v4.453h-1.133v-4.453h-1.367V251.852z"/>
	<path d="M218.468,251.852h1.934c1.419,0,2.129,0.613,2.129,1.84c0,0.927-0.349,1.493-1.047,1.699l1.176,2h-1.309l-1.055-1.855
		h-0.695v1.855h-1.133V251.852z M219.601,252.938v1.512h0.801c0.664,0,0.996-0.253,0.996-0.758c0-0.503-0.332-0.754-0.996-0.754
		H219.601z"/>
	<path d="M224.839,251.852h1.195l1.793,5.539h-1.23l-0.336-1.113h-1.645l-0.336,1.113h-1.23L224.839,251.852z M225.437,253.559
		l-0.496,1.633h0.992L225.437,253.559z"/>
	<path d="M228.128,251.852h1.059l1.871,3.199v-3.199h1.133v5.539h-1.059l-1.871-3.199v3.199h-1.133V251.852z"/>
	<path d="M233.269,256.039c0.469,0.153,0.972,0.242,1.508,0.266c0.583,0,0.875-0.19,0.875-0.57c0-0.281-0.237-0.472-0.711-0.57
		c-1.219-0.136-1.828-0.688-1.828-1.656c0-1.104,0.684-1.656,2.051-1.656c0.513,0,1,0.102,1.461,0.305l-0.266,1.004
		c-0.419-0.148-0.817-0.223-1.195-0.223c-0.612,0-0.918,0.19-0.918,0.57c0,0.278,0.25,0.469,0.75,0.57
		c1.192,0.138,1.789,0.69,1.789,1.656c0,1.104-0.671,1.656-2.012,1.656c-0.675,0-1.274-0.105-1.801-0.316L233.269,256.039z"/>
	<path d="M237.565,251.852h3.477v1.086h-2.344v1.141h2.148v1.086h-2.148v2.227h-1.133V251.852z"/>
	<path d="M241.823,251.852h3.477v1.086h-2.344v1.141h2.148v1.086h-2.148v1.141h2.344v1.086h-3.477V251.852z"/>
	<path d="M246.081,251.852h1.934c1.419,0,2.129,0.613,2.129,1.84c0,0.927-0.349,1.493-1.047,1.699l1.176,2h-1.309l-1.055-1.855
		h-0.695v1.855h-1.133V251.852z M247.214,252.938v1.512h0.801c0.664,0,0.996-0.253,0.996-0.758c0-0.503-0.332-0.754-0.996-0.754
		H247.214z"/>
	<path d="M251.054,251.852h3.867v1.086h-1.367v4.453h-1.133v-4.453h-1.367V251.852z"/>
	<path d="M255.999,256.039c0.469,0.153,0.972,0.242,1.508,0.266c0.583,0,0.875-0.19,0.875-0.57c0-0.281-0.237-0.472-0.711-0.57
		c-1.219-0.136-1.828-0.688-1.828-1.656c0-1.104,0.684-1.656,2.051-1.656c0.513,0,1,0.102,1.461,0.305l-0.266,1.004
		c-0.419-0.148-0.817-0.223-1.195-0.223c-0.612,0-0.918,0.19-0.918,0.57c0,0.278,0.25,0.469,0.75,0.57
		c1.192,0.138,1.789,0.69,1.789,1.656c0,1.104-0.671,1.656-2.012,1.656c-0.675,0-1.274-0.105-1.801-0.316L255.999,256.039z"/>
</g>
<g enable-background="new    ">
	<path d="M176.793,324.901h0.938l1.68,5.469h-0.859l-0.336-1.172h-1.906l-0.336,1.172h-0.859L176.793,324.901z M177.262,325.878
		l-0.73,2.539h1.457L177.262,325.878z"/>
	<path d="M179.801,324.901h0.781l2.148,3.867v-3.867h0.781v5.469h-0.781l-2.148-3.867v3.867h-0.781V324.901z"/>
	<path d="M184.293,324.901h0.781l2.148,3.867v-3.867h0.781v5.469h-0.781l-2.148-3.867v3.867h-0.781V324.901z"/>
	<path d="M188.785,324.901h0.781v3.516c0,0.781,0.365,1.172,1.094,1.172c0.703,0,1.055-0.391,1.055-1.172v-3.516h0.781v3.516
		c0,1.302-0.612,1.953-1.836,1.953c-1.25,0-1.875-0.651-1.875-1.953V324.901z"/>
	<path d="M193.277,324.901h0.781v4.688h2.344v0.781h-3.125V324.901z"/>
	<path d="M197.004,324.901h3.125v0.781h-2.344v1.562h2.148v0.781h-2.148v1.562h2.344v0.781h-3.125V324.901z"/>
	<path d="M200.91,324.901h1.758c1.302,0,1.953,0.586,1.953,1.758c0,0.886-0.377,1.445-1.133,1.68l1.133,2.031h-0.898l-1.055-1.953
		h-0.977v1.953h-0.781V324.901z M201.691,325.683v1.953h0.977c0.781,0,1.172-0.325,1.172-0.977s-0.391-0.977-1.172-0.977H201.691z"
		/>
</g>
<g enable-background="new    ">
	<path d="M252.586,325.866c-0.338-0.122-0.775-0.184-1.309-0.184c-0.912,0-1.367,0.651-1.367,1.953s0.455,1.953,1.367,1.953
		c0.537,0,0.975-0.062,1.312-0.184l0.242,0.688c-0.455,0.185-0.975,0.277-1.555,0.277c-1.432,0-2.148-0.911-2.148-2.734
		s0.717-2.734,2.148-2.734c0.592,0,1.111,0.094,1.562,0.281L252.586,325.866z"/>
	<path d="M253.426,327.636c0-1.823,0.717-2.734,2.148-2.734s2.148,0.911,2.148,2.734s-0.717,2.734-2.148,2.734
		S253.426,329.459,253.426,327.636z M255.574,325.683c-0.912,0-1.367,0.651-1.367,1.953s0.455,1.953,1.367,1.953
		s1.367-0.651,1.367-1.953S256.486,325.683,255.574,325.683z"/>
	<path d="M258.504,324.901h1.25l1.289,4.297l1.289-4.297h1.25v5.469h-0.781v-4.297l-1.289,4.297h-0.938l-1.289-4.297v4.297h-0.781
		V324.901z"/>
	<path d="M264.363,324.901h1.758c1.303,0,1.953,0.586,1.953,1.758s-0.65,1.758-1.953,1.758h-0.977v1.953h-0.781V324.901z
		 M265.145,325.683v1.953h0.977c0.781,0,1.172-0.325,1.172-0.977s-0.391-0.977-1.172-0.977H265.145z"/>
	<path d="M268.855,324.901h0.781v4.688h2.344v0.781h-3.125V324.901z"/>
	<path d="M272.582,324.901h3.125v0.781h-2.344v1.562h2.148v0.781h-2.148v1.562h2.344v0.781h-3.125V324.901z M273.988,323.144h0.859
		l-0.469,1.172h-0.586L273.988,323.144z"/>
	<path d="M276.488,324.901h3.516v0.781h-1.367v4.688h-0.781v-4.688h-1.367V324.901z"/>
	<path d="M280.785,324.901h3.125v0.781h-2.344v1.562h2.148v0.781h-2.148v1.562h2.344v0.781h-3.125V324.901z"/>
	<path d="M284.691,324.901h1.758c1.303,0,1.953,0.586,1.953,1.758c0,0.886-0.377,1.445-1.133,1.68l1.133,2.031h-0.898l-1.055-1.953
		h-0.977v1.953h-0.781V324.901z M285.473,325.683v1.953h0.977c0.781,0,1.172-0.325,1.172-0.977s-0.391-0.977-1.172-0.977H285.473z"
		/>
</g>
<g enable-background="new    ">
	<path d="M329.953,325.866c-0.338-0.122-0.775-0.184-1.309-0.184c-0.912,0-1.367,0.651-1.367,1.953s0.455,1.953,1.367,1.953
		c0.537,0,0.975-0.062,1.312-0.184l0.242,0.688c-0.455,0.185-0.975,0.277-1.555,0.277c-1.432,0-2.148-0.911-2.148-2.734
		s0.717-2.734,2.148-2.734c0.592,0,1.111,0.094,1.562,0.281L329.953,325.866z"/>
	<path d="M330.793,327.636c0-1.823,0.717-2.734,2.148-2.734s2.148,0.911,2.148,2.734s-0.717,2.734-2.148,2.734
		S330.793,329.459,330.793,327.636z M332.941,325.683c-0.912,0-1.367,0.651-1.367,1.953s0.455,1.953,1.367,1.953
		s1.367-0.651,1.367-1.953S333.854,325.683,332.941,325.683z"/>
	<path d="M335.871,324.901h0.781l2.148,3.867v-3.867h0.781v5.469h-0.781l-2.148-3.867v3.867h-0.781V324.901z"/>
	<path d="M340.363,324.901h3.125v0.781h-2.344v1.562h2.148v0.781h-2.148v2.344h-0.781V324.901z"/>
	<path d="M344.27,324.901h3.125v0.781h-2.344v1.562h2.148v0.781h-2.148v1.562h2.344v0.781h-3.125V324.901z M345.676,323.144h0.859
		l-0.469,1.172h-0.586L345.676,323.144z"/>
	<path d="M348.176,324.901h1.758c1.303,0,1.953,0.586,1.953,1.758c0,0.886-0.377,1.445-1.133,1.68l1.133,2.031h-0.898l-1.055-1.953
		h-0.977v1.953h-0.781V324.901z M348.957,325.683v1.953h0.977c0.781,0,1.172-0.325,1.172-0.977s-0.391-0.977-1.172-0.977H348.957z"
		/>
	<path d="M352.668,324.901h3.125v0.781h-2.344v1.562h2.148v0.781h-2.148v1.562h2.344v0.781h-3.125V324.901z"/>
	<path d="M356.574,324.901h0.781l2.148,3.867v-3.867h0.781v5.469h-0.781l-2.148-3.867v3.867h-0.781V324.901z"/>
	<path d="M364.523,325.866c-0.338-0.122-0.775-0.184-1.309-0.184c-0.912,0-1.367,0.651-1.367,1.953s0.455,1.953,1.367,1.953
		c0.537,0,0.975-0.062,1.312-0.184l0.242,0.688c-0.455,0.185-0.975,0.277-1.555,0.277c-1.432,0-2.148-0.911-2.148-2.734
		s0.717-2.734,2.148-2.734c0.592,0,1.111,0.094,1.562,0.281L364.523,325.866z"/>
	<path d="M365.363,324.901h3.125v0.781h-2.344v1.562h2.148v0.781h-2.148v1.562h2.344v0.781h-3.125V324.901z"/>
</g>
<rect x="90.834" y="262.787" width="278" height="0.5"/>
<path d="M116.844,190.826c0-0.257-0.068-0.507-0.208-0.743c-0.268-0.491-0.765-0.79-1.304-0.79c-0.091,0-0.184,0.009-0.275,0.026
	l-8.038,1.589c-0.213,0.041-0.414,0.129-0.597,0.264c-0.43,0.287-0.678,0.749-0.678,1.247v7.903c-0.004,0-0.008-0.001-0.012-0.001
	c-1.666,0-3.016,0.942-3.016,2.106c0,1.163,1.351,2.107,3.016,2.107s3.015-0.944,3.015-2.107c0-0.036-0.013-0.069-0.015-0.104
	l0.015-0.135v-8.561l5.094-1.008v6.106c-0.013,0-0.026-0.003-0.039-0.003c-1.666,0-3.016,0.943-3.016,2.107
	c0,1.163,1.351,2.106,3.016,2.106s3.015-0.943,3.015-2.106c0-0.018-0.006-0.032-0.006-0.048c0.008-0.064,0.033-0.123,0.033-0.189
	V190.826z"/>
<g>
	<g>
		<path d="M96.977,419.674l-1.744-2.693l1.623-2.422c0.304-0.453,0.468-0.817,0.471-1.129v-0.001v-0.01V413.4h-0.001
			c-0.005-0.202-0.094-0.39-0.248-0.531c-0.16-0.155-0.379-0.232-0.619-0.233c-0.005,0-0.008,0-0.009,0
			c-0.133,0-0.259,0.023-0.369,0.073c-0.109,0.048-0.209,0.121-0.293,0.216c-0.08,0.088-0.161,0.196-0.243,0.325
			c-0.079,0.123-0.174,0.271-0.287,0.444l-1.24,1.873l-1.154-1.874c-0.238-0.386-0.421-0.651-0.569-0.809
			c-0.161-0.174-0.395-0.256-0.658-0.255c-0.001,0-0.002,0-0.002,0c-0.237-0.001-0.453,0.077-0.621,0.229
			c-0.167,0.145-0.266,0.334-0.266,0.536v0.005v0.004l0,0c0.001,0.179,0.044,0.361,0.123,0.546c0.081,0.181,0.195,0.392,0.349,0.635
			l1.544,2.391l-1.849,2.69l0.116,0.08l-0.116-0.08c-0.289,0.425-0.446,0.794-0.448,1.126v0.001
			c-0.001,0.265,0.077,0.498,0.25,0.657c0.161,0.152,0.377,0.229,0.612,0.229h0.001h0.001h0.016h0.001
			c0.143-0.001,0.272-0.024,0.388-0.072c0.116-0.05,0.22-0.118,0.307-0.203c0.079-0.079,0.147-0.161,0.206-0.247
			c0.053-0.078,0.14-0.213,0.265-0.408l1.468-2.232l1.373,2.167c0.19,0.291,0.32,0.486,0.391,0.59
			c0.08,0.116,0.187,0.215,0.313,0.291c0.139,0.084,0.302,0.122,0.482,0.122h0.003c0.17,0,0.329-0.038,0.469-0.113
			c0.143-0.077,0.255-0.186,0.333-0.319c0.078-0.132,0.118-0.282,0.118-0.439c0-0.168-0.042-0.34-0.121-0.515
			C97.261,420.127,97.14,419.921,96.977,419.674z"/>
		<path d="M99.108,414.986L99.108,414.986c-0.001,0-0.002,0-0.002,0c-0.263-0.002-0.498,0.095-0.665,0.281
			c-0.177,0.193-0.255,0.467-0.255,0.8l-0.006,4.516v0.001v0.003c-0.002,0.329,0.076,0.604,0.251,0.802
			c0.166,0.196,0.403,0.3,0.668,0.297h0.058l0.002-0.002c0.24-0.012,0.455-0.108,0.616-0.284c0.183-0.197,0.265-0.478,0.265-0.813
			l0.007-4.565l0,0v-0.003v-0.004l0,0c-0.001-0.301-0.086-0.56-0.265-0.747C99.608,415.082,99.37,414.985,99.108,414.986z"/>
		<path d="M99.762,412.937c-0.181-0.149-0.398-0.229-0.635-0.229l0,0c-0.243-0.001-0.47,0.086-0.651,0.251
			c-0.187,0.166-0.287,0.396-0.288,0.648c0,0.003,0,0.005,0,0.007v0.001h0.001h-0.001c-0.001,0.273,0.092,0.516,0.284,0.679
			c0.177,0.156,0.402,0.237,0.65,0.237l0,0h0.001h0.002h0.033h0.002c0.229-0.007,0.438-0.088,0.607-0.24
			c0.188-0.164,0.282-0.402,0.281-0.674l0,0v-0.001c0-0.004,0-0.008,0-0.014v-0.002l0,0
			C100.047,413.329,99.951,413.094,99.762,412.937z"/>
		<path d="M108.256,413.866c0.025-0.107,0.038-0.21,0.038-0.308v-0.002v-0.024v-0.002c-0.005-0.141-0.049-0.278-0.125-0.409
			c-0.083-0.144-0.202-0.259-0.346-0.343c-0.146-0.085-0.307-0.129-0.475-0.129h-0.002h-0.001h-0.003
			c-0.221,0-0.413,0.052-0.561,0.173c-0.131,0.104-0.229,0.229-0.289,0.37c-0.054,0.125-0.129,0.336-0.23,0.639l-1.801,5.33
			l-1.779-5.294c-0.129-0.399-0.257-0.695-0.391-0.895c-0.151-0.227-0.419-0.333-0.736-0.332h-0.001
			c-0.271-0.001-0.515,0.097-0.695,0.285c-0.18,0.18-0.279,0.4-0.278,0.636c0,0.002,0,0.003,0,0.004
			c0,0.091,0.014,0.193,0.039,0.311c0.028,0.119,0.061,0.228,0.1,0.331c0.035,0.095,0.069,0.192,0.106,0.292l2.012,5.499
			c0.071,0.212,0.146,0.414,0.219,0.604c0.076,0.198,0.165,0.375,0.27,0.532c0.111,0.168,0.259,0.304,0.437,0.405
			c0.186,0.104,0.407,0.154,0.656,0.154h0.003h0.002l0,0h0.004l0,0c0.245,0,0.465-0.051,0.649-0.157
			c0.176-0.103,0.322-0.235,0.431-0.398c0.104-0.153,0.192-0.332,0.27-0.53c0.074-0.193,0.147-0.396,0.223-0.608l2.06-5.536
			c0.034-0.102,0.07-0.198,0.104-0.294C108.2,414.072,108.231,413.97,108.256,413.866z"/>
		<path d="M116.247,414.794c-0.333-0.681-0.832-1.212-1.485-1.583c-0.654-0.371-1.435-0.554-2.33-0.555h-0.012
			c-0.659,0-1.253,0.103-1.779,0.311c-0.526,0.209-0.979,0.513-1.348,0.909c-0.37,0.396-0.651,0.878-0.844,1.438
			c-0.194,0.56-0.289,1.174-0.291,1.838c-0.001,0.008,0,0.011-0.001,0.012c0,0.645,0.092,1.249,0.272,1.809
			c0.186,0.564,0.459,1.053,0.822,1.457c0.366,0.407,0.821,0.723,1.363,0.943c0.544,0.223,1.154,0.333,1.836,0.334
			c0.007,0,0.009,0,0.009,0c0.677,0,1.284-0.106,1.819-0.319c0.535-0.216,0.99-0.527,1.359-0.938
			c0.369-0.408,0.646-0.891,0.828-1.444c0.184-0.551,0.275-1.162,0.276-1.831v-0.009l-0.001-0.002
			C116.744,416.265,116.581,415.473,116.247,414.794z M114.408,418.794c-0.21,0.439-0.484,0.753-0.826,0.957
			c-0.346,0.206-0.725,0.31-1.139,0.31h-0.002c-0.325,0-0.619-0.062-0.889-0.182c-0.269-0.118-0.504-0.296-0.715-0.539
			c-0.206-0.239-0.369-0.544-0.486-0.919c-0.113-0.373-0.174-0.792-0.174-1.261l0,0v-0.001l0.001-0.004
			c0-0.467,0.062-0.885,0.177-1.251c0.119-0.371,0.276-0.667,0.473-0.896c0.197-0.231,0.431-0.406,0.703-0.526
			c0.271-0.12,0.568-0.182,0.891-0.182l0,0c0.467,0.002,0.863,0.112,1.21,0.331s0.613,0.537,0.806,0.972
			c0.188,0.433,0.285,0.949,0.285,1.553c0,0.004,0,0.008,0.002,0.009C114.723,417.818,114.615,418.362,114.408,418.794z
			 M114.864,417.16L114.864,417.16L114.864,417.16L114.864,417.16z M112.428,412.795L112.428,412.795L112.428,412.795
			L112.428,412.795z"/>
		<polygon points="118.129,412.62 117.938,413.347 117.748,412.62 117.414,412.619 117.412,413.673 117.613,413.673 
			117.615,412.833 117.839,413.673 118.031,413.674 118.261,412.834 118.259,413.674 118.464,413.674 118.465,412.621 		"/>
		<polygon points="116.43,412.803 116.757,412.803 116.755,413.673 116.969,413.673 116.971,412.803 117.287,412.804 
			117.287,412.619 116.432,412.618 		"/>
	</g>
	<g>
		<path fill="#222221" d="M117.002,431.161H91.928c-0.812,0-1.472-0.659-1.472-1.472c0-0.813,0.659-1.473,1.472-1.473h25.074
			c0.812,0,1.473,0.659,1.473,1.473C118.475,430.502,117.814,431.161,117.002,431.161z"/>
		<path fill="#222221" d="M117.002,406.104H91.928c-0.812,0-1.472-0.658-1.472-1.472c0-0.812,0.659-1.472,1.472-1.472h25.074
			c0.812,0,1.473,0.659,1.473,1.472C118.475,405.446,117.814,406.104,117.002,406.104z"/>
	</g>
</g>
</svg>
