<?xml version="1.0" encoding="UTF-8" standalone="no"?>
<!-- Created with Inkscape (http://www.inkscape.org/) -->

<svg
   xmlns:dc="http://purl.org/dc/elements/1.1/"
   xmlns:cc="http://creativecommons.org/ns#"
   xmlns:rdf="http://www.w3.org/1999/02/22-rdf-syntax-ns#"
   xmlns:svg="http://www.w3.org/2000/svg"
   xmlns="http://www.w3.org/2000/svg"
   xmlns:sodipodi="http://sodipodi.sourceforge.net/DTD/sodipodi-0.dtd"
   xmlns:inkscape="http://www.inkscape.org/namespaces/inkscape"
   width="60"
   height="60"
   id="svg3410"
   version="1.1"
   inkscape:version="0.91 r13725"
   sodipodi:docname="man-face.svg">
  <defs
     id="defs3412" />
  <sodipodi:namedview
     id="base"
     pagecolor="#ffffff"
     bordercolor="#666666"
     borderopacity="1.0"
     inkscape:pageopacity="0.0"
     inkscape:pageshadow="2"
     inkscape:zoom="7"
     inkscape:cx="-11.234489"
     inkscape:cy="12.461369"
     inkscape:current-layer="layer3"
     showgrid="true"
     inkscape:grid-bbox="true"
     inkscape:document-units="px"
     inkscape:window-width="1920"
     inkscape:window-height="1056"
     inkscape:window-x="1600"
     inkscape:window-y="24"
     inkscape:window-maximized="1"
     fit-margin-top="0"
     fit-margin-left="0"
     fit-margin-right="0"
     fit-margin-bottom="0" />
  <metadata
     id="metadata3415">
    <rdf:RDF>
      <cc:Work
         rdf:about="">
        <dc:format>image/svg+xml</dc:format>
        <dc:type
           rdf:resource="http://purl.org/dc/dcmitype/StillImage" />
        <dc:title></dc:title>
      </cc:Work>
    </rdf:RDF>
  </metadata>
  <g
     id="layer1"
     inkscape:label="Layer 1"
     inkscape:groupmode="layer"
     style="display:none"
     transform="translate(-2.902143e-7,12)">
    <path
       id="path2988"
       d="M 33.417945,1.9115869 C 24.503756,-1.9259988 14.162401,0.16999337 7.1889662,6.8043687 0.2139313,13.433944 -1.8388201,24.106705 1.705096,32.956272 c 0.062399,0.155199 0.1375967,0.302399 0.2031952,0.455998 1.560763,-1.175996 3.4967172,-1.880793 5.6014674,-1.880793 1.4423658,0 2.8015334,0.335999 4.0199044,0.919997 1.959154,-2.143193 4.443895,-3.815986 7.19343,-4.752783 -3.518317,-1.931993 -6.096656,-5.44558 -5.862261,-9.774364 0.319992,-5.915978 4.967082,-11.725556 11.37973,-11.3831573 6.132655,0.3311988 10.59015,4.5295833 11.298133,10.4871613 0.0608,0.272799 0.0968,0.565598 0.0784,0.896796 0.0184,0.333599 -0.0408,0.629598 -0.106397,0.907197 -0.470389,3.666386 -2.599939,7.174373 -5.712665,9.053566 5.098279,1.762394 9.140583,5.663179 10.707746,10.85916 -3.339121,3.719186 -7.923012,6.339177 -13.201287,7.257573 -3.919907,0.681598 -7.803015,0.1632 -11.318132,-1.248795 -0.237594,0.516798 -0.526388,1.004796 -0.84958,1.466394 2.591939,1.034397 5.378273,1.647194 8.243805,1.761594 C 36.816265,48.517814 47.824004,37.127456 48,23.977905 47.867203,14.41634 42.250536,5.7099728 33.417945,1.9115869 Z"
       inkscape:connector-curvature="0"
       style="fill:#a9a28a" />
  </g>
  <g
     inkscape:groupmode="layer"
     id="layer2"
     inkscape:label="nohole"
     style="display:inline"
     transform="translate(-2.902143e-7,12)" />
  <g
     inkscape:groupmode="layer"
     id="layer3"
     inkscape:label="man"
     transform="translate(-2.902143e-7,12)">
    <g
       id="g4802"
       transform="matrix(1.25,0,0,1.25,0,-12)">
      <ellipse
         transform="matrix(2.2325581,0,0,3.0684931,-17.222589,-28.273974)"
         id="path3466"
         style="display:inline;fill:#a9a28a;fill-opacity:1;fill-rule:nonzero;stroke:none"
         cx="18.464285"
         cy="17.035715"
         rx="10.75"
         ry="7.8214288" />
      <ellipse
         transform="matrix(1.1962963,0,0,1.2607004,-7.2669312,-3.7998889)"
         id="path4239"
         style="fill:#ffffff;fill-opacity:1;fill-rule:nonzero;stroke:none"
         cx="26.285715"
         cy="17.178572"
         rx="9.6428576"
         ry="9.1785717" />
      <path
         id="path4239-2"
         d="m 24.4375,26.46875 c -7.813779,0 -14.374461,5.320206 -16.34375,12.53125 4.003381,4.29838 9.725214,7 16.0625,7 6.586757,0 12.480365,-2.90239 16.5,-7.5 C 38.528646,31.539427 32.073734,26.46875 24.4375,26.46875 Z"
         style="fill:#ffffff;fill-opacity:1;fill-rule:nonzero;stroke:none"
         inkscape:connector-curvature="0" />
    </g>
  </g>
</svg>
