<?xml version="1.0" encoding="UTF-8" standalone="no"?>
<svg
   xmlns:dc="http://purl.org/dc/elements/1.1/"
   xmlns:cc="http://creativecommons.org/ns#"
   xmlns:rdf="http://www.w3.org/1999/02/22-rdf-syntax-ns#"
   xmlns:svg="http://www.w3.org/2000/svg"
   xmlns="http://www.w3.org/2000/svg"
   xmlns:sodipodi="http://sodipodi.sourceforge.net/DTD/sodipodi-0.dtd"
   xmlns:inkscape="http://www.inkscape.org/namespaces/inkscape"
   xml:space="preserve"
   version="1.0"
   viewBox="0 0 14.4 17.6"
   enable-background="new -0.5 -0.5 9 9"
   class="phone-state-icon"
   id="svg5992"
   inkscape:version="0.91 r13725"
   sodipodi:docname="phone_status.svg"
   width="14.4"
   height="17.6"><metadata
     id="metadata6000"><rdf:RDF><cc:Work
         rdf:about=""><dc:format>image/svg+xml</dc:format><dc:type
           rdf:resource="http://purl.org/dc/dcmitype/StillImage" /><dc:title></dc:title></cc:Work></rdf:RDF></metadata><defs
     id="defs5998" /><sodipodi:namedview
     pagecolor="#ffffff"
     bordercolor="#666666"
     borderopacity="1"
     objecttolerance="10"
     gridtolerance="10"
     guidetolerance="10"
     inkscape:pageopacity="0"
     inkscape:pageshadow="2"
     inkscape:window-width="1920"
     inkscape:window-height="1056"
     id="namedview5996"
     showgrid="false"
     fit-margin-top="0"
     fit-margin-left="0"
     fit-margin-right="0"
     fit-margin-bottom="0"
     inkscape:zoom="4.4607206"
     inkscape:cx="-6.1522258"
     inkscape:cy="-22.159849"
     inkscape:window-x="1600"
     inkscape:window-y="24"
     inkscape:window-maximized="1"
     inkscape:current-layer="svg5992" /><path
     class="fill-status{{contact.status}}"
     d="m 12.208696,5.134376 c 0,0.941512 -0.212872,1.744936 -0.688696,2.56092 C 11.106784,8.423392 10.580872,8.975752 9.892176,9.427672 12.045912,10.256208 13.723824,12.0388 14.4,14.27332 12.621912,16.30696 10.017392,17.6 7.099824,17.6 4.29496,17.6 1.765568,16.40744 0,14.499288 0.626088,12.214552 2.266432,10.369184 4.407656,9.49044 3.668872,9.02596 3.130432,8.461056 2.692176,7.695296 2.216344,6.879312 2.00348,6.075888 2.00348,5.134376 2.00348,4.180312 2.216344,3.38944 2.692176,2.560912 3.15548,1.744936 3.744,1.15492 4.557912,0.69044 5.371824,0.213408 6.160696,0 7.099824,0 c 0.939136,0 1.74052,0.213408 2.55444,0.69044 0.813912,0.46448 1.402432,1.054496 1.865736,1.870472 0.475824,0.828528 0.688696,1.6194 0.688696,2.573464 z"
     id="path5994"
     inkscape:connector-curvature="0"
     style="fill:#444444" /></svg>