Datum,consumption
30.03.23,48.185
31.03.23,38.181
01.04.23,22.806
02.04.23,20.562
03.04.23,26.579
04.04.23,26.456
05.04.23,31.251
06.04.23,43.256
07.04.23,42.754
08.04.23,42.01
09.04.23,18.153
10.04.23,50.521
11.04.23,39.812
12.04.23,32.025
13.04.23,27.258
14.04.23,46.301
15.04.23,15.259
16.04.23,51.478
17.04.23,46.082
18.04.23,28.536
19.04.23,47.203
20.04.23,37.155
21.04.23,28.223
22.04.23,13.143
23.04.23,0.122
24.04.23,24.843
25.04.23,26.375
26.04.23,26.505
27.04.23,28.809
28.04.23,22.981
29.04.23,20.692
30.04.23,21.355
01.05.23,18.503
02.05.23,20.776
03.05.23,15.063
04.05.23,7.877
05.05.23,7.877
06.05.23,11.281
07.05.23,7.131
08.05.23,8.629
09.05.23,7.877
10.05.23,7.389
11.05.23,7.592
12.05.23,7.044
13.05.23,14.129
14.05.23,17.534
15.05.23,17.396
16.05.23,19.577
17.05.23,22.576
18.05.23,23.106
19.05.23,14.746
20.05.23,11.352
21.05.23,8.222
22.05.23,7.749
23.05.23,9.002
24.05.23,6.405
25.05.23,5.601
26.05.23,10.279
27.05.23,5.917
28.05.23,7.568
29.05.23,7.769
30.05.23,5.723
31.05.23,4.758
01.06.23,6.357
02.06.23,6.425
03.06.23,6.346
04.06.23,5.812
05.06.23,7.27
06.06.23,5.512
07.06.23,5.433
08.06.23,9.253
09.06.23,5.622
10.06.23,5.583
11.06.23,5.561
12.06.23,7.539
13.06.23,5.861
14.06.23,5.697
15.06.23,5.899
16.06.23,6.377
17.06.23,8.432
18.06.23,12.035
19.06.23,8.427
20.06.23,9.621
21.06.23,5.18
22.06.23,5.715
23.06.23,4.492
24.06.23,5.003
25.06.23,6.151
26.06.23,5.535
27.06.23,5.266
28.06.23,6.019
29.06.23,6.268
30.06.23,11.104
01.07.23,5.654
02.07.23,5.555
03.07.23,5.972
04.07.23,5.122
05.07.23,6.053
06.07.23,5.215
07.07.23,7.308
08.07.23,5.484
09.07.23,4.417
10.07.23,5.953
11.07.23,4.53
12.07.23,4.11
13.07.23,4.267
14.07.23,8.083
15.07.23,4.208
16.07.23,5.091
17.07.23,3.805
18.07.23,3.391
19.07.23,2.977
20.07.23,3.053
21.07.23,3.536
22.07.23,3.955
23.07.23,8.156
24.07.23,7.956
25.07.23,3.365
26.07.23,4.353
27.07.23,4.596
28.07.23,6.103
29.07.23,4.465
30.07.23,8.989
31.07.23,6.552
01.08.23,4.296
02.08.23,4.519
03.08.23,4.843
04.08.23,4.839
05.08.23,5.905
06.08.23,4.991
07.08.23,3.862
08.08.23,4.457
09.08.23,4.285
10.08.23,4.481
11.08.23,4.274
12.08.23,4.27
13.08.23,4.218
14.08.23,3.977
15.08.23,3.693
16.08.23,3.353
17.08.23,3.339
18.08.23,3.313
19.08.23,3.348
20.08.23,1.791
21.08.23,1.587
22.08.23,3.123
23.08.23,3.047
24.08.23,3.055
25.08.23,3.04
26.08.23,2.951
27.08.23,2.972
28.08.23,3.083
29.08.23,3.207
30.08.23,3.471
31.08.23,3.639
01.09.23,3.731
02.09.23,3.757
03.09.23,3.563
04.09.23,3.719
05.09.23,1.85
06.09.23,3.753
07.09.23,3.811
08.09.23,3.766
09.09.23,3.771
10.09.23,3.745
11.09.23,3.738
12.09.23,3.214
13.09.23,3.398
14.09.23,5.519
15.09.23,5.687
16.09.23,4.726
17.09.23,4.468
18.09.23,0.073
19.09.23,6.517
20.09.23,11.153
21.09.23,0.4
22.09.23,10.705
23.09.23,6.999
24.09.23,3.709
25.09.23,9.143
26.09.23,4.667
27.09.23,8.491
28.09.23,0.076
29.09.23,4.325
30.09.23,4.276
01.10.23,4.342
02.10.23,4.345
03.10.23,12.371
04.10.23,15.729
05.10.23,11.217
06.10.23,10.177
07.10.23,15.711
08.10.23,8.293
09.10.23,17.537
10.10.23,14.749
11.10.23,9.065
12.10.23,17.625
13.10.23,8.796
14.10.23,7.625
15.10.23,55.751
16.10.23,23.001
17.10.23,35.552
18.10.23,45.485
19.10.23,43.765
20.10.23,41.699
21.10.23,39.949
22.10.23,26.864
23.10.23,29.04
24.10.23,34.767
25.10.23,33.298
26.10.23,11.776
27.10.23,34.131
28.10.23,36.067
29.10.23,83.863
30.10.23,20.55
31.10.23,40.388
01.11.23,48.135
02.11.23,38.905
03.11.23,54.228
04.11.23,72.486
05.11.23,54.458
06.11.23,36.075
07.11.23,38.97
08.11.23,57.648
09.11.23,38.455
10.11.23,52.692
11.11.23,52.196
12.11.23,63.342
13.11.23,75.477
14.11.23,42.717
15.11.23,51.034
16.11.23,47.875
17.11.23,43.276
18.11.23,68.548
19.11.23,79.196
20.11.23,56.419
21.11.23,54.909
22.11.23,64.33
23.11.23,62.054
24.11.23,59.087
25.11.23,75.284
26.11.23,70.791
27.11.23,71.198
28.11.23,56.38
29.11.23,73.344
30.11.23,64.509
01.12.23,78.828
02.12.23,95.203
03.12.23,86.892
04.12.23,58.384
05.12.23,71.739
06.12.23,76.798
07.12.23,72.717
08.12.23,80.189
09.12.23,69.465
10.12.23,79.087
11.12.23,75.546
12.12.23,59.039
13.12.23,48.121
14.12.23,55.283
15.12.23,67.407
16.12.23,65.771
17.12.23,76.427
18.12.23,49.128
19.12.23,53.45
20.12.23,62.524
21.12.23,80.994
22.12.23,78.128
23.12.23,95.25
24.12.23,88.018
25.12.23,65.682
26.12.23,62.232
27.12.23,55.59
28.12.23,78.649
29.12.23,79.325
30.12.23,59.338
31.12.23,79.436
01.01.24,69.496
02.01.24,66.403
03.01.24,57.279
04.01.24,38.466
05.01.24,44.153
06.01.24,53.383
07.01.24,65.779
08.01.24,76.666
09.01.24,113.514
10.01.24,98.292
11.01.24,80.492
12.01.24,81.698
13.01.24,92.555
14.01.24,100.764
15.01.24,82.841
16.01.24,65.75
17.01.24,84.916
18.01.24,71.273
19.01.24,92.783
20.01.24,92.345
21.01.24,98.819
22.01.24,78.649
23.01.24,64.773
24.01.24,64.436
25.01.24,49.936
26.01.24,62.755
27.01.24,72.367
28.01.24,60.742
29.01.24,55.569
30.01.24,72.082
31.01.24,89.19
01.02.24,79.508
02.02.24,50.074
03.02.24,67.259
04.02.24,76.519
05.02.24,50.108
06.02.24,52.827
07.02.24,54.29
08.02.24,44.487
09.02.24,36.29
10.02.24,44.781
11.02.24,50.191
12.02.24,49.374
13.02.24,47.517
14.02.24,50.279
15.02.24,41.46
16.02.24,48.945
17.02.24,52.593
18.02.24,48.379
19.02.24,55.509
20.02.24,49.712
21.02.24,68.236
22.02.24,59.508
23.02.24,56.318
24.02.24,50.783
25.02.24,46.553
26.02.24,47.335
27.02.24,39.323
28.02.24,43.51
29.02.24,38.871
01.03.24,37.711
02.03.24,49.51
03.03.24,38.787
04.03.24,42.232
05.03.24,34.54
06.03.24,46.927
07.03.24,50.938
08.03.24,92.284
09.03.24,48.336
10.03.24,69.141
11.03.24,67.545
12.03.24,61.598
13.03.24,37.484
14.03.24,42.693
15.03.24,49.401
16.03.24,46.136
17.03.24,32.042
18.03.24,39.79
19.03.24,44.535
20.03.24,42.552
21.03.24,39.588
22.03.24,37.622
23.03.24,45.458
24.03.24,83.171
25.03.24,48.135
26.03.24,29.421
27.03.24,21.244
28.03.24,33.888
