region	Russia	Russia	Russia	Russia	Russia	Russia	Russia	China	China	China	China	China	China	China	Europe	Europe	Europe	Europe	Europe	Europe	Europe	Rest of Asia	Rest of Asia	Rest of Asia	Rest of Asia	Rest of Asia	Rest of Asia	Rest of Asia	Americas and Australia	Americas and Australia	Americas and Australia	Americas and Australia	Americas and Australia	Americas and Australia	Americas and Australia	Africa	Africa	Africa	Africa	Africa	Africa	Africa
category	Final consumption expenditure by households	Final consumption expenditure by non-profit organisations serving households (NPISH)	Final consumption expenditure by government	Gross fixed capital formation	Changes in inventories	Changes in valuables	Exports: Total (fob)	Final consumption expenditure by households	Final consumption expenditure by non-profit organisations serving households (NPISH)	Final consumption expenditure by government	Gross fixed capital formation	Changes in inventories	Changes in valuables	Exports: Total (fob)	Final consumption expenditure by households	Final consumption expenditure by non-profit organisations serving households (NPISH)	Final consumption expenditure by government	Gross fixed capital formation	Changes in inventories	Changes in valuables	Exports: Total (fob)	Final consumption expenditure by households	Final consumption expenditure by non-profit organisations serving households (NPISH)	Final consumption expenditure by government	Gross fixed capital formation	Changes in inventories	Changes in valuables	Exports: Total (fob)	Final consumption expenditure by households	Final consumption expenditure by non-profit organisations serving households (NPISH)	Final consumption expenditure by government	Gross fixed capital formation	Changes in inventories	Changes in valuables	Exports: Total (fob)	Final consumption expenditure by households	Final consumption expenditure by non-profit organisations serving households (NPISH)	Final consumption expenditure by government	Gross fixed capital formation	Changes in inventories	Changes in valuables	Exports: Total (fob)
impact																																										
Value Added	0	0	0	0	0	0	0	0	0	0	0	0	0	0	0	0	0	0	0	0	0	0	0	0	0	0	0	0	0	0	0	0	0	0	0	0	0	0	0	0	0	0
Employment	0	0	0	0	0	0	0	0	0	0	0	0	0	0	0	0	0	0	0	0	0	0	0	0	0	0	0	0	0	0	0	0	0	0	0	0	0	0	0	0	0	0
Employment hour	0	0	0	0	0	0	0	0	0	0	0	0	0	0	0	0	0	0	0	0	0	0	0	0	0	0	0	0	0	0	0	0	0	0	0	0	0	0	0	0	0	0
GHG emissions (GWP100) | Problem oriented approach: baseline (CML, 2001) | GWP100 (IPCC, 2007)	222185653058	11335976567.6	11372193646.5	0	0	0	0	739273189929	24905777243	30842753649.1	0	0	0	0	681855941254	33471153261.1	60602906224.6	0	0	0	0	1.32483745256e+12	103775538110	61179494635.4	0	0	0	0	1.70464136385e+12	28911736584.3	63299118019.4	0	0	0	0	414623830087	18872370.9635	842050173.83	0	0	0	0
Human toxicity (USEtox) | USEtox2008 | CTUh (Rosenbaum et al., 2008)	27648.677772	966.800162413	2689.66465879	0	0	0	0	33012.7606309	38.2692036847	54.2206713868	0	0	0	0	12663.7353654	141.066308094	261.153285256	0	0	0	0	45177.564019	3274.32364169	4623.55367709	0	0	0	0	23706.1813462	54.6443278783	667.461162667	0	0	0	0	24454.4121287	0.0466274000554	66.1354445754	0	0	0	0
Fresh water Ecotoxicity (USEtox) | USEtox2008 | CTUe (Rosenbaum et al., 2008)	19856050519.5	544792350.885	1469328660.7	0	0	0	0	23835057360.6	25470627.1306	33817244.5178	0	0	0	0	26498957862.8	77035135.1374	139673803.19	0	0	0	0	71593651344	1605267326.66	2406587794.14	0	0	0	0	71751533973.3	30716341.4494	371382651.088	0	0	0	0	24497973644.8	36618.6350447	54047642.1013	0	0	0	0
EPS | Damage Approach | EPS (Steen, 1999))	31351212811.6	1503320728.73	1776747764.77	0	0	0	0	209302748900	2830832973.36	3509942744.47	0	0	0	0	118983155311	3965929569.92	7096995135.84	0	0	0	0	422555195252	19286718572.7	22541234040.1	0	0	0	0	242235115363	3281333338.64	7138855512.28	0	0	0	0	222868521964	2355893.41381	652820948.776	0	0	0	0
Carcinogenic effects on humans (H.A) | ECOINDICATOR 99 (H.A) | Carcinogenic effects on humans (H.A)	5782.23299893	261.464691204	548.541463185	0	0	0	0	9729.26479915	10.8551685241	14.3063737795	0	0	0	0	10487.1530742	30.8808778578	53.7028088994	0	0	0	0	63922.8894863	678.928115942	1025.9609727	0	0	0	0	6487.1072936	11.6327664755	140.179775417	0	0	0	0	13557.5419388	0.0195606251887	27.0344436568	0	0	0	0
Respiratory effects on humans caused by organic substances (H.A) | ECOINDICATOR 99 (H.A) | Respiratory effects on humans caused by organic substances (H.A)	1415.81717241	1.78483855591	2.87023642973	0	0	0	0	5336.57705332	5.70718295414	7.26899033597	0	0	0	0	3805.79243022	12.6096965671	23.0738816993	0	0	0	0	20904.1786253	171.060640502	466.136554717	0	0	0	0	11734.3565204	2.4167596267	4.8275676835	0	0	0	0	12168.8395389	0.0196689223485	38.5054245837	0	0	0	0
Respiratory effects on humans caused by inorganic substances (H.A) | ECOINDICATOR 99 (H.A) | Respiratory effects on humans caused by inorganic substances (H.A)	3790894317.81	135956075.469	323432732.589	0	0	0	0	5547354337.01	5636279.02204	7468628.07319	0	0	0	0	5437579797.88	18362668.6945	33298974.5632	0	0	0	0	24284034423.7	415508663.718	611116048.852	0	0	0	0	8588818734.81	6657708.77909	80497532.0171	0	0	0	0	6042906983.21	9080.32346723	12265776.9761	0	0	0	0
Damages to human health caused by climate change (H.A) | ECOINDICATOR 99 (H.A) | Damages to human health caused by climate change (H.A)	46679.2207122	2381.49314176	2387.70841456	0	0	0	0	154014.789423	5167.60914556	6419.88808296	0	0	0	0	142925.742234	6993.61812576	12667.6738239	0	0	0	0	275464.509213	21740.1076097	12729.2215789	0	0	0	0	358282.989842	6066.1412109	13276.6124377	0	0	0	0	85134.5061431	3.95256604931	171.083049624	0	0	0	0
Damage to Ecosystem Quality caused by ecotoxic emissions (H.A) | ECOINDICATOR 99 (H.A) | Damage to Ecosystem Quality caused by ecotoxic emissions (H.A)	3790797971.58	135952162.209	323424654.041	0	0	0	0	5544307690.27	5633585.93522	7465235.40193	0	0	0	0	5436604637.47	18356011.2334	33288780.222	0	0	0	0	24277065901.3	415334902.894	610740125.239	0	0	0	0	8587812843.11	6656933.08495	80496062.0718	0	0	0	0	6038234875.94	9072.17826466	12250938.2529	0	0	0	0
Damage to Ecosystem Quality caused by the combined effect of acidification and eutrophication (H.A) | ECOINDICATOR 99 (H.A) | Damage to Ecosystem Quality caused by the combined effect of acidification and eutrophication (H.A)	5091516447.7	158832478.424	306267193.192	0	0	0	0	8884936308.97	78467351.2187	100040461.438	0	0	0	0	14692875851.6	152095573.978	292518297.834	0	0	0	0	21279131596.5	1063972303.59	770315874.247	0	0	0	0	31376967291.2	350303395.934	649813779.082	0	0	0	0	7939414306.19	27003.1433434	16627166.669	0	0	0	0
Carcinogenic effects on humans (E.E) | ECOINDICATOR 99 (E.E) | Carcinogenic effects on humans (E.E)	5782.23299893	261.464691204	548.541463185	0	0	0	0	9729.26479915	10.8551685241	14.3063737795	0	0	0	0	10487.1530742	30.8808778578	53.7028088994	0	0	0	0	63922.8894863	678.928115942	1025.9609727	0	0	0	0	6487.1072936	11.6327664755	140.179775417	0	0	0	0	13557.5419388	0.0195606251887	27.0344436568	0	0	0	0
Respiratory effects on humans caused by organic substances (E.E) | ECOINDICATOR 99 (E.E) | Respiratory effects on humans caused by organic substances (E.E)	100232.117407	4088.21933343	8420.78439075	0	0	0	0	3099232.085	2717.41975809	3423.05263433	0	0	0	0	989154.024786	6798.24725445	10438.8993763	0	0	0	0	7040787.12094	178599.371385	383570.795265	0	0	0	0	1023036.93355	780.142902238	1478.86897226	0	0	0	0	4719354.77451	8.22457169554	14986.972547	0	0	0	0
Respiratory effects on humans caused by inorganic substances (E.E) | ECOINDICATOR 99 (E.E) | Respiratory effects on humans caused by inorganic substances (E.E)	81227.6370356	2695.21238632	5178.91346865	0	0	0	0	224348.290732	1294.12489643	1661.84688857	0	0	0	0	244734.474634	2742.1366395	5029.424811	0	0	0	0	377746.614276	21480.7313924	19535.1128039	0	0	0	0	461105.107533	5551.41151464	10322.3819315	0	0	0	0	151690.450873	0.485698758745	343.986348145	0	0	0	0
Damages to human health caused by climate change (E.E) | ECOINDICATOR 99 (E.E) | Damages to human health caused by climate change (E.E)	46679.2207122	2381.49314176	2387.70841456	0	0	0	0	154014.789423	5167.60914556	6419.88808296	0	0	0	0	142925.742234	6993.61812576	12667.6738239	0	0	0	0	275464.509213	21740.1076097	12729.2215789	0	0	0	0	358282.989842	6066.1412109	13276.6124377	0	0	0	0	85134.5061431	3.95256604931	171.083049624	0	0	0	0
Damage to Ecosystem Quality caused by ecotoxic emissions (E.E)) | ECOINDICATOR 99 (E.E) | Damage to Ecosystem Quality caused by ecotoxic emissions (E.E))	3790797971.58	135952162.209	323424654.041	0	0	0	0	5544307690.27	5633585.93522	7465235.40193	0	0	0	0	5436604637.47	18356011.2334	33288780.222	0	0	0	0	24277065901.3	415334902.894	610740125.239	0	0	0	0	8587812843.11	6656933.08495	80496062.0718	0	0	0	0	6038234875.94	9072.17826466	12250938.2529	0	0	0	0
Damage to Ecosystem Quality caused by the combined effect of acidification and eutrophication (E.E) | ECOINDICATOR 99 (E.E) | Damage to Ecosystem Quality caused by the combined effect of acidification and eutrophication (E.E)	5091516447.7	158832478.424	306267193.192	0	0	0	0	8884936308.97	78467351.2187	100040461.438	0	0	0	0	14692875851.6	152095573.978	292518297.834	0	0	0	0	21279131596.5	1063972303.59	770315874.247	0	0	0	0	31376967291.2	350303395.934	649813779.082	0	0	0	0	7939414306.19	27003.1433434	16627166.669	0	0	0	0
Carcinogenic effects on humans (I.I) | ECOINDICATOR 99 (I.I) | Carcinogenic effects on humans (I.I)	764.077255932	43.2172520231	69.2214711971	0	0	0	0	960.657610185	0.95188392052	1.2800608278	0	0	0	0	2422.21547145	2.68097006144	5.14189290231	0	0	0	0	14612.7978414	72.1133748949	82.6754334807	0	0	0	0	1286.48141909	1.42806676998	17.7255282881	0	0	0	0	1694.5072436	0.00172065079264	0.966805186166	0	0	0	0
Respiratory effects on humans caused by organic substances (I.I) | ECOINDICATOR 99 (I.I) | Respiratory effects on humans caused by organic substances (I.I)	1316.40732966	1.66390022482	2.68165836598	0	0	0	0	4980.50295784	6.18668083469	7.56286764946	0	0	0	0	3543.91751349	12.2314213315	22.2981050618	0	0	0	0	19480.9132108	159.8931574	435.237881126	0	0	0	0	10915.0112329	2.3341061424	4.7435799192	0	0	0	0	11344.8978968	0.0184444967284	35.8937938682	0	0	0	0
Respiratory effects on humans caused by inorganic substances (I.I) | ECOINDICATOR 99 (I.I) | Respiratory effects on humans caused by inorganic substances (I.I)	77237.4347223	3234.52779457	6607.42375224	0	0	0	0	2335575.55173	2061.2792509	2610.95092544	0	0	0	0	744234.008337	5352.09080577	8141.69011518	0	0	0	0	5163601.25929	134899.212242	286066.558556	0	0	0	0	766545.227114	738.450229641	1417.86129502	0	0	0	0	3460792.67908	6.04944023936	10973.48565	0	0	0	0
Damages to human health caused by climate change (I.I) | ECOINDICATOR 99 (I.I) | Damages to human health caused by climate change (I.I)	44464.9141385	2268.4220277	2274.33980983	0	0	0	0	147045.145123	4937.10242299	6128.43417306	0	0	0	0	136249.414241	6669.73663617	12079.6649631	0	0	0	0	263281.949278	20721.7503612	12159.2263145	0	0	0	0	341466.38615	5778.9963305	12649.299898	0	0	0	0	81703.6285209	3.76727888535	164.841782987	0	0	0	0
Damage to Ecosystem Quality caused by ecotoxic emissions (I.I) | ECOINDICATOR 99 (I.I) | Damage to Ecosystem Quality caused by ecotoxic emissions (I.I)	756725780.226	26367507.2053	66561063.541	0	0	0	0	1028371888.06	1207907.02094	1597996.79135	0	0	0	0	856045197.468	3587053.64689	6426860.02616	0	0	0	0	3787061244.13	75811643.2757	115560955.676	0	0	0	0	1459376104.66	1392862.96239	16792158.3609	0	0	0	0	1159366074.39	1889.249506	2740903.53938	0	0	0	0
Damage to Ecosystem Quality caused by the combined effect of acidification and eutrophication (I.I) | ECOINDICATOR 99 (I.I) | Damage to Ecosystem Quality caused by the combined effect of acidification and eutrophication (I.I)	5091516447.7	158832478.424	306267193.192	0	0	0	0	8884936308.97	78467351.2187	100040461.438	0	0	0	0	14692875851.6	152095573.978	292518297.834	0	0	0	0	21279131596.5	1063972303.59	770315874.247	0	0	0	0	31376967291.2	350303395.934	649813779.082	0	0	0	0	7939414306.19	27003.1433434	16627166.669	0	0	0	0
Unused Domestic Extraction	0	0	0	0	0	0	0	0	0	0	0	0	0	0	0	0	0	0	0	0	0	0	0	0	0	0	0	0	0	0	0	0	0	0	0	0	0	0	0	0	0	0
Water Consumption Green - Agriculture	0	0	0	0	0	0	0	0	0	0	0	0	0	0	0	0	0	0	0	0	0	0	0	0	0	0	0	0	0	0	0	0	0	0	0	0	0	0	0	0	0	0
Water Consumption Blue - Agriculture	0	0	0	0	0	0	0	0	0	0	0	0	0	0	0	0	0	0	0	0	0	0	0	0	0	0	0	0	0	0	0	0	0	0	0	0	0	0	0	0	0	0
Water Consumption Blue - Livestock	0	0	0	0	0	0	0	0	0	0	0	0	0	0	0	0	0	0	0	0	0	0	0	0	0	0	0	0	0	0	0	0	0	0	0	0	0	0	0	0	0	0
Water Consumption Blue - Manufacturing	0	0	0	0	0	0	0	0	0	0	0	0	0	0	0	0	0	0	0	0	0	0	0	0	0	0	0	0	0	0	0	0	0	0	0	0	0	0	0	0	0	0
Water Consumption Blue - Electricity	0	0	0	0	0	0	0	0	0	0	0	0	0	0	0	0	0	0	0	0	0	0	0	0	0	0	0	0	0	0	0	0	0	0	0	0	0	0	0	0	0	0
Water Consumption Blue - Domestic	3464.49736025	0	0	0	0	0	0	11630.3515613	0	0	0	0	0	0	7108.12958544	0	0	0	0	0	0	42843.6205159	0	0	0	0	0	0	20128.8407684	0	0	0	0	0	0	3315.14290301	0	0	0	0	0	0
Water Consumption Blue - Total	3464.49736025	0	0	0	0	0	0	11630.3515613	0	0	0	0	0	0	7108.12958544	0	0	0	0	0	0	42843.6205159	0	0	0	0	0	0	20128.8407684	0	0	0	0	0	0	3315.14290301	0	0	0	0	0	0
Water Withdrawal Blue - Manufacturing	0	0	0	0	0	0	0	0	0	0	0	0	0	0	0	0	0	0	0	0	0	0	0	0	0	0	0	0	0	0	0	0	0	0	0	0	0	0	0	0	0	0
Water Withdrawal Blue - Electricity	0	0	0	0	0	0	0	0	0	0	0	0	0	0	0	0	0	0	0	0	0	0	0	0	0	0	0	0	0	0	0	0	0	0	0	0	0	0	0	0	0	0
Water Withdrawal Blue - Domestic	13857.9535948	0	0	0	0	0	0	113288.124479	0	0	0	0	0	0	49480.7631042	0	0	0	0	0	0	189390.285156	0	0	0	0	0	0	131876.887539	0	0	0	0	0	0	24357.8291864	0	0	0	0	0	0
Water Withdrawal Blue - Total	13857.9535948	0	0	0	0	0	0	113288.124479	0	0	0	0	0	0	49480.7631042	0	0	0	0	0	0	189390.285156	0	0	0	0	0	0	131876.887539	0	0	0	0	0	0	24357.8291864	0	0	0	0	0	0
Carbon dioxide (CO2) IPCC categories 1 to 4 and 6 to 7 (excl land use, land use change and forestry)	220489.241792	11267.7455723	11321.4979497	0	0	0	0	692741.350065	23041.0435836	29132.6726329	0	0	0	0	663129.489363	32357.4252659	58753.0558512	0	0	0	0	1200363.99635	101565.046897	56514.5669647	0	0	0	0	1659313.00968	28686.1250628	62667.5740896	0	0	0	0	332921.065481	18.5071330845	590.043143165	0	0	0	0
Methane (CH4) IPCC categories 1 to 4 and 6 to 7 (excl land use, land use change and forestry)	11.748082336	0.383036124315	1.11222144706	0	0	0	0	1609.5780318	74.0154774795	67.6452265953	0	0	0	0	480.660799983	42.7179877491	71.1433335682	0	0	0	0	3912.57521661	72.2872422737	157.693522063	0	0	0	0	481.231538162	7.33402747486	21.4664360043	0	0	0	0	2662.17545899	0.0133231497864	8.04890340059	0	0	0	0
Nitrous Oxide (N2O) IPCC categories 1 to 4 and 6 to 7 (excl land use, land use change and forestry)	4.70707787889	0.196829168641	0.0768126195652	0	0	0	0	21.1153995598	0.0481433636417	0.0635917831417	0	0	0	0	22.5165499741	0.153618461289	0.239151121501	0	0	0	0	89.4599858966	1.35338978801	2.42479737975	0	0	0	0	111.736797698	0.141814881486	0.318399428209	0	0	0	0	50.8334836589	0.000107916558251	0.170417602853	0	0	0	0
Carbon dioxide (CO2) CO2EQ IPCC categories 1 to 4 and 6 to 7 (excl land use, land use change and forestry)	220489.241792	11267.7455723	11321.4979497	0	0	0	0	692741.350065	23041.0435836	29132.6726329	0	0	0	0	663129.489363	32357.4252659	58753.0558512	0	0	0	0	1200363.99635	101565.046897	56514.5669647	0	0	0	0	1659313.00968	28686.1250628	62667.5740896	0	0	0	0	332921.065481	18.5071330845	590.043143165	0	0	0	0
Methane (CH4) CO2EQ IPCC categories 1 to 4 and 6 to 7 (excl land use, land use change and forestry)	293.702058401	9.57590310786	27.8055361765	0	0	0	0	40239.450795	1850.38693699	1691.13066488	0	0	0	0	12016.5199996	1067.94969373	1778.58333921	0	0	0	0	97814.3804152	1807.18105684	3942.33805157	0	0	0	0	12030.7884541	183.350686871	536.660900109	0	0	0	0	66554.386475	0.33307874466	201.222585015	0	0	0	0
Nitrous Oxide (N2O) CO2EQ IPCC categories 1 to 4 and 6 to 7 (excl land use, land use change and forestry)	1402.70920791	58.6550922551	22.8901606304	0	0	0	0	6292.38906882	14.3467223652	18.9503513762	0	0	0	0	6709.93189226	45.7783014641	71.2670342072	0	0	0	0	26659.0757971	403.310156826	722.589619165	0	0	0	0	33297.5657141	42.2608346829	94.8830296062	0	0	0	0	15148.3781303	0.0321591343589	50.78444565	0	0	0	0
Carbon dioxide (CO2) Fuel combustion and cement	220489.241792	11267.7455723	11321.4979497	0	0	0	0	692741.350065	23041.0435836	29132.6726329	0	0	0	0	663129.489363	32357.4252659	58753.0558512	0	0	0	0	1200363.99635	101565.046897	56514.5669647	0	0	0	0	1659313.00968	28686.1250628	62667.5740896	0	0	0	0	332921.065481	18.5071330845	590.043143165	0	0	0	0
Carbon dioxide (CO2) Fuel combustion	220489.241792	11267.7455723	11321.4979497	0	0	0	0	692741.350065	23041.0435836	29132.6726329	0	0	0	0	663129.489363	32357.4252659	58753.0558512	0	0	0	0	1200363.99635	101565.046897	56514.5669647	0	0	0	0	1659313.00968	28686.1250628	62667.5740896	0	0	0	0	332921.065481	18.5071330845	590.043143165	0	0	0	0
GHG emissions (GWP100) | Problem oriented approach: baseline (CML, 1999) | GWP100 (IPCC, 2007)	222235658257	11336039606.3	11372295020.3	0	0	0	0	739461672315	24905978814.8	30843010382.3	0	0	0	0	681990357910	33471598622.5	60603721170.4	0	0	0	0	1.32557576654e+12	103781579795	61195958096.7	0	0	0	0	1.70505580919e+12	28911821941.8	63299288524.1	0	0	0	0	415053620922	18873065.6495	843410145.627	0	0	0	0
GHG emissions (GWP100min) | Problem oriented approach: non baseline (CML, 1999) | net GWP100 min(Houghton et al., 2001)	229125992173	11494290133.4	11669920322.9	0	0	0	0	775394174232	24860846196.9	30838959761.8	0	0	0	0	703868009017	33589970585.3	60822554570.2	0	0	0	0	1.41043771799e+12	105753237113	64336629643	0	0	0	0	1.75628923003e+12	29222997023.6	63864298444.7	0	0	0	0	447753720120	18927437.0102	946444822.711	0	0	0	0
GHG emissions (GWP100max) | Problem oriented approach: non baseline (CML, 1999) | net GWP100 max(Houghton et al., 2001)	234881140460	11547917321.5	11756302183.3	0	0	0	0	844160993213	24936048807.3	30935704507.6	0	0	0	0	727098735987	33757534688.9	61070711527.2	0	0	0	0	1.56846075198e+12	108423509597	70381832081.8	0	0	0	0	1.81694325016e+12	29270148391.1	63960656952.3	0	0	0	0	514942923832	19051742.4678	1170028903.6	0	0	0	0
GHG emissions (GWP20) | Problem oriented approach: non baseline (CML, 1999) | GWP20 (IPCC, 2007)	222695449227	11352207802.9	11423776741	0	0	0	0	814733318827	28384071394.2	34021506973	0	0	0	0	704244349904	35477516119.1	63944490542.3	0	0	0	0	1.50792334787e+12	107160857989	68569266995.9	0	0	0	0	1.72625361496e+12	29255159541.8	64305174916.7	0	0	0	0	539288575306	19497587.7544	1218814875.23	0	0	0	0
GHG emissions (GWP500) | Problem oriented approach: non baseline (CML, 1999) | GWP500 (IPCC, 2007)	221298710133	11300771509.6	11341703163.5	0	0	0	0	708204799239	23610927147.1	29656505897.8	0	0	0	0	670227543589	32705585597.3	59330335307.9	0	0	0	0	1.24378694584e+12	102321498576	58084031731.4	0	0	0	0	1.68006609942e+12	28763561348.5	62879434115.8	0	0	0	0	360931121969	18624900.2563	677288702.246	0	0	0	0
ozone layer depletion (ODP steady state) | Problem oriented approach: baseline (CML, 1999) | ODP steady state (WMO, 2003)	25440.4648168	32.0713178014	51.5745608467	0	0	0	0	95891.6189269	102.550943707	130.6146701	0	0	0	0	68385.3327305	226.580485191	414.608811785	0	0	0	0	375621.959673	3073.74588401	8375.89121756	0	0	0	0	210851.718726	43.4261495423	86.7453568128	0	0	0	0	218658.835464	0.35342594845	691.894347988	0	0	0	0
human toxicity (HTP inf) | Problem oriented approach: baseline (CML, 1999) | HTP inf. (Huijbregts, 1999 & 2000)	23515025448.1	461427942.905	974943987.868	0	0	0	0	69736372708.9	86378469.4735	110704786.074	0	0	0	0	56640811656	202763935.671	370201242.943	0	0	0	0	298895780605	3204721227.45	6506166854.81	0	0	0	0	130172935372	112845388.048	397889221.034	0	0	0	0	136494211469	219727.895071	403614776.427	0	0	0	0
Freshwater aquatic ecotoxicity (FAETP inf) | Problem oriented approach: baseline (CML, 1999) | FAETP inf. (Huijbregts, 1999 & 2000)	246484222.771	9943445.7928	17935386.3607	0	0	0	0	3153895074.64	2207498.55748	2788674.38134	0	0	0	0	1274021503.95	7427090.63454	11407521.1286	0	0	0	0	7698363777.34	189320811.929	354999657.114	0	0	0	0	1426165426.04	416041.776826	2272345.8243	0	0	0	0	4089255073.45	6909.13964459	12324144.5494	0	0	0	0
Marine aquatic ecotoxicity (MAETP inf) | Problem oriented approach: baseline (CML, 1999) | MAETP inf. (Huijbregts, 1999 & 2000)	568404226702	23791431770	36726733199.5	0	0	0	0	987088989238	622766903.617	829135448.675	0	0	0	0	2.02697002072e+12	2180976445.19	4028495280.42	0	0	0	0	9.43558183437e+12	65335132047.1	86230144015.3	0	0	0	0	2.81429729315e+12	735304303.783	8962875516.15	0	0	0	0	1.38764996223e+12	1434393.00603	1373236567.74	0	0	0	0
Freshwater sedimental ecotoxicity (FSETP inf) | Problem oriented approach: non baseline (CML, 1999) | FSETP inf. (Huijbregts, 1999 & 2000)	640069902.616	29399500.6014	53537187.4649	0	0	0	0	9914620334.52	6833439.42604	8622709.44529	0	0	0	0	3674737862.6	23368693.3793	35587271.43	0	0	0	0	22849308303.5	603703598.817	1128133733.47	0	0	0	0	3523450109.73	1119964.35082	5895296.87913	0	0	0	0	12539763088.4	21367.5701839	38064505.0413	0	0	0	0
Marine sedimental ecotoxicity (MSETP inf) | Problem oriented approach: non baseline (CML, 1999) | MSETP inf. (Huijbregts, 1999 & 2000)	555027554768	23582123238.6	36325519520.2	0	0	0	0	1.0964808175e+12	712409850.267	941161906.673	0	0	0	0	2.02560633485e+12	2430846123.39	4341710728.91	0	0	0	0	9.61590396396e+12	69929868769.7	97522422051.3	0	0	0	0	2.73508826472e+12	731714991.069	8782047285.68	0	0	0	0	1.54873004307e+12	1735264.63015	1923544065.52	0	0	0	0
Terrestrial ecotoxicity (TETP inf) | Problem oriented approach: baseline (CML, 1999) | TETP inf.(Huijbregts, 1999 & 2000)	553101134.795	19059541.5692	52006883.8337	0	0	0	0	624745511.964	643000.691277	968672.897128	0	0	0	0	313541947.074	2770827.71979	5258331.01198	0	0	0	0	1249211499.98	70763943.4527	92428420.657	0	0	0	0	394954604.438	1084215.19156	13361984.0849	0	0	0	0	388676147.511	664.382994881	799111.000907	0	0	0	0
human toxicity (HTP20) | Problem oriented approach: non baseline (CML, 1999) | HTP 20 (Huijbregts, 1999 & 2000)	10681090857.5	438341759.335	930931500.651	0	0	0	0	21592982055.1	35163382.121	45441204.2223	0	0	0	0	22465098624	88565245.048	161232563.009	0	0	0	0	111720305981	1625338266.81	2271600690.08	0	0	0	0	25129882552.4	90966718.7116	350679769.833	0	0	0	0	27623299477.1	43759.830297	59359736.7133	0	0	0	0
Freshwater aquatic ecotoxicity (FAETP20) | Problem oriented approach: non baseline (CML, 1999) | FAETP 20 (Huijbregts, 1999 & 2000)	103461414.902	5363929.25225	10258958.4974	0	0	0	0	2628345225.77	1815484.87582	2285208.92854	0	0	0	0	770987029.771	6213212.12542	9385087.00301	0	0	0	0	5253062223.83	159972466.997	302891188.763	0	0	0	0	586351058.803	217424.375066	504728.106068	0	0	0	0	3309745007.45	5751.16398989	10378422.524	0	0	0	0
Marine aquatic ecotoxicity (MAETP20) | Problem oriented approach: non baseline (CML, 1999) | MAETP 20 (Huijbregts, 1999 & 2000)	3674845496.67	170393616.983	329446501.012	0	0	0	0	73647631186.4	51006872.4461	64272282.821	0	0	0	0	23420498443.7	173952787.886	263584428.915	0	0	0	0	152157377738	4469962257.75	8444576672.39	0	0	0	0	21039640541.8	6994570.16857	25881556.4969	0	0	0	0	92830172936.4	160369.869584	288620085.666	0	0	0	0
Freshwater sedimental ecotoxicity (FSETP20) | Problem oriented approach: non baseline (CML, 1999) | FSETP 20 (Huijbregts, 1999 & 2000)	331878211.422	17291417.2905	33123515.2676	0	0	0	0	8561559285.78	5914350.75103	7444150.12552	0	0	0	0	2496311238.88	20240124.3905	30565658.8826	0	0	0	0	17055182827.2	521129484.7	986914434.709	0	0	0	0	1882044104.01	702363.018944	1565168.98987	0	0	0	0	10780721289.1	18741.431536	33829476.8211	0	0	0	0
Marine sedimental ecotoxicity (MSETP20) | Problem oriented approach: non baseline (CML, 1999) | MSETP 20 (Huijbregts, 1999 & 2000)	10097375694.5	493918076.153	953393760.162	0	0	0	0	229754593780	159271426.542	200581169.399	0	0	0	0	69660768744.3	542706542.18	821055549.644	0	0	0	0	464855952055	13942252385	26412984601.8	0	0	0	0	57679646364	20324039.5075	60760846.259	0	0	0	0	289836726790	502547.842439	906108034.646	0	0	0	0
Terrestrial ecotoxicity (TETP20) | Problem oriented approach: non baseline (CML, 1999) | TETP 20 (Huijbregts, 1999 & 2000)	10237215.2298	396029.95419	1055955.54268	0	0	0	0	29036544.8167	23445.8724895	32929.1139374	0	0	0	0	8324078.12322	93986.9445242	161245.235396	0	0	0	0	47454607.3092	2457675.30888	3873866.53762	0	0	0	0	6245668.17483	21038.9964859	244653.3347	0	0	0	0	28251453.1759	50.3837762016	84246.7122805	0	0	0	0
human toxicity (HTP100) | Problem oriented approach: non baseline (CML, 1999) | HTP 100 (Huijbregts, 1999 & 2000)	10685246980	438530068.972	931361758.075	0	0	0	0	21663182689.7	35212657.2603	45503630.6862	0	0	0	0	22484294788	88734115.6593	161492317.55	0	0	0	0	111845810741	1629671104.89	2279790133.13	0	0	0	0	25148213413.3	90976271.4443	350741853.09	0	0	0	0	27707944787.5	43906.0930871	59629766.4583	0	0	0	0
Freshwater aquatic ecotoxicity (FAETP100) | Problem oriented approach: non baseline (CML, 1999) | FAETP 100 (Huijbregts, 1999 & 2000)	121400460.475	6134047.27943	11715297.7359	0	0	0	0	2898914219.51	2001360.44301	2519786.49804	0	0	0	0	869837469.786	6852013.19428	10357976.6315	0	0	0	0	5856310870.38	176510238.047	333728998.739	0	0	0	0	688370000.037	247779.818004	663810.042994	0	0	0	0	3649729997.54	6331.2538978	11414964.3896	0	0	0	0
Marine aquatic ecotoxicity (MAETP100) | Problem oriented approach: non baseline (CML, 1999) | MAETP 100 (Huijbregts, 1999 & 2000)	9132665542.69	338541927.712	669544709.46	0	0	0	0	96805431262.4	67094826.4266	84921375.8711	0	0	0	0	40908064407.3	228557695.482	350683891.215	0	0	0	0	228070006794	5862359571.76	10883696593.4	0	0	0	0	52325658510.5	14048510.0374	98079687.6399	0	0	0	0	121641872274	204863.301699	363882834.808	0	0	0	0
Freshwater sedimental ecotoxicity (FSETP100) | Problem oriented approach: non baseline (CML, 1999) | FSETP 100 (Huijbregts, 1999 & 2000)	387333589.346	19784537.131	37851692.7309	0	0	0	0	9524854693.07	6577947.97359	8280932.62589	0	0	0	0	2826149593.43	22514805.6661	34019674.5043	0	0	0	0	19134665000.7	579875133.042	1097040088.04	0	0	0	0	2196951122.68	801514.410778	2010314.40813	0	0	0	0	11993062407.8	20822.2861942	37559266.6933	0	0	0	0
Marine sedimental ecotoxicity (MSETP100) | Problem oriented approach: non baseline (CML, 1999) | MSETP 100 (Huijbregts, 1999 & 2000)	17076799150	720132088.287	1419699530.59	0	0	0	0	272718461739	189277982.67	238840218.822	0	0	0	0	93921449738.4	644725169.871	980588048.402	0	0	0	0	581511261190	16543798652.4	31115646469.4	0	0	0	0	96641095216.6	30042524.5538	149960536.834	0	0	0	0	343361104851	589563.684692	1057738552.01	0	0	0	0
Terrestrial ecotoxicity (TETP100) | Problem oriented approach: non baseline (CML, 1999) | TETP 100 (Huijbregts, 1999 & 2000)	46084517.1562	1746962.84899	4755376.70134	0	0	0	0	69334903.5419	64016.3435826	96804.9684957	0	0	0	0	20034175.6946	284109.546224	520856.304729	0	0	0	0	90995777.1346	7489110.08965	10477820.7479	0	0	0	0	15334621.7184	94437.4212661	1151251.55719	0	0	0	0	47966951.4696	89.1545348924	128794.718981	0	0	0	0
human toxicity (HTP500) | Problem oriented approach: non baseline (CML, 1999) | HTP 500 (Huijbregts, 1999 & 2000)	10692322205	438748316.417	931949518.108	0	0	0	0	21678274480.3	35222994.6649	45517800.3811	0	0	0	0	22492387408.2	88783416.6706	161581796.217	0	0	0	0	111871851503	1630953370.77	2281674226.03	0	0	0	0	25165063477.2	90987804.7675	350880419.628	0	0	0	0	27719301207.3	43924.0696279	59657252.7177	0	0	0	0
Freshwater aquatic ecotoxicity (FAETP500) | Problem oriented approach: non baseline (CML, 1999) | FAETP 500 (Huijbregts, 1999 & 2000)	151370611.63	7124677.09708	13445800.3581	0	0	0	0	2939259730.9	2027460.91004	2555026.3398	0	0	0	0	962979562.437	6939417.79523	10520605.8626	0	0	0	0	6221729481	178885335.985	336747786.959	0	0	0	0	859473355.062	283116.206182	1097618.14097	0	0	0	0	3703629883.82	6380.57598139	11458219.2617	0	0	0	0
Marine aquatic ecotoxicity (MAETP500) | Problem oriented approach: non baseline (CML, 1999) | MAETP 500 (Huijbregts, 1999 & 2000)	34872584846.2	1057310637.07	2156811936.28	0	0	0	0	128926341686	90149982.6815	116134032.764	0	0	0	0	106863715138	304735616.002	490923001.855	0	0	0	0	448298480866	7734591939.44	13377692561.9	0	0	0	0	197875544551	44746704.4744	473474057.976	0	0	0	0	160079446090	242315.985107	404709768.936	0	0	0	0
Freshwater sedimental ecotoxicity (FSETP500) | Problem oriented approach: non baseline (CML, 1999) | FSETP 500 (Huijbregts, 1999 & 2000)	463381344.157	22317787.8241	42273042.002	0	0	0	0	9626559726.41	6644285.25411	8370545.28768	0	0	0	0	3062452576.97	22735647.2567	34430565.4431	0	0	0	0	20067324702.8	585847208.375	1104605460.44	0	0	0	0	2627596948.66	891867.603286	3119773.44079	0	0	0	0	12129700661.6	20947.1653423	37667216.4862	0	0	0	0
Marine sedimental ecotoxicity (MSETP500) | Problem oriented approach: non baseline (CML, 1999) | MSETP 500 (Huijbregts, 1999 & 2000)	42740104249.1	1441050537.88	2916549384.96	0	0	0	0	304654473771	212456196.376	270230349.197	0	0	0	0	159126094193	721115127.119	1121194339.03	0	0	0	0	800055616536	18413870043.4	33608190173.4	0	0	0	0	240040634859	60949853.8174	527913833.37	0	0	0	0	381567252419	627031.516391	1098638888.47	0	0	0	0
Terrestrial ecotoxicity (TETP500) | Problem oriented approach: non baseline (CML, 1999) | TETP 500 (Huijbregts, 1999 & 2000) TETP 500	178254696.213	6716972.95686	18355839.1766	0	0	0	0	209352716.171	207974.536546	324971.401885	0	0	0	0	62771732.2328	963661.477761	1814331.96908	0	0	0	0	245075873.295	25460721.4085	33739409.1305	0	0	0	0	49408534.3085	364620.600127	4495948.70014	0	0	0	0	110746374.681	213.744019808	258622.683085	0	0	0	0
photochemical oxidation (high NOx) | Problem oriented approach: baseline (CML, 1999) | POCP (Jenkin & Hayman, 1999; Derwent et al. 1998; high NOx)	247925640.995	1202871.17171	2000390.91006	0	0	0	0	1656066928.86	2206913.88945	2679874.93552	0	0	0	0	787145606.281	4443129.88786	7058338.83863	0	0	0	0	4646941727.32	62024172.5758	145027939.016	0	0	0	0	2207202181.51	1078874.20572	2239182.71255	0	0	0	0	2378561155.3	4131.54615803	7656154.77617	0	0	0	0
photochemical oxidation (low NOx) | Problem oriented approach: non baseline (CML, 1999) | POCP (Andersson-Skï¿½ld et al. 1992; low NOx)	115185202.316	1075225.01474	1735422.75665	0	0	0	0	1386603425.85	2022160.54996	2408411.50267	0	0	0	0	467979165	3650307.98485	5461142.47211	0	0	0	0	3187848706.2	53911460.3766	122007903.431	0	0	0	0	1216449023.32	994365.544547	2077435.20445	0	0	0	0	1362419302.46	2579.37120213	4528023.94148	0	0	0	0
photochemical oxidation (MIR; very high NOx) | Problem oriented approach: non baseline (CML, 1999) | MIR 1997; very high NOx (Carter, 1994, 1997, 1998;Carter, Pierce, Luo &  Malkina, 1995 )	46088178.6253	430549.649246	695503.768395	0	0	0	0	556572863.979	897682.792961	1044538.87298	0	0	0	0	187768458.96	1511384.77924	2269828.98913	0	0	0	0	1279834572.74	21651328.8413	48992393.5988	0	0	0	0	487157087.173	406547.050789	856733.804985	0	0	0	0	548162331.535	1047.7362606	1820868.26067	0	0	0	0
photochemical oxidation (MOIR; high NOx) | Problem oriented approach: non baseline (CML, 1999) | MOIR; high NOx (Carter, 1994, 1997, 1998;Carter, Pierce, Luo &  Malkina, 1995 )	83531886.7378	780275.480227	1260322.52485	0	0	0	0	1008385921.45	1608546.19287	1876315.40063	0	0	0	0	340210166.665	2728705.41544	4096279.2094	0	0	0	0	2318722019.29	39224961.7145	88759290.0173	0	0	0	0	882851912.616	735033.022686	1547463.41254	0	0	0	0	992878682.043	1895.69118488	3298311.49663	0	0	0	0
photochemical oxidation (EBIR; low NOx) | Problem oriented approach: non baseline (CML, 1999) | EBIR; low NOx (Carter, 1994, 1997, 1998;Carter, Pierce, Luo &  Malkina, 1995 )	106575976.05	995550.30485	1608074.40905	0	0	0	0	1286672353.44	2057387.58935	2398584.83712	0	0	0	0	434094396.145	3484397.80506	5231193.70397	0	0	0	0	2958639305.65	50050626.1351	113255486.817	0	0	0	0	1126430456.2	938306.54808	1975830.31503	0	0	0	0	1266959847.81	2419.55931519	4208745.62696	0	0	0	0
acidification (incl. fate, average Europe total, A&B) | Problem oriented approach: baseline (CML, 1999) | AP ( Huijbregts, 1999; average Europe total, A&B)	538829347.257	20089405.7953	38164006.4844	0	0	0	0	2899759599.81	8675748.28784	11424698.9285	0	0	0	0	1846613566.09	23618672.2651	38898646.8706	0	0	0	0	2710203326.61	219549192.054	246709911.859	0	0	0	0	2987945520.54	33331896.3943	62532195.8349	0	0	0	0	1317716237.17	3856.15622095	3043267.81853	0	0	0	0
acidification (fate not incl.) | Problem oriented approach: non baseline (CML, 1999) | AP (Hauschild & Wenzel (1998).	692663695.666	24310059.4081	46434928.944	0	0	0	0	2741804371.58	11011699.1233	14324064.0185	0	0	0	0	2225531090.25	26683703.8048	46195934.8989	0	0	0	0	3221120707.08	229240255.851	234296296.658	0	0	0	0	3958886484.1	44997262.3051	84018018.2747	0	0	0	0	1439289173.8	4441.15530606	3219576.31842	0	0	0	0
eutrophication (fate not incl.) | Problem oriented approach: baseline (CML, 1999) | EP (Heijungs et al. 1992))	115153908.696	3535271.75782	6747326.48477	0	0	0	0	162605088.667	1759995.33909	2236704.81131	0	0	0	0	328497273.418	3282468.14737	6437186.83205	0	0	0	0	490443163.191	21877583.1328	14357444.8142	0	0	0	0	739262808.155	7952476.41747	14751835.7907	0	0	0	0	181166689.831	611.858374531	390683.673866	0	0	0	0
eutrophication (incl. fate, average Europe total, A&B) | Problem oriented approach: non baseline (CML, 1999) | EP ( Huijbregts, 1999; average Europe total, A&B)	1073820333.87	32243457.629	62234629.696	0	0	0	0	1530616479.48	16252993.0241	20656035.318	0	0	0	0	3055404347.42	30224628.9111	59361544.1995	0	0	0	0	4569606268.91	201556165.829	132226300.204	0	0	0	0	6924042323.77	73193452.8079	135655322.128	0	0	0	0	1663070809.19	5588.40674816	3516394.8523	0	0	0	0
odour | Problem oriented approach: non baseline (CML, 1999) | 1/OTV	2.11298287868e+13	94216064986.5	133794010820	0	0	0	0	7.69455064031e+13	118655655030	157140687090	0	0	0	0	7.41093471549e+13	287858726965	502600797509	0	0	0	0	2.48216219864e+14	2.78920927864e+12	5.36776691132e+12	0	0	0	0	3.54049314803e+14	130397019189	260074407193	0	0	0	0	1.09850547502e+14	195883400.699	313138312834	0	0	0	0
Climate change midpoint | ILCD recommended CF | Global warming potential 100 years	222185653058	11335976567.6	11372193646.5	0	0	0	0	739273189929	24905777243	30842753649.1	0	0	0	0	681855941254	33471153261.1	60602906224.6	0	0	0	0	1.32483745256e+12	103775538110	61179494635.4	0	0	0	0	1.70464136385e+12	28911736584.3	63299118019.4	0	0	0	0	414623830087	18872370.9635	842050173.83	0	0	0	0
Climate change endpoint, human health | ILCD recommended CF | Disability Adjusted Life Years (DALY)	311058.972866	15870.3278288	15921.0557426	0	0	0	0	1034978.24282	34868.0785115	43179.8423904	0	0	0	0	954593.814445	46859.5838418	84844.0208844	0	0	0	0	1854754.54159	145285.482676	85650.8075301	0	0	0	0	2386475.56203	40476.4028552	88618.7015473	0	0	0	0	580463.195424	26.4212977656	1178.83615985	0	0	0	0
Climate change endpoint, ecosystems | ILCD recommended CF | Potentially Disappeared Fraction of species (PDF)	1761.91451151	89.8935803786	90.1809763701	0	0	0	0	5861.96769927	197.484158497	244.565925453	0	0	0	0	5406.92674698	265.415083501	480.562509594	0	0	0	0	10504.7019506	822.917695761	485.106355215	0	0	0	0	13517.3348539	229.267792308	501.95563951	0	0	0	0	3287.14181158	0.149654232095	6.67491054134	0	0	0	0
Human toxicity midpoint, cancer effects | ILCD recommended CF | Comparative Toxic Unit for human (CTUh)	114.089765094	4.5012104484	11.8728586089	0	0	0	0	277.836845431	0.225149155133	0.320464110524	0	0	0	0	84.9310376875	0.948858022086	1.64901803468	0	0	0	0	471.451167466	24.7018248877	37.8507332162	0	0	0	0	58.2558295988	0.235422968274	2.79043327718	0	0	0	0	248.608432135	0.000437872880504	0.712078006307	0	0	0	0
Human toxicity midpoint, non-cancer effects | ILCD recommended CF | Comparative Toxic Unit for human (CTUh)	26924.7202886	940.982939153	2618.38249169	0	0	0	0	32053.753881	37.2204833477	52.7273043242	0	0	0	0	12316.4969874	137.116809905	253.927151382	0	0	0	0	43806.3548323	3180.45334681	4488.81294647	0	0	0	0	23139.9498251	53.1993209712	649.872429017	0	0	0	0	23712.6182	0.0452355200268	64.0944625146	0	0	0	0
Human toxicity endpoint, cancer effects | ILCD recommended CF | Disability Adjusted Life Years (DALY)	1310.58105233	51.7057278636	136.385177043	0	0	0	0	3191.05504065	2.58584002833	3.68061520075	0	0	0	0	975.514863518	10.8986058464	18.94129744	0	0	0	0	5414.54746893	283.732065107	434.740880902	0	0	0	0	669.186082478	2.70428461602	32.0540488034	0	0	0	0	2854.98415176	0.00502847173621	8.17698276187	0	0	0	0
Human toxicity endpoint, non-cancer effects | ILCD recommended CF | Disability Adjusted Life Years (DALY)	72624.7662028	2538.00391958	7062.26782159	0	0	0	0	86469.1782058	100.411954189	142.23494614	0	0	0	0	33234.109219	369.850230339	684.912585398	0	0	0	0	118216.689238	8577.84455685	12107.3699883	0	0	0	0	62450.3333882	143.491486767	1752.84730556	0	0	0	0	63986.0030986	0.122055885998	172.959500784	0	0	0	0
Particulate matter/Respiratory inorganics midpoint | ILCD recommended CF | emission-weighed average PM2.5 equivalent	128008345.672	5853739.50949	11953286.5046	0	0	0	0	3708684009.13	3223688.23791	4083409.35646	0	0	0	0	1254345541.74	8959581.51932	13920246.5445	0	0	0	0	8269542734.91	283826839.41	530549720.293	0	0	0	0	1167540146.27	1169224.555	2291391.48848	0	0	0	0	5771954855.1	10110.5952488	18338191.5902	0	0	0	0
Particulate matter/Respiratory inorganics endpoint | ILCD recommended CF | Disability Adjusted Life Years (DALY)	230415.019841	10536.7310925	21515.9156674	0	0	0	0	6675631.18793	5802.63879734	7350.13680196	0	0	0	0	2257821.96534	16127.2466656	25056.4436766	0	0	0	0	14885176.8565	510888.309676	954989.49382	0	0	0	0	2101572.23847	2104.60418039	4124.50464123	0	0	0	0	10389518.7099	18.1990713938	33008.7447651	0	0	0	0
Photochemical ozone formation midpoint, human health | ILCD recommended CF | Photochemical ozone creation potential (POCP)	1243894308.24	3071936.29839	5051586.0465	0	0	0	0	5907211430.02	7051105.74448	8760382.23008	0	0	0	0	3547511520.95	14852078.8961	25366802.4108	0	0	0	0	20031532729.1	204451669.707	516612057.095	0	0	0	0	10566780506.6	3230480.77666	6594809.14284	0	0	0	0	11109354696.2	18440.8551125	35372083.6342	0	0	0	0
Photochemical ozone formation endpoint, human health | ILCD recommended CF | Disability Adjusted Life Years (DALY)	48.5162643821	0.11983271306	0.197052559905	0	0	0	0	230.432527614	0.275130047657	0.341799829523	0	0	0	0	138.370642272	0.579385340745	0.989547613165	0	0	0	0	781.358435403	7.97550193925	20.1524142941	0	0	0	0	412.153079592	0.126027628072	0.257283613891	0	0	0	0	433.319952165	0.000719303666658	1.379695024	0	0	0	0
Acidification midpoint | ILCD recommended CF | Accumulated Exceedance (AE)	168016133.363	7568885.61599	13786313.3835	0	0	0	0	2717828191.79	2461337.87441	3583780.2023	0	0	0	0	865418439.953	12965272.7293	17086114.86	0	0	0	0	1681651227.28	157001488.443	226514172.029	0	0	0	0	1255671774.3	3515547.72336	7399824.90242	0	0	0	0	1036774010.94	2300.24205617	2733960.31318	0	0	0	0
Acidification endpoint | ILCD recommended CF | Change in potentially not occuring fraction of plant species per change in base saturation	0.761405013411	0.0335892024575	0.0611495556641	0	0	0	0	12.0969208644	0.0109958929106	0.0159973892821	0	0	0	0	3.89306084179	0.0576421346623	0.0760651073695	0	0	0	0	7.65125185723	0.697433369653	1.00733709361	0	0	0	0	5.85297240214	0.0156731205789	0.0329781872063	0	0	0	0	4.6813640901	1.03466666404e-05	0.0123641511635	0	0	0	0
Eutrophication terrestrial midpoint | ILCD recommended CF | Accumulated Exceedance (AE)	285252688.622	1271916.87732	1806219.14606	0	0	0	0	1038764336.44	1601851.34291	2121399.27572	0	0	0	0	1000476186.59	3886092.81402	6785110.76638	0	0	0	0	3350918968.17	37654325.2616	72464853.3028	0	0	0	0	4779665749.84	1760359.75905	3511004.4971	0	0	0	0	1482982391.28	2644.42590944	4227367.22327	0	0	0	0
Eutrophication marine midpoint | ILCD recommended CF | Potentially Disappeared Fraction of species (PDF)	2366540.82413	10552.1992785	14984.9292118	0	0	0	0	8617896.71715	13289.4333634	17599.7569541	0	0	0	0	8300246.88135	32240.17742	56291.289321	0	0	0	0	27800216.6248	312391.439207	601189.894067	0	0	0	0	39653523.258	14604.4661492	29128.3336056	0	0	0	0	12303261.3202	21.9389408783	35071.4910375	0	0	0	0
Ecotoxicity freshwater midpoint | ILCD recommended CF | Comparative Toxic Unit for ecosystems (CTUe)	19652122461.5	538683809.374	1451818994.56	0	0	0	0	23616880238.1	25218642.9897	33479557.916	0	0	0	0	26311410598.5	76182319.5934	137963755.934	0	0	0	0	70983216180	1585117669.08	2384155165.33	0	0	0	0	71336395892.5	30360144.3137	366933268.111	0	0	0	0	24320463213.6	36323.0883027	53671205.1948	0	0	0	0
Ecotoxicity freshwater endpoint | ILCD recommended CF | Potentially Disappeared Fraction of species (PDF)	19652122461.5	538683809.374	1451818994.56	0	0	0	0	23616880238.1	25218642.9897	33479557.916	0	0	0	0	26311410598.5	76182319.5934	137963755.934	0	0	0	0	70983216180	1585117669.08	2384155165.33	0	0	0	0	71336395892.5	30360144.3137	366933268.111	0	0	0	0	24320463213.6	36323.0883027	53671205.1948	0	0	0	0
GHG emissions AR5 (GWP100) | GWP100 (IPCC, 2010)	222065563735	11330630313.4	11372995494.4	0	0	0	0	743405115839	25126234944.4	31043590800.1	0	0	0	0	682554877505	33594237815.1	60808444238.4	0	0	0	0	1.33362299867e+12	103947737974	61572556888.1	0	0	0	0	1.70239774414e+12	28929058775.7	63353010146.3	0	0	0	0	420932851503	18908779.1664	860573103.138	0	0	0	0
Nitrogen	34073787.5636	1051089.89342	2019232.49327	0	0	0	0	46894388.2352	524434.056938	666297.759568	0	0	0	0	96640065.4135	974546.305387	1914577.89214	0	0	0	0	140148818.691	6470172.84809	4135610.98444	0	0	0	0	212483255.851	2378091.53897	4408796.99392	0	0	0	0	50786943.518	176.478532704	105976.764774	0	0	0	0
Phosphorous	0	0	0	0	0	0	0	0	0	0	0	0	0	0	0	0	0	0	0	0	0	0	0	0	0	0	0	0	0	0	0	0	0	0	0	0	0	0	0	0	0	0
PM10	112205260.522	5130999.96219	10195023.5604	0	0	0	0	3001502253.77	2573250.51145	3241595.47693	0	0	0	0	950859183.885	6533340.48721	9980501.21449	0	0	0	0	6709540266.74	189086272.473	389435237.307	0	0	0	0	992512771.891	349108.746218	661970.978359	0	0	0	0	4484901616.3	7816.09269293	14221258.6013	0	0	0	0
PM25	81055967.3763	3089006.58028	6563951.54677	0	0	0	0	2811873657.4	2493994.62175	3141884.97321	0	0	0	0	898242694.2	6192982.97848	9531752.72075	0	0	0	0	6433936087.59	153600047.558	338663466.062	0	0	0	0	913005896.871	923880.696039	1750753.59617	0	0	0	0	4321876790.02	7533.85353859	13736274.4585	0	0	0	0
SOx	79545076.6617	5560574.88529	10215462.1915	0	0	0	0	1897292185.08	1605341.82917	2373446.81472	0	0	0	0	489777260.722	9233541.50679	11884168.2836	0	0	0	0	711479575.027	113418378.948	160537035.082	0	0	0	0	142322781.368	2383014.29421	5049160.45244	0	0	0	0	538187295.787	1304.33143974	1365101.2278	0	0	0	0
NOx	819135058.407	26531940.458	51382762.8746	0	0	0	0	999792334.957	13118978.0896	16650275.3029	0	0	0	0	2280611795.55	24155696.9876	47666967.3085	0	0	0	0	2918563769.58	157968804.942	90954085.4048	0	0	0	0	4501358558.43	60527288.0212	112114168.481	0	0	0	0	992261212.44	3955.09010429	1808250.08926	0	0	0	0
Domestic Extraction Used - Crop and Crop Residue	0	0	0	0	0	0	0	0	0	0	0	0	0	0	0	0	0	0	0	0	0	0	0	0	0	0	0	0	0	0	0	0	0	0	0	0	0	0	0	0	0	0
Domestic Extraction Used - Grazing and Fodder	0	0	0	0	0	0	0	0	0	0	0	0	0	0	0	0	0	0	0	0	0	0	0	0	0	0	0	0	0	0	0	0	0	0	0	0	0	0	0	0	0	0
Domestic Extraction Used - Forestry and Timber	0	0	0	0	0	0	0	0	0	0	0	0	0	0	0	0	0	0	0	0	0	0	0	0	0	0	0	0	0	0	0	0	0	0	0	0	0	0	0	0	0	0
Domestic Extraction Used â Fisheries	0	0	0	0	0	0	0	0	0	0	0	0	0	0	0	0	0	0	0	0	0	0	0	0	0	0	0	0	0	0	0	0	0	0	0	0	0	0	0	0	0	0
Domestic Extraction Used - Non-metalic Minerals	0	0	0	0	0	0	0	0	0	0	0	0	0	0	0	0	0	0	0	0	0	0	0	0	0	0	0	0	0	0	0	0	0	0	0	0	0	0	0	0	0	0
Domestic Extraction Used - Iron Ore	0	0	0	0	0	0	0	0	0	0	0	0	0	0	0	0	0	0	0	0	0	0	0	0	0	0	0	0	0	0	0	0	0	0	0	0	0	0	0	0	0	0
Domestic Extraction Used - Non-ferous metal ores	0	0	0	0	0	0	0	0	0	0	0	0	0	0	0	0	0	0	0	0	0	0	0	0	0	0	0	0	0	0	0	0	0	0	0	0	0	0	0	0	0	0
Unused Domestic Extraction - Crop and Crop Residue	0	0	0	0	0	0	0	0	0	0	0	0	0	0	0	0	0	0	0	0	0	0	0	0	0	0	0	0	0	0	0	0	0	0	0	0	0	0	0	0	0	0
Unused Domestic Extraction - Grazing and Fodder	0	0	0	0	0	0	0	0	0	0	0	0	0	0	0	0	0	0	0	0	0	0	0	0	0	0	0	0	0	0	0	0	0	0	0	0	0	0	0	0	0	0
Unused Domestic Extraction - Forestry and Timber	0	0	0	0	0	0	0	0	0	0	0	0	0	0	0	0	0	0	0	0	0	0	0	0	0	0	0	0	0	0	0	0	0	0	0	0	0	0	0	0	0	0
Unused Domestic Extraction â Fisheries	0	0	0	0	0	0	0	0	0	0	0	0	0	0	0	0	0	0	0	0	0	0	0	0	0	0	0	0	0	0	0	0	0	0	0	0	0	0	0	0	0	0
Unused Domestic Extraction - Coal and Peat	0	0	0	0	0	0	0	0	0	0	0	0	0	0	0	0	0	0	0	0	0	0	0	0	0	0	0	0	0	0	0	0	0	0	0	0	0	0	0	0	0	0
Unused Domestic Extraction - Oil and Gas	0	0	0	0	0	0	0	0	0	0	0	0	0	0	0	0	0	0	0	0	0	0	0	0	0	0	0	0	0	0	0	0	0	0	0	0	0	0	0	0	0	0
Unused Domestic Extraction - Non-metalic Minerals	0	0	0	0	0	0	0	0	0	0	0	0	0	0	0	0	0	0	0	0	0	0	0	0	0	0	0	0	0	0	0	0	0	0	0	0	0	0	0	0	0	0
Unused Domestic Extraction - Iron Ore	0	0	0	0	0	0	0	0	0	0	0	0	0	0	0	0	0	0	0	0	0	0	0	0	0	0	0	0	0	0	0	0	0	0	0	0	0	0	0	0	0	0
Unused Domestic Extraction - Non-ferous metal ores	0	0	0	0	0	0	0	0	0	0	0	0	0	0	0	0	0	0	0	0	0	0	0	0	0	0	0	0	0	0	0	0	0	0	0	0	0	0	0	0	0	0
Land use Crop, Forest, Pasture	130382.413025	0	0	0	0	0	0	236183.624653	0	0	0	0	0	0	345970.835409	0	0	0	0	0	0	515441.161123	0	0	0	0	0	0	680318.142498	0	0	0	0	0	0	203911.537018	0	0	0	0	0	0
