lerhyd\Context.class
lerhyd\soot\examples\sign\Sign$4.class
lerhyd\Analysis.class
lerhyd\BackwardAnalysis.class
lerhyd\soot\examples\sign\Sign$2.class
lerhyd\soot\examples\ConstantAnalysis.class
lerhyd\util\AnalysisUtil.class
lerhyd\soot\examples\sign\Sign$5.class
lerhyd\Call.class
lerhyd\soot\examples\sign\Sign.class
lerhyd\ContextTable.class
lerhyd\soot\examples\sign\Sign$3.class
lerhyd\Solution.class
lerhyd\soot\examples\MarkAnalysis.class
lerhyd\Context$1.class
lerhyd\ForwardAnalysis.class
lerhyd\soot\examples\sign\Sign$1.class
lerhyd\Representation.class
lerhyd\OldAnalysis.class
lerhyd\soot\DefaultJRepresentation.class
