{
  "db_name": "PostgreSQL",
  "query": "UPDATE map_rating SET vote=$1, created_at=CURRENT_TIMESTAMP, comment=$2\n                   WHERE id=$3",
  "describe": {
    "columns": [],
    "parameters": {
      "Left": [
        "Int2",
        "Text",
        "Int4"
      ]
    },
    "nullable": []
  },
  "hash": "270a6ed53e6b25ddcd9afab84c5fba8a5ec68f829d9881707d055a926a406d70"
}
