{
  "$schema": "http://json-schema.org/draft-07/schema#",
  "$id": "http://json-schema.org/draft-07/schema#",
  "definitions": {
    "Layout": {
      "type": "object",
      "properties": {
        "label": {
          "type": "object",
          "properties": {
            "de": {
              "type": "string"
            },
            "en": {
              "type": "string"
            }
          },
          "additionalProperties": {
            "type": "string"
          },
          "minProperties": 1
        },
        "displayType": {
          "type": "string",
          "enum": [
            "hidden",
            "textarea",
            "currency"
          ]
        },
        "required": {
          "type": "boolean"
        }
      },
      "additionalProperties": false
    },
    "Enum": {
      "type": "object",
      "properties": {
        "_type": {
          "enum": [
            "enum"
          ]
        },
        "_cardinality": {
          "enum": [
            "list",
            "single"
          ]
        },
        "_customerName": {
          "type": "string"
        },
        "_values": {
          "type": "array",
          "minItems": 1,
          "uniqueItems": true,
          "items": {
            "type": "string"
          }
        },
        "_examples": {
          "type": "array",
          "minItems": 1,
          "items": {
            "type": "string"
          }
        },
        "_annotationTypes": {
          "type": "array",
          "minItems": 1,
          "items": {
            "type": "string"
          }
        },
        "_layout": {
          "$ref": "#/definitions/Layout"
        }
      },
      "additionalProperties": false,
      "required": [
        "_type",
        "_values"
      ]
    },
    "Field": {
      "type": "object",
      "properties": {
        "_type": {
          "enum": [
            "string",
            "date",
            "boolean",
            "number",
            "integer"
          ]
        },
        "_cardinality": {
          "enum": [
            "list",
            "single"
          ]
        },
        "_customerName": {
          "type": "string"
        },
        "_examples": {
          "type": "array",
          "minItems": 1,
          "items": {
            "type": "string"
          }
        },
        "_annotationTypes": {
          "type": "array",
          "minItems": 1,
          "items": {
            "type": "string"
          }
        },
        "_layout": {
          "$ref": "#/definitions/Layout"
        }
      },
      "required": [
        "_type"
      ],
      "additionalProperties": false
    },
    "Structure": {
      "type": "object",
      "properties": {
        "_customerName": {
          "type": "string"
        },
        "_cardinality": {
          "enum": [
            "list",
            "single"
          ]
        },
        "_annotationTypes": {
          "type": "array",
          "minItems": 1,
          "items": {
            "type": "string"
          }
        },
        "_layout": {
          "$ref": "#/definitions/Layout"
        }
      },
      "patternProperties": {
        "^(_customerName)_": {
          "type": "string"
        },
        "^(_cardinality)_": {
          "enum": [
            "list",
            "single"
          ]
        },
        "^[a-zA-Z0-9]_": {
          "$ref": "#/definitions/Element"
        }
      },
      "additionalProperties": {
        "$ref": "#/definitions/Element"
      },
      "minProperties": 1
    },
    "Element": {
      "oneOf": [
        {
          "$ref": "#/definitions/Structure"
        },
        {
          "$ref": "#/definitions/Enum"
        },
        {
          "$ref": "#/definitions/Field"
        }
      ]
    }
  },
  "properties": {
    "name": {
      "type": "string"
    },
    "content": {
      "$ref": "#/definitions/Element"
    }
  }
}
