{
  "$schema": "http://json-schema.org/draft-07/schema#",
  "$id": "http://json-schema.org/draft-07/schema#",
  "definitions": {
    "StringField": {
      "type": "object",
      "additionalProperties": false,
      "required": [
        "annotationTypes"
      ],
      "properties": {
        "alternativeType": {
          "type": "array",
          "minItems": 1,
          "items": {
            "type": "string"
          }
        },
        "annotationTypes": {
          "type": "array",
          "minItems": 1,
          "items": {
            "type": "string"
          }
        },
        "customAdjust": {
          "type": "string"
        }
      }
    },
    "DoubleField": {
      "type": "object",
      "additionalProperties": false,
      "required": [
        "annotationTypes"
      ],
      "properties": {
        "alternativeType": {
          "type": "array",
          "minItems": 1,
          "items": {
            "type": "string"
          }
        },
        "annotationTypes": {
          "type": "array",
          "minItems": 1,
          "items": {
            "type": "string"
          }
        },
        "customMapping": {
          "type": "string"
        }
      }
    },
    "IntField": {
      "type": "object",
      "additionalProperties": false,
      "required": [
        "annotationTypes"
      ],
      "properties": {
        "alternativeType": {
          "type": "array",
          "minItems": 1,
          "items": {
            "type": "string"
          }
        },
        "annotationTypes": {
          "type": "array",
          "minItems": 1,
          "items": {
            "type": "string"
          }
        },
        "customMapping": {
          "type": "string"
        }
      }
    },
    "DateField": {
      "type": "object",
      "additionalProperties": false,
      "required": [
        "annotationTypes",
        "customPickName",
        "pick"
      ],
      "properties": {
        "alternativeType": {
          "type": "array",
          "minItems": 1,
          "items": {
            "type": "string"
          }
        },
        "annotationTypes": {
          "type": "array",
          "minItems": 1,
          "items": {
            "type": "string"
          }
        },
        "customPickName": {
          "type": "string"
        },
        "pick": {
          "type": "string",
          "enum": [
            "begin",
            "end",
            "custom"
          ]
        }
      }
    },
    "EnumField": {
      "type": "object",
      "additionalProperties": false,
      "required": [
        "annotationTypes",
        "documentClass"
      ],
      "properties": {
        "annotationTypes": {
          "type": "array",
          "minItems": 1,
          "items": {
            "type": "string"
          }
        },
        "customMapping": {
          "type": "string"
        },
        "documentClass": {
          "type": "string"
        }
      }
    },
    "AnnotationExists": {
      "type": "object",
      "additionalProperties": false,
      "required": [
        "annotationTypes"
      ],
      "properties": {
        "annotationTypes": {
          "type": "array",
          "minItems": 1,
          "items": {
            "type": "string"
          }
        }
      }
    },
    "CustomStringField": {
      "type": "object",
      "additionalProperties": false,
      "required": [
        "name"
      ],
      "properties": {
        "name": {
          "type": "string"
        }
      }
    },
    "CustomIntField": {
      "type": "object",
      "additionalProperties": false,
      "required": [
        "name"
      ],
      "properties": {
        "name": {
          "type": "string"
        }
      }
    },
    "CustomDoubleField": {
      "type": "object",
      "additionalProperties": false,
      "required": [
        "name"
      ],
      "properties": {
        "name": {
          "type": "string"
        }
      }
    },
    "CustomEnumField": {
      "type": "object",
      "additionalProperties": false,
      "required": [
        "documentClass",
        "name"
      ],
      "properties": {
        "documentClass": {
          "type": "string"
        },
        "name": {
          "type": "string"
        }
      }
    },
    "CustomDateField": {
      "type": "object",
      "additionalProperties": false,
      "required": [
        "name"
      ],
      "properties": {
        "name": {
          "type": "string"
        }
      }
    },
    "CustomBooleanField": {
      "type": "object",
      "additionalProperties": false,
      "required": [
        "name"
      ],
      "properties": {
        "name": {
          "type": "string"
        }
      }
    },
    "BestConfidence": {
      "type": "object",
      "additionalProperties": false,
      "required": [
        "extractor"
      ],
      "properties": {
        "extractor": {
          "$ref": "#/definitions/ExtractorDef"
        }
      }
    },
    "MaxValue": {
      "type": "object",
      "additionalProperties": false,
      "required": [
        "extractor"
      ],
      "properties": {
        "extractor": {
          "$ref": "#/definitions/ExtractorDef"
        }
      }
    },
    "MinValue": {
      "type": "object",
      "additionalProperties": false,
      "required": [
        "extractor"
      ],
      "properties": {
        "extractor": {
          "$ref": "#/definitions/ExtractorDef"
        }
      }
    },
    "PickValue": {
      "type": "object",
      "additionalProperties": false,
      "required": [
        "extractor",
        "pickType"
      ],
      "properties": {
        "extractor": {
          "$ref": "#/definitions/ExtractorDef"
        },
        "pickType": {
          "type": "string",
          "enum": [
            "all",
            "first"
          ]
        }
      }
    },
    "Completeness": {
      "type": "object",
      "additionalProperties": false,
      "required": [
        "extractor"
      ],
      "properties": {
        "extractor": {
          "$ref": "#/definitions/ExtractorDef"
        }
      }
    },
    "AlwaysNull": {
      "type": "object",
      "additionalProperties": false,
      "required": [],
      "properties": {
        "description": {
          "type": "string"
        }
      }
    },
    "Custom": {
      "type": "object",
      "additionalProperties": false,
      "required": [
        "name"
      ],
      "properties": {
        "name": {
          "type": "string"
        }
      }
    },
    "ExtractorDef": {
      "type": "object",
      "oneOf": [
        {
          "$ref": "#/definitions/StringField"
        },
        {
          "$ref": "#/definitions/DoubleField"
        },
        {
          "$ref": "#/definitions/IntField"
        },
        {
          "$ref": "#/definitions/DateField"
        },
        {
          "$ref": "#/definitions/EnumField"
        },
        {
          "$ref": "#/definitions/AnnotationExists"
        },
        {
          "$ref": "#/definitions/CustomStringField"
        },
        {
          "$ref": "#/definitions/CustomIntField"
        },
        {
          "$ref": "#/definitions/CustomDoubleField"
        },
        {
          "$ref": "#/definitions/CustomEnumField"
        },
        {
          "$ref": "#/definitions/CustomDateField"
        },
        {
          "$ref": "#/definitions/CustomBooleanField"
        }
      ]
    },
    "SelectorDef": {
      "type": "object",
      "oneOf": [
        {
          "$ref": "#/definitions/BestConfidence"
        },
        {
          "$ref": "#/definitions/MaxValue"
        },
        {
          "$ref": "#/definitions/MinValue"
        },
        {
          "$ref": "#/definitions/PickValue"
        },
        {
          "$ref": "#/definitions/Completeness"
        },
        {
          "$ref": "#/definitions/AlwaysNull"
        },
        {
          "$ref": "#/definitions/Custom"
        }
      ]
    },
    "Layout": {
      "type": "object",
      "properties": {
        "label": {
          "type": "object",
          "properties": {
            "de": {
              "type": "string"
            },
            "en": {
              "type": "string"
            }
          },
          "additionalProperties": {
            "type": "string"
          },
          "minProperties": 1
        },
        "displayType": {
          "type": "string",
          "enum": [
            "hidden",
            "textarea",
            "currency"
          ]
        },
        "required": {
          "type": "boolean"
        }
      },
      "additionalProperties": false
    },
    "Enum": {
      "type": "object",
      "properties": {
        "_type": {
          "enum": [
            "enum"
          ]
        },
        "_cardinality": {
          "enum": [
            "list",
            "single"
          ]
        },
        "_customerName": {
          "type": "string"
        },
        "_values": {
          "type": "array",
          "minItems": 1,
          "uniqueItems": true,
          "items": {
            "type": "string"
          }
        },
        "_examples": {
          "type": "array",
          "minItems": 1,
          "items": {
            "type": "string"
          }
        },
        "_annotationTypes": {
          "type": "array",
          "minItems": 1,
          "items": {
            "type": "string"
          }
        },
        "_layout": {
          "$ref": "#/definitions/Layout"
        },
        "_selector": {
          "$ref": "#/definitions/SelectorDef"
        }
      },
      "additionalProperties": false,
      "required": [
        "_type",
        "_values"
      ]
    },
    "Field": {
      "type": "object",
      "properties": {
        "_type": {
          "enum": [
            "string",
            "date",
            "boolean",
            "number",
            "integer"
          ]
        },
        "_cardinality": {
          "enum": [
            "list",
            "single"
          ]
        },
        "_customerName": {
          "type": "string"
        },
        "_examples": {
          "type": "array",
          "minItems": 1,
          "items": {
            "type": "string"
          }
        },
        "_annotationTypes": {
          "type": "array",
          "minItems": 1,
          "items": {
            "type": "string"
          }
        },
        "_layout": {
          "$ref": "#/definitions/Layout"
        },
        "_selector": {
          "$ref": "#/definitions/SelectorDef"
        }
      },
      "required": [
        "_type"
      ],
      "additionalProperties": false
    },
    "Structure": {
      "type": "object",
      "properties": {
        "_selector": {
          "$ref": "#/definitions/SelectorDef"
        },
        "_customerName": {
          "type": "string"
        },
        "_cardinality": {
          "enum": [
            "list",
            "single"
          ]
        },
        "_annotationTypes": {
          "type": "array",
          "minItems": 1,
          "items": {
            "type": "string"
          }
        },
        "_layout": {
          "$ref": "#/definitions/Layout"
        }
      },
      "patternProperties": {
        "^(_customerName)_": {
          "type": "string"
        },
        "^(_cardinality)_": {
          "enum": [
            "list",
            "single"
          ]
        },
        "^[a-zA-Z0-9]_": {
          "$ref": "#/definitions/Element"
        }
      },
      "additionalProperties": {
        "$ref": "#/definitions/Element"
      },
      "minProperties": 1
    },
    "Element": {
      "oneOf": [
        {
          "$ref": "#/definitions/Structure"
        },
        {
          "$ref": "#/definitions/Enum"
        },
        {
          "$ref": "#/definitions/Field"
        }
      ]
    }
  },
  "properties": {
    "name": {
      "type": "string"
    },
    "content": {
      "$ref": "#/definitions/Element"
    }
  }
}
