hostvars:
  cs01:
    ansible_check_mode: false
    ansible_connection: network_cli
    ansible_diff_mode: false
    ansible_facts: {}
    ansible_forks: 5
    ansible_inventory_sources:
    - /home/kiosk/ansible_networking/do357/inventory
    ansible_playbook_python: /usr/bin/python2
    ansible_run_tags:
    - all
    ansible_skip_tags: []
    ansible_verbosity: 0
    ansible_version:
        full: 2.6.5
        major: 2
        minor: 6
        revision: 5
        string: 2.6.5
    domain_name: lab.example.com
    group_names:
    - access-layer
    - border-routers
    - cloud-services
    - ios
    - network
    groups:
        access-layer:
        - leaf01
        - leaf02
        - cs01
        all:
        - leaf01
        - leaf02
        - cs01
        - servera
        - julio
        - spine01
        - spine02
        - vy
        - server01
        - server02
        - server03
        border-routers:
        - spine01
        - spine02
        - cs01
        cloud-services:
        - cs01
        ios:
        - cs01
        leafs:
        - leaf01
        - leaf02
        mygroup:
        - servera
        - julio
        network:
        - cs01
        - leaf01
        - leaf02
        - spine01
        - spine02
        - vy
        servers:
        - server01
        - server02
        - server03
        spines:
        - spine01
        - spine02
        - vy
        ungrouped: &id001 []
        vyos:
        - spine01
        - spine02
        - vy
        - leaf01
        - leaf02
    groupvar: set from group_vars/all/vars.yml
    inventory_dir: /home/kiosk/ansible_networking/do357
    inventory_file: /home/kiosk/ansible_networking/do357/inventory
    inventory_hostname: cs01
    inventory_hostname_short: cs01
    nameservers:
    - 8.8.8.8
    - 8.8.4.4
    omit: __omit_place_holder__fe05e14907bf3cf3740b0eead66181f7c059f037
    playbook_dir: /home/kiosk/ansible_networking/do357
    ro_community: redhat
    snmp_clients:
    - 172.25.250.254
    - 172.25.250.9
    syslog_ipv4: 192.168.122.1
    tower_ipv4: 172.25.250.9/24
    workstation_ipv4: 172.25.250.254/24
julio:
    ansible_check_mode: false
    ansible_diff_mode: false
    ansible_facts: {}
    ansible_forks: 5
    ansible_host: localhost
    ansible_inventory_sources:
    - /home/kiosk/ansible_networking/do357/inventory
    ansible_playbook_python: /usr/bin/python2
    ansible_run_tags:
    - all
    ansible_skip_tags: []
    ansible_verbosity: 0
    ansible_version:
        full: 2.6.5
        major: 2
        minor: 6
        revision: 5
        string: 2.6.5
    group_names:
    - mygroup
    groups:
        access-layer:
        - leaf01
        - leaf02
        - cs01
        all:
        - leaf01
        - leaf02
        - cs01
        - servera
        - julio
        - spine01
        - spine02
        - vy
        - server01
        - server02
        - server03
        border-routers:
        - spine01
        - spine02
        - cs01
        cloud-services:
        - cs01
        ios:
        - cs01
        leafs:
        - leaf01
        - leaf02
        mygroup:
        - servera
        - julio
        network:
        - cs01
        - leaf01
        - leaf02
        - spine01
        - spine02
        - vy
        servers:
        - server01
        - server02
        - server03
        spines:
        - spine01
        - spine02
        - vy
        ungrouped: *id001
        vyos:
        - spine01
        - spine02
        - vy
        - leaf01
        - leaf02
    groupvar: set from group_vars/all/vars.yml
    inventory_dir: /home/kiosk/ansible_networking/do357
    inventory_file: /home/kiosk/ansible_networking/do357/inventory
    inventory_hostname: julio
    inventory_hostname_short: julio
    myserver: not my favorite server
    omit: __omit_place_holder__fe05e14907bf3cf3740b0eead66181f7c059f037
    playbook_dir: /home/kiosk/ansible_networking/do357
    tower_ipv4: 172.25.250.9/24
    workstation_ipv4: 172.25.250.254/24
leaf01:
    ansible_check_mode: false
    ansible_connection: network_cli
    ansible_diff_mode: false
    ansible_facts: {}
    ansible_forks: 5
    ansible_inventory_sources:
    - /home/kiosk/ansible_networking/do357/inventory
    ansible_network_os: vyos
    ansible_password: vyos
    ansible_playbook_python: /usr/bin/python2
    ansible_run_tags:
    - all
    ansible_skip_tags: []
    ansible_user: vyos
    ansible_verbosity: 0
    ansible_version:
        full: 2.6.5
        major: 2
        minor: 6
        revision: 5
        string: 2.6.5
    domain_name: lab.example.com
    group_names:
    - access-layer
    - leafs
    - network
    - vyos
    groups:
        access-layer:
        - leaf01
        - leaf02
        - cs01
        all:
        - leaf01
        - leaf02
        - cs01
        - servera
        - julio
        - spine01
        - spine02
        - vy
        - server01
        - server02
        - server03
        border-routers:
        - spine01
        - spine02
        - cs01
        cloud-services:
        - cs01
        ios:
        - cs01
        leafs:
        - leaf01
        - leaf02
        mygroup:
        - servera
        - julio
        network:
        - cs01
        - leaf01
        - leaf02
        - spine01
        - spine02
        - vy
        servers:
        - server01
        - server02
        - server03
        spines:
        - spine01
        - spine02
        - vy
        ungrouped: *id001
        vyos:
        - spine01
        - spine02
        - vy
        - leaf01
        - leaf02
    groupvar: set from group_vars/all/vars.yml
    inventory_dir: /home/kiosk/ansible_networking/do357
    inventory_file: /home/kiosk/ansible_networking/do357/inventory
    inventory_hostname: leaf01
    inventory_hostname_short: leaf01
    nameservers:
    - 8.8.8.8
    - 8.8.4.4
    omit: __omit_place_holder__fe05e14907bf3cf3740b0eead66181f7c059f037
    playbook_dir: /home/kiosk/ansible_networking/do357
    ro_community: redhat
    snmp_clients:
    - 172.25.250.254
    - 172.25.250.9
    syslog_ipv4: 192.168.122.1
    tower_ipv4: 172.25.250.9/24
    vyos_loglevel: info
    workstation_ipv4: 172.25.250.254/24
leaf02:
    ansible_check_mode: false
    ansible_connection: network_cli
    ansible_diff_mode: false
    ansible_facts: {}
    ansible_forks: 5
    ansible_inventory_sources:
    - /home/kiosk/ansible_networking/do357/inventory
    ansible_network_os: vyos
    ansible_password: vyos
    ansible_playbook_python: /usr/bin/python2
    ansible_run_tags:
    - all
    ansible_skip_tags: []
    ansible_user: vyos
    ansible_verbosity: 0
    ansible_version:
        full: 2.6.5
        major: 2
        minor: 6
        revision: 5
        string: 2.6.5
    domain_name: lab.example.com
    group_names:
    - access-layer
    - leafs
    - network
    - vyos
    groups:
        access-layer:
        - leaf01
        - leaf02
        - cs01
        all:
        - leaf01
        - leaf02
        - cs01
        - servera
        - julio
        - spine01
        - spine02
        - vy
        - server01
        - server02
        - server03
        border-routers:
        - spine01
        - spine02
        - cs01
        cloud-services:
        - cs01
        ios:
        - cs01
        leafs:
        - leaf01
        - leaf02
        mygroup:
        - servera
        - julio
        network:
        - cs01
        - leaf01
        - leaf02
        - spine01
        - spine02
        - vy
        servers:
        - server01
        - server02
        - server03
        spines:
        - spine01
        - spine02
        - vy
        ungrouped: *id001
        vyos:
        - spine01
        - spine02
        - vy
        - leaf01
        - leaf02
    groupvar: set from group_vars/all/vars.yml
    inventory_dir: /home/kiosk/ansible_networking/do357
    inventory_file: /home/kiosk/ansible_networking/do357/inventory
    inventory_hostname: leaf02
    inventory_hostname_short: leaf02
    nameservers:
    - 8.8.8.8
    - 8.8.4.4
    omit: __omit_place_holder__fe05e14907bf3cf3740b0eead66181f7c059f037
    playbook_dir: /home/kiosk/ansible_networking/do357
    ro_community: redhat
    snmp_clients:
    - 172.25.250.254
    - 172.25.250.9
    syslog_ipv4: 192.168.122.1
    tower_ipv4: 172.25.250.9/24
    vyos_loglevel: info
    workstation_ipv4: 172.25.250.254/24
server01:
    ansible_check_mode: false
    ansible_diff_mode: false
    ansible_facts: {}
    ansible_forks: 5
    ansible_inventory_sources:
    - /home/kiosk/ansible_networking/do357/inventory
    ansible_playbook_python: /usr/bin/python2
    ansible_run_tags:
    - all
    ansible_skip_tags: []
    ansible_verbosity: 0
    ansible_version:
        full: 2.6.5
        major: 2
        minor: 6
        revision: 5
        string: 2.6.5
    group_names:
    - servers
    groups:
        access-layer:
        - leaf01
        - leaf02
        - cs01
        all:
        - leaf01
        - leaf02
        - cs01
        - servera
        - julio
        - spine01
        - spine02
        - vy
        - server01
        - server02
        - server03
        border-routers:
        - spine01
        - spine02
        - cs01
        cloud-services:
        - cs01
        ios:
        - cs01
        leafs:
        - leaf01
        - leaf02
        mygroup:
        - servera
        - julio
        network:
        - cs01
        - leaf01
        - leaf02
        - spine01
        - spine02
        - vy
        servers:
        - server01
        - server02
        - server03
        spines:
        - spine01
        - spine02
        - vy
        ungrouped: *id001
        vyos:
        - spine01
        - spine02
        - vy
        - leaf01
        - leaf02
    groupvar: set from group_vars/all/vars.yml
    inventory_dir: /home/kiosk/ansible_networking/do357
    inventory_file: /home/kiosk/ansible_networking/do357/inventory
    inventory_hostname: server01
    inventory_hostname_short: server01
    omit: __omit_place_holder__fe05e14907bf3cf3740b0eead66181f7c059f037
    playbook_dir: /home/kiosk/ansible_networking/do357
    tower_ipv4: 172.25.250.9/24
    workstation_ipv4: 172.25.250.254/24
server02:
    ansible_check_mode: false
    ansible_diff_mode: false
    ansible_facts: {}
    ansible_forks: 5
    ansible_inventory_sources:
    - /home/kiosk/ansible_networking/do357/inventory
    ansible_playbook_python: /usr/bin/python2
    ansible_run_tags:
    - all
    ansible_skip_tags: []
    ansible_verbosity: 0
    ansible_version:
        full: 2.6.5
        major: 2
        minor: 6
        revision: 5
        string: 2.6.5
    group_names:
    - servers
    groups:
        access-layer:
        - leaf01
        - leaf02
        - cs01
        all:
        - leaf01
        - leaf02
        - cs01
        - servera
        - julio
        - spine01
        - spine02
        - vy
        - server01
        - server02
        - server03
        border-routers:
        - spine01
        - spine02
        - cs01
        cloud-services:
        - cs01
        ios:
        - cs01
        leafs:
        - leaf01
        - leaf02
        mygroup:
        - servera
        - julio
        network:
        - cs01
        - leaf01
        - leaf02
        - spine01
        - spine02
        - vy
        servers:
        - server01
        - server02
        - server03
        spines:
        - spine01
        - spine02
        - vy
        ungrouped: *id001
        vyos:
        - spine01
        - spine02
        - vy
        - leaf01
        - leaf02
    groupvar: set from group_vars/all/vars.yml
    inventory_dir: /home/kiosk/ansible_networking/do357
    inventory_file: /home/kiosk/ansible_networking/do357/inventory
    inventory_hostname: server02
    inventory_hostname_short: server02
    omit: __omit_place_holder__fe05e14907bf3cf3740b0eead66181f7c059f037
    playbook_dir: /home/kiosk/ansible_networking/do357
    tower_ipv4: 172.25.250.9/24
    workstation_ipv4: 172.25.250.254/24
server03:
    ansible_check_mode: false
    ansible_diff_mode: false
    ansible_facts: {}
    ansible_forks: 5
    ansible_inventory_sources:
    - /home/kiosk/ansible_networking/do357/inventory
    ansible_playbook_python: /usr/bin/python2
    ansible_run_tags:
    - all
    ansible_skip_tags: []
    ansible_verbosity: 0
    ansible_version:
        full: 2.6.5
        major: 2
        minor: 6
        revision: 5
        string: 2.6.5
    group_names:
    - servers
    groups:
        access-layer:
        - leaf01
        - leaf02
        - cs01
        all:
        - leaf01
        - leaf02
        - cs01
        - servera
        - julio
        - spine01
        - spine02
        - vy
        - server01
        - server02
        - server03
        border-routers:
        - spine01
        - spine02
        - cs01
        cloud-services:
        - cs01
        ios:
        - cs01
        leafs:
        - leaf01
        - leaf02
        mygroup:
        - servera
        - julio
        network:
        - cs01
        - leaf01
        - leaf02
        - spine01
        - spine02
        - vy
        servers:
        - server01
        - server02
        - server03
        spines:
        - spine01
        - spine02
        - vy
        ungrouped: *id001
        vyos:
        - spine01
        - spine02
        - vy
        - leaf01
        - leaf02
    groupvar: set from group_vars/all/vars.yml
    inventory_dir: /home/kiosk/ansible_networking/do357
    inventory_file: /home/kiosk/ansible_networking/do357/inventory
    inventory_hostname: server03
    inventory_hostname_short: server03
    omit: __omit_place_holder__fe05e14907bf3cf3740b0eead66181f7c059f037
    playbook_dir: /home/kiosk/ansible_networking/do357
    tower_ipv4: 172.25.250.9/24
    workstation_ipv4: 172.25.250.254/24
servera:
    ansible_check_mode: false
    ansible_diff_mode: false
    ansible_facts: {}
    ansible_forks: 5
    ansible_inventory_sources:
    - /home/kiosk/ansible_networking/do357/inventory
    ansible_playbook_python: /usr/bin/python2
    ansible_run_tags:
    - all
    ansible_skip_tags: []
    ansible_verbosity: 0
    ansible_version:
        full: 2.6.5
        major: 2
        minor: 6
        revision: 5
        string: 2.6.5
    group_names:
    - mygroup
    groups:
        access-layer:
        - leaf01
        - leaf02
        - cs01
        all:
        - leaf01
        - leaf02
        - cs01
        - servera
        - julio
        - spine01
        - spine02
        - vy
        - server01
        - server02
        - server03
        border-routers:
        - spine01
        - spine02
        - cs01
        cloud-services:
        - cs01
        ios:
        - cs01
        leafs:
        - leaf01
        - leaf02
        mygroup:
        - servera
        - julio
        network:
        - cs01
        - leaf01
        - leaf02
        - spine01
        - spine02
        - vy
        servers:
        - server01
        - server02
        - server03
        spines:
        - spine01
        - spine02
        - vy
        ungrouped: *id001
        vyos:
        - spine01
        - spine02
        - vy
        - leaf01
        - leaf02
    groupvar: set from group_vars/all/vars.yml
    inventory_dir: /home/kiosk/ansible_networking/do357
    inventory_file: /home/kiosk/ansible_networking/do357/inventory
    inventory_hostname: servera
    inventory_hostname_short: servera
    myserver: not my favorite server
    omit: __omit_place_holder__fe05e14907bf3cf3740b0eead66181f7c059f037
    playbook_dir: /home/kiosk/ansible_networking/do357
    tower_ipv4: 172.25.250.9/24
    workstation_ipv4: 172.25.250.254/24
spine01:
    ansible_check_mode: false
    ansible_connection: network_cli
    ansible_diff_mode: false
    ansible_facts: {}
    ansible_forks: 5
    ansible_inventory_sources:
    - /home/kiosk/ansible_networking/do357/inventory
    ansible_network_os: vyos
    ansible_password: vyos
    ansible_playbook_python: /usr/bin/python2
    ansible_run_tags:
    - all
    ansible_skip_tags: []
    ansible_user: vyos
    ansible_verbosity: 0
    ansible_version:
        full: 2.6.5
        major: 2
        minor: 6
        revision: 5
        string: 2.6.5
    domain_name: lab.example.com
    group_names:
    - border-routers
    - network
    - spines
    - vyos
    groups:
        access-layer:
        - leaf01
        - leaf02
        - cs01
        all:
        - leaf01
        - leaf02
        - cs01
        - servera
        - julio
        - spine01
        - spine02
        - vy
        - server01
        - server02
        - server03
        border-routers:
        - spine01
        - spine02
        - cs01
        cloud-services:
        - cs01
        ios:
        - cs01
        leafs:
        - leaf01
        - leaf02
        mygroup:
        - servera
        - julio
        network:
        - cs01
        - leaf01
        - leaf02
        - spine01
        - spine02
        - vy
        servers:
        - server01
        - server02
        - server03
        spines:
        - spine01
        - spine02
        - vy
        ungrouped: *id001
        vyos:
        - spine01
        - spine02
        - vy
        - leaf01
        - leaf02
    groupvar: set from group_vars/all/vars.yml
    inventory_dir: /home/kiosk/ansible_networking/do357
    inventory_file: /home/kiosk/ansible_networking/do357/inventory
    inventory_hostname: spine01
    inventory_hostname_short: spine01
    nameservers:
    - 8.8.8.8
    - 8.8.4.4
    omit: __omit_place_holder__fe05e14907bf3cf3740b0eead66181f7c059f037
    playbook_dir: /home/kiosk/ansible_networking/do357
    ro_community: redhat
    snmp_clients:
    - 172.25.250.254
    - 172.25.250.9
    syslog_ipv4: 192.168.122.1
    tower_ipv4: 172.25.250.9/24
    vyos_loglevel: info
    workstation_ipv4: 172.25.250.254/24
spine02:
    ansible_check_mode: false
    ansible_connection: network_cli
    ansible_diff_mode: false
    ansible_facts: {}
    ansible_forks: 5
    ansible_inventory_sources:
    - /home/kiosk/ansible_networking/do357/inventory
    ansible_network_os: vyos
    ansible_password: vyos
    ansible_playbook_python: /usr/bin/python2
    ansible_run_tags:
    - all
    ansible_skip_tags: []
    ansible_user: vyos
    ansible_verbosity: 0
    ansible_version:
        full: 2.6.5
        major: 2
        minor: 6
        revision: 5
        string: 2.6.5
    domain_name: lab.example.com
    group_names:
    - border-routers
    - network
    - spines
    - vyos
    groups:
        access-layer:
        - leaf01
        - leaf02
        - cs01
        all:
        - leaf01
        - leaf02
        - cs01
        - servera
        - julio
        - spine01
        - spine02
        - vy
        - server01
        - server02
        - server03
        border-routers:
        - spine01
        - spine02
        - cs01
        cloud-services:
        - cs01
        ios:
        - cs01
        leafs:
        - leaf01
        - leaf02
        mygroup:
        - servera
        - julio
        network:
        - cs01
        - leaf01
        - leaf02
        - spine01
        - spine02
        - vy
        servers:
        - server01
        - server02
        - server03
        spines:
        - spine01
        - spine02
        - vy
        ungrouped: *id001
        vyos:
        - spine01
        - spine02
        - vy
        - leaf01
        - leaf02
    groupvar: set from group_vars/all/vars.yml
    inventory_dir: /home/kiosk/ansible_networking/do357
    inventory_file: /home/kiosk/ansible_networking/do357/inventory
    inventory_hostname: spine02
    inventory_hostname_short: spine02
    nameservers:
    - 8.8.8.8
    - 8.8.4.4
    new_hostname: spineX1
    omit: __omit_place_holder__fe05e14907bf3cf3740b0eead66181f7c059f037
    playbook_dir: /home/kiosk/ansible_networking/do357
    ro_community: redhat
    snmp_clients:
    - 172.25.250.254
    - 172.25.250.9
    syslog_ipv4: 192.168.122.1
    tower_ipv4: 172.25.250.9/24
    vyos_loglevel: info
    workstation_ipv4: 172.25.250.254/24
vy:
    ansible_check_mode: false
    ansible_connection: network_cli
    ansible_diff_mode: false
    ansible_facts: {}
    ansible_forks: 5
    ansible_host: 192.168.122.113
    ansible_inventory_sources:
    - /home/kiosk/ansible_networking/do357/inventory
    ansible_network_os: vyos
    ansible_password: vyos
    ansible_playbook_python: /usr/bin/python2
    ansible_run_tags:
    - all
    ansible_skip_tags: []
    ansible_user: vyos
    ansible_verbosity: 0
    ansible_version:
        full: 2.6.5
        major: 2
        minor: 6
        revision: 5
        string: 2.6.5
    domain_name: lab.example.com
    group_names:
    - network
    - spines
    - vyos
    groups:
        access-layer:
        - leaf01
        - leaf02
        - cs01
        all:
        - leaf01
        - leaf02
        - cs01
        - servera
        - julio
        - spine01
        - spine02
        - vy
        - server01
        - server02
        - server03
        border-routers:
        - spine01
        - spine02
        - cs01
        cloud-services:
        - cs01
        ios:
        - cs01
        leafs:
        - leaf01
        - leaf02
        mygroup:
        - servera
        - julio
        network:
        - cs01
        - leaf01
        - leaf02
        - spine01
        - spine02
        - vy
        servers:
        - server01
        - server02
        - server03
        spines:
        - spine01
        - spine02
        - vy
        ungrouped: *id001
        vyos:
        - spine01
        - spine02
        - vy
        - leaf01
        - leaf02
    groupvar: set from group_vars/all/vars.yml
    inventory_dir: /home/kiosk/ansible_networking/do357
    inventory_file: /home/kiosk/ansible_networking/do357/inventory
    inventory_hostname: vy
    inventory_hostname_short: vy
    nameservers:
    - 8.8.8.8
    - 8.8.4.4
    omit: __omit_place_holder__fe05e14907bf3cf3740b0eead66181f7c059f037
    playbook_dir: /home/kiosk/ansible_networking/do357
    ro_community: redhat
    snmp_clients:
    - 172.25.250.254
    - 172.25.250.9
    syslog_ipv4: 192.168.122.1
    tower_ipv4: 172.25.250.9/24
    vyos_loglevel: info
    workstation_ipv4: 172.25.250.254/24

groups:
  access-layer:
- leaf01
- leaf02
- cs01
all:
- leaf01
- leaf02
- cs01
- servera
- julio
- spine01
- spine02
- vy
- server01
- server02
- server03
border-routers:
- spine01
- spine02
- cs01
cloud-services:
- cs01
ios:
- cs01
leafs:
- leaf01
- leaf02
mygroup:
- servera
- julio
network:
- cs01
- leaf01
- leaf02
- spine01
- spine02
- vy
servers:
- server01
- server02
- server03
spines:
- spine01
- spine02
- vy
ungrouped: []
vyos:
- spine01
- spine02
- vy
- leaf01
- leaf02

group_names:
  []

inventory_hostname:
  localhost
...

play_hosts:
  []
