{
  "defaultSeverity": "error",
  "extends": ["tslint:recommended", "tslint-config-prettier"],
  "rules": {
    "object-literal-sort-keys": false
  },
  "linterOptions": {
    "exclude": ["**/node_modules", "**/generated/**"]
  }
}