module gitlab.com/exa-bit/pkg/sql-tx

go 1.14

require (
	github.com/davecgh/go-spew v1.1.1 // indirect
	github.com/go-sql-driver/mysql v1.5.0
	github.com/jmoiron/sqlx v1.2.0
	github.com/pkg/errors v0.9.1
	github.com/stretchr/testify v1.6.1
	gopkg.in/yaml.v3 v3.0.0-20200615113413-eeeca48fe776 // indirect
)
