module gitlab.com/exa-bit/pkg/mongo-tx

go 1.15

require (
	github.com/aws/aws-sdk-go v1.34.5 // indirect
	github.com/klauspost/compress v1.10.11 // indirect
	github.com/stretchr/testify v1.5.1
	go.mongodb.org/mongo-driver v1.4.0
	golang.org/x/crypto v0.0.0-20200728195943-123391ffb6de // indirect
	golang.org/x/sync v0.0.0-20200625203802-6e8e738ad208 // indirect
)
