11:01:35,17,1,10.0.0.10,10.0.0.11,48954,38971
11:01:35,17,5,10.0.0.10,10.0.0.11,48954,38971
11:01:35,17,5,10.0.0.10,10.0.0.11,48954,38971
11:01:35,17,5,10.0.0.10,10.0.0.11,48954,38971
11:01:35,17,5,10.0.0.10,10.0.0.11,48954,38971
11:01:35,17,1,10.0.0.54,10.0.0.9,50365,37220
11:01:35,17,5,10.0.0.54,10.0.0.9,50365,37220
11:01:35,17,5,10.0.0.54,10.0.0.9,50365,37220
11:01:35,17,5,10.0.0.54,10.0.0.9,50365,37220
11:01:36,17,1,10.0.0.54,10.0.0.9,63151,49817
11:01:36,17,5,10.0.0.54,10.0.0.9,63151,49817
11:01:36,17,1,10.0.0.10,10.0.0.4,24614,63479
11:01:36,17,5,10.0.0.54,10.0.0.9,63151,49817
11:01:36,17,5,10.0.0.54,10.0.0.9,63151,49817
11:01:36,17,5,10.0.0.54,10.0.0.9,63151,49817
11:01:36,17,1,10.0.0.33,10.0.0.3,46436,57599
11:01:36,17,1,10.0.0.54,10.0.0.13,65101,11909
11:01:36,17,1,10.0.0.171,10.0.0.12,63627,52887
11:01:36,17,1,10.0.0.160,10.0.0.1,57342,3123
11:01:36,17,5,10.0.0.171,10.0.0.12,63627,52887
11:01:36,17,5,10.0.0.160,10.0.0.1,57342,3123
11:01:36,17,5,10.0.0.171,10.0.0.12,63627,52887
11:01:36,17,5,10.0.0.160,10.0.0.1,57342,3123
11:01:37,17,1,10.0.0.160,10.0.0.1,57342,3123
11:01:37,17,5,10.0.0.160,10.0.0.1,57342,3123
11:01:37,17,5,10.0.0.160,10.0.0.1,57342,3123
11:01:37,17,1,10.0.0.160,10.0.0.1,57342,3123
11:01:37,17,5,10.0.0.160,10.0.0.1,57342,3123
11:01:37,17,5,10.0.0.160,10.0.0.1,57342,3123
11:01:37,17,1,10.0.0.160,10.0.0.1,57342,3123
11:01:37,17,5,10.0.0.160,10.0.0.1,57342,3123
11:01:37,17,5,10.0.0.160,10.0.0.1,57342,3123
11:01:37,17,1,10.0.0.160,10.0.0.1,57342,3123
11:01:37,17,5,10.0.0.160,10.0.0.1,57342,3123
11:01:37,17,5,10.0.0.160,10.0.0.1,57342,3123
11:01:37,17,1,10.0.0.7,10.0.0.177,3714,43090
11:01:37,17,5,10.0.0.7,10.0.0.177,3714,43090
11:01:37,17,5,10.0.0.7,10.0.0.177,3714,43090
11:01:37,17,1,10.0.0.54,10.0.0.38,63811,46487
11:01:37,17,5,10.0.0.54,10.0.0.38,63811,46487
11:01:37,17,1,10.0.0.160,10.0.0.1,57342,3123
11:01:37,17,5,10.0.0.54,10.0.0.38,63811,46487
11:01:37,17,5,10.0.0.160,10.0.0.1,57342,3123
11:01:37,17,5,10.0.0.160,10.0.0.1,57342,3123
11:01:37,17,1,10.0.0.123,10.0.0.197,37416,1658
11:01:37,17,5,10.0.0.123,10.0.0.197,37416,1658
11:01:37,17,5,10.0.0.123,10.0.0.197,37416,1658
11:01:37,17,1,10.0.0.33,10.0.0.21,7031,50357
11:01:37,17,5,10.0.0.33,10.0.0.21,7031,50357
11:01:37,17,1,10.0.0.133,10.0.0.91,20118,50637
11:01:37,17,5,10.0.0.33,10.0.0.21,7031,50357
11:01:37,17,5,10.0.0.133,10.0.0.91,20118,50637
11:01:37,17,5,10.0.0.133,10.0.0.91,20118,50637
11:01:37,17,1,10.0.0.133,10.0.0.42,32535,42608
11:01:37,17,5,10.0.0.133,10.0.0.42,32535,42608
11:01:37,17,1,10.0.0.7,10.0.0.193,21536,27182
11:01:37,17,5,10.0.0.7,10.0.0.193,21536,27182
11:01:37,17,5,10.0.0.133,10.0.0.42,32535,42608
11:01:37,17,1,10.0.0.160,10.0.0.1,57342,3123
11:01:37,17,5,10.0.0.160,10.0.0.1,57342,3123
11:01:37,17,5,10.0.0.7,10.0.0.193,21536,27182
11:01:37,17,1,10.0.0.112,10.0.0.55,36521,22544
11:01:37,17,5,10.0.0.112,10.0.0.55,36521,22544
11:01:37,17,5,10.0.0.160,10.0.0.1,57342,3123
11:01:37,17,1,10.0.0.54,10.0.0.133,56312,48916
11:01:37,17,5,10.0.0.54,10.0.0.133,56312,48916
11:01:37,17,5,10.0.0.112,10.0.0.55,36521,22544
11:01:37,17,1,10.0.0.10,10.0.0.68,23843,59188
11:01:37,17,5,10.0.0.10,10.0.0.68,23843,59188
11:01:37,17,5,10.0.0.54,10.0.0.133,56312,48916
11:01:37,17,1,10.0.0.133,10.0.0.200,18668,50535
11:01:37,17,5,10.0.0.133,10.0.0.200,18668,50535
11:01:37,17,5,10.0.0.10,10.0.0.68,23843,59188
11:01:37,17,5,10.0.0.133,10.0.0.200,18668,50535
11:01:37,17,1,10.0.0.54,10.0.0.173,2210,16915
11:01:37,17,5,10.0.0.54,10.0.0.173,2210,16915
11:01:37,17,1,10.0.0.160,10.0.0.1,57342,3123
11:01:37,17,5,10.0.0.160,10.0.0.1,57342,3123
11:01:37,17,5,10.0.0.54,10.0.0.173,2210,16915
11:01:37,17,1,10.0.0.54,10.0.0.126,48104,58667
11:01:37,17,5,10.0.0.54,10.0.0.126,48104,58667
11:01:37,17,5,10.0.0.160,10.0.0.1,57342,3123
11:01:37,17,1,10.0.0.7,10.0.0.85,9679,30715
11:01:37,17,5,10.0.0.54,10.0.0.126,48104,58667
11:01:37,17,5,10.0.0.7,10.0.0.85,9679,30715
11:01:37,17,1,10.0.0.171,10.0.0.166,22955,27158
11:01:37,17,5,10.0.0.171,10.0.0.166,22955,27158
11:01:37,17,5,10.0.0.7,10.0.0.85,9679,30715
11:01:37,17,5,10.0.0.171,10.0.0.166,22955,27158
11:01:37,17,1,10.0.0.57,10.0.0.72,10960,51960
11:01:37,17,5,10.0.0.57,10.0.0.72,10960,51960
11:01:37,17,5,10.0.0.57,10.0.0.72,10960,51960
11:01:37,17,1,10.0.0.10,10.0.0.16,60658,6149
11:01:37,17,5,10.0.0.10,10.0.0.16,60658,6149
11:01:37,17,5,10.0.0.10,10.0.0.16,60658,6149
11:01:37,17,1,10.0.0.123,10.0.0.106,23793,42174
11:01:37,17,5,10.0.0.123,10.0.0.106,23793,42174
11:01:37,17,5,10.0.0.123,10.0.0.106,23793,42174
11:01:37,17,1,10.0.0.123,10.0.0.63,2036,56087
11:01:37,17,5,10.0.0.123,10.0.0.63,2036,56087
11:01:37,17,1,10.0.0.133,10.0.0.95,61519,27183
11:01:37,17,5,10.0.0.123,10.0.0.63,2036,56087
11:01:37,17,5,10.0.0.133,10.0.0.95,61519,27183
11:01:37,17,5,10.0.0.133,10.0.0.95,61519,27183
11:01:37,17,1,10.0.0.54,10.0.0.105,45793,39918
11:01:37,17,5,10.0.0.54,10.0.0.105,45793,39918
11:01:37,17,5,10.0.0.54,10.0.0.105,45793,39918
11:01:37,17,1,10.0.0.10,10.0.0.141,58571,51150
11:01:37,17,1,10.0.0.10,10.0.0.70,9512,50571
11:01:37,17,5,10.0.0.10,10.0.0.141,58571,51150
11:01:37,17,5,10.0.0.10,10.0.0.70,9512,50571
11:01:37,17,5,10.0.0.10,10.0.0.141,58571,51150
11:01:37,17,5,10.0.0.10,10.0.0.70,9512,50571
11:01:37,17,1,10.0.0.160,10.0.0.1,57342,3123
11:01:37,17,5,10.0.0.160,10.0.0.1,57342,3123
11:01:37,17,1,10.0.0.112,10.0.0.105,34474,13715
11:01:37,17,5,10.0.0.112,10.0.0.105,34474,13715
11:01:37,17,5,10.0.0.160,10.0.0.1,57342,3123
11:01:37,17,1,10.0.0.57,10.0.0.119,22256,48361
11:01:37,17,5,10.0.0.57,10.0.0.119,22256,48361
11:01:37,17,5,10.0.0.112,10.0.0.105,34474,13715
11:01:37,17,5,10.0.0.57,10.0.0.119,22256,48361
11:01:37,17,1,10.0.0.33,10.0.0.137,60189,23475
11:01:37,17,1,10.0.0.112,10.0.0.168,62528,5742
11:01:37,17,5,10.0.0.33,10.0.0.137,60189,23475
11:01:37,17,5,10.0.0.112,10.0.0.168,62528,5742
11:01:37,17,5,10.0.0.33,10.0.0.137,60189,23475
11:01:37,17,5,10.0.0.112,10.0.0.168,62528,5742
11:01:37,17,1,10.0.0.33,10.0.0.170,28808,20943
11:01:37,17,5,10.0.0.33,10.0.0.170,28808,20943
11:01:37,17,5,10.0.0.33,10.0.0.170,28808,20943
11:01:38,17,1,10.0.0.123,10.0.0.118,18309,23134
11:01:38,17,5,10.0.0.123,10.0.0.118,18309,23134
11:01:38,17,5,10.0.0.123,10.0.0.118,18309,23134
11:01:38,17,1,10.0.0.7,10.0.0.30,7950,4855
11:01:38,17,5,10.0.0.7,10.0.0.30,7950,4855
11:01:38,17,5,10.0.0.7,10.0.0.30,7950,4855
11:01:38,17,1,10.0.0.123,10.0.0.83,47579,39918
11:01:38,17,5,10.0.0.123,10.0.0.83,47579,39918
11:01:38,17,5,10.0.0.123,10.0.0.83,47579,39918
11:01:38,17,1,10.0.0.160,10.0.0.1,57342,3123
11:01:38,17,5,10.0.0.160,10.0.0.1,57342,3123
11:01:38,17,5,10.0.0.160,10.0.0.1,57342,3123
11:01:38,17,1,10.0.0.7,10.0.0.192,23633,60413
11:01:38,17,5,10.0.0.7,10.0.0.192,23633,60413
11:01:38,17,5,10.0.0.7,10.0.0.192,23633,60413
11:01:38,17,1,10.0.0.54,10.0.0.111,29893,7820
11:01:38,17,5,10.0.0.54,10.0.0.111,29893,7820
11:01:38,17,5,10.0.0.54,10.0.0.111,29893,7820
11:01:38,17,1,10.0.0.33,10.0.0.77,49127,42945
11:01:38,17,5,10.0.0.33,10.0.0.77,49127,42945
11:01:38,17,5,10.0.0.33,10.0.0.77,49127,42945
11:01:38,17,1,10.0.0.7,10.0.0.173,44314,6372
11:01:38,17,5,10.0.0.7,10.0.0.173,44314,6372
11:01:38,17,5,10.0.0.7,10.0.0.173,44314,6372
11:01:38,17,1,10.0.0.123,10.0.0.150,42359,17262
11:01:38,17,5,10.0.0.123,10.0.0.150,42359,17262
11:01:38,17,1,10.0.0.160,10.0.0.1,57342,3123
11:01:38,17,5,10.0.0.123,10.0.0.150,42359,17262
11:01:38,17,5,10.0.0.160,10.0.0.1,57342,3123
11:01:38,17,5,10.0.0.160,10.0.0.1,57342,3123
11:01:38,17,1,10.0.0.10,10.0.0.83,59277,19740
11:01:38,17,5,10.0.0.10,10.0.0.83,59277,19740
11:01:38,17,5,10.0.0.10,10.0.0.83,59277,19740
11:01:38,17,1,10.0.0.57,10.0.0.189,3815,51509
11:01:38,17,5,10.0.0.57,10.0.0.189,3815,51509
11:01:38,17,5,10.0.0.57,10.0.0.189,3815,51509
11:01:38,17,1,10.0.0.171,10.0.0.112,47844,20139
11:01:38,17,5,10.0.0.171,10.0.0.112,47844,20139
11:01:38,17,5,10.0.0.171,10.0.0.112,47844,20139
11:01:38,17,1,10.0.0.112,10.0.0.137,18885,61423
11:01:38,17,5,10.0.0.112,10.0.0.137,18885,61423
11:01:38,17,5,10.0.0.112,10.0.0.137,18885,61423
11:01:38,17,1,10.0.0.54,10.0.0.4,6714,16333
11:01:38,17,1,10.0.0.133,10.0.0.54,2696,33008
11:01:38,17,5,10.0.0.133,10.0.0.54,2696,33008
11:01:38,17,5,10.0.0.133,10.0.0.54,2696,33008
11:01:38,17,1,10.0.0.7,10.0.0.107,487,11665
11:01:38,17,5,10.0.0.7,10.0.0.107,487,11665
11:01:38,17,5,10.0.0.7,10.0.0.107,487,11665
11:01:38,17,1,10.0.0.160,10.0.0.174,29626,5691
11:01:38,17,1,10.0.0.160,10.0.0.108,22773,22582
11:01:38,17,5,10.0.0.160,10.0.0.174,29626,5691
11:01:38,17,5,10.0.0.160,10.0.0.174,29626,5691
11:01:38,17,1,10.0.0.171,10.0.0.28,52363,45763
11:01:38,17,5,10.0.0.160,10.0.0.108,22773,22582
11:01:38,17,5,10.0.0.160,10.0.0.108,22773,22582
11:01:38,17,5,10.0.0.171,10.0.0.28,52363,45763
11:01:38,17,1,10.0.0.10,10.0.0.143,41587,63391
11:01:38,17,5,10.0.0.171,10.0.0.28,52363,45763
11:01:38,17,1,10.0.0.133,10.0.0.158,14977,54231
11:01:38,17,5,10.0.0.10,10.0.0.143,41587,63391
11:01:38,17,5,10.0.0.10,10.0.0.143,41587,63391
11:01:38,17,5,10.0.0.133,10.0.0.158,14977,54231
11:01:38,17,1,10.0.0.160,10.0.0.138,13741,49699
11:01:38,17,5,10.0.0.133,10.0.0.158,14977,54231
11:01:38,17,1,10.0.0.133,10.0.0.167,20662,19351
11:01:38,17,5,10.0.0.160,10.0.0.138,13741,49699
11:01:38,17,5,10.0.0.133,10.0.0.167,20662,19351
11:01:38,17,5,10.0.0.160,10.0.0.138,13741,49699
11:01:38,17,5,10.0.0.133,10.0.0.167,20662,19351
11:01:38,17,1,10.0.0.133,10.0.0.156,24310,16484
11:01:38,17,1,10.0.0.133,10.0.0.82,23345,37442
11:01:38,17,1,10.0.0.160,10.0.0.1,57342,3123
11:01:38,17,5,10.0.0.133,10.0.0.156,24310,16484
11:01:38,17,5,10.0.0.133,10.0.0.82,23345,37442
11:01:38,17,5,10.0.0.133,10.0.0.156,24310,16484
11:01:38,17,1,10.0.0.10,10.0.0.107,57334,61599
11:01:38,17,5,10.0.0.160,10.0.0.1,57342,3123
11:01:38,17,5,10.0.0.133,10.0.0.82,23345,37442
11:01:38,17,5,10.0.0.160,10.0.0.1,57342,3123
11:01:38,17,5,10.0.0.10,10.0.0.107,57334,61599
11:01:38,17,1,10.0.0.112,10.0.0.136,56638,41515
11:01:38,17,5,10.0.0.10,10.0.0.107,57334,61599
11:01:38,17,5,10.0.0.112,10.0.0.136,56638,41515
11:01:38,17,1,10.0.0.57,10.0.0.142,37193,11424
11:01:38,17,1,10.0.0.171,10.0.0.180,47230,32265
11:01:38,17,5,10.0.0.112,10.0.0.136,56638,41515
11:01:38,17,5,10.0.0.57,10.0.0.142,37193,11424
11:01:38,17,5,10.0.0.57,10.0.0.142,37193,11424
11:01:38,17,5,10.0.0.171,10.0.0.180,47230,32265
11:01:38,17,5,10.0.0.171,10.0.0.180,47230,32265
11:01:38,17,1,10.0.0.160,10.0.0.198,55316,47362
11:01:38,17,5,10.0.0.160,10.0.0.198,55316,47362
11:01:38,17,5,10.0.0.160,10.0.0.198,55316,47362
11:01:38,17,1,10.0.0.160,10.0.0.129,54256,9176
11:01:38,17,5,10.0.0.160,10.0.0.129,54256,9176
11:01:38,17,5,10.0.0.160,10.0.0.129,54256,9176
11:01:38,17,1,10.0.0.171,10.0.0.134,4425,8145
11:01:38,17,5,10.0.0.171,10.0.0.134,4425,8145
11:01:38,17,5,10.0.0.171,10.0.0.134,4425,8145
11:01:38,17,1,10.0.0.33,10.0.0.94,19622,25117
11:01:38,17,5,10.0.0.33,10.0.0.94,19622,25117
11:01:38,17,1,10.0.0.10,10.0.0.79,32078,6098
11:01:38,17,1,10.0.0.57,10.0.0.155,7252,14456
11:01:38,17,5,10.0.0.33,10.0.0.94,19622,25117
11:01:38,17,5,10.0.0.10,10.0.0.79,32078,6098
11:01:38,17,5,10.0.0.10,10.0.0.79,32078,6098
11:01:38,17,1,10.0.0.160,10.0.0.38,61182,24103
11:01:38,17,5,10.0.0.57,10.0.0.155,7252,14456
11:01:38,17,5,10.0.0.57,10.0.0.155,7252,14456
11:01:38,17,1,10.0.0.133,10.0.0.78,44037,47692
11:01:38,17,1,10.0.0.123,10.0.0.110,35722,15327
11:01:38,17,5,10.0.0.160,10.0.0.38,61182,24103
11:01:38,17,5,10.0.0.133,10.0.0.78,44037,47692
11:01:38,17,5,10.0.0.160,10.0.0.38,61182,24103
11:01:38,17,5,10.0.0.133,10.0.0.78,44037,47692
11:01:38,17,1,10.0.0.10,10.0.0.77,3655,5460
11:01:38,17,5,10.0.0.123,10.0.0.110,35722,15327
11:01:38,17,5,10.0.0.123,10.0.0.110,35722,15327
11:01:38,17,5,10.0.0.10,10.0.0.77,3655,5460
11:01:38,17,5,10.0.0.10,10.0.0.77,3655,5460
11:01:38,17,1,10.0.0.33,10.0.0.117,5358,35571
11:01:38,17,5,10.0.0.33,10.0.0.117,5358,35571
11:01:39,17,1,10.0.0.112,10.0.0.67,50457,7386
11:01:39,17,5,10.0.0.33,10.0.0.117,5358,35571
11:01:39,17,5,10.0.0.112,10.0.0.67,50457,7386
11:01:39,17,5,10.0.0.112,10.0.0.67,50457,7386
11:01:39,17,1,10.0.0.7,10.0.0.49,47587,47483
11:01:39,17,5,10.0.0.7,10.0.0.49,47587,47483
11:01:39,17,5,10.0.0.7,10.0.0.49,47587,47483
11:01:39,17,1,10.0.0.123,10.0.0.127,14583,42850
11:01:39,17,5,10.0.0.123,10.0.0.127,14583,42850
11:01:39,17,5,10.0.0.123,10.0.0.127,14583,42850
11:01:39,17,1,10.0.0.54,10.0.0.81,1755,46750
11:01:39,17,5,10.0.0.54,10.0.0.81,1755,46750
11:01:39,17,5,10.0.0.54,10.0.0.81,1755,46750
11:01:39,17,1,10.0.0.54,10.0.0.157,30690,28926
11:01:39,17,5,10.0.0.54,10.0.0.157,30690,28926
11:01:39,17,5,10.0.0.54,10.0.0.157,30690,28926
11:01:39,17,1,10.0.0.57,10.0.0.113,32402,19946
11:01:39,17,5,10.0.0.57,10.0.0.113,32402,19946
11:01:39,17,5,10.0.0.57,10.0.0.113,32402,19946
11:01:39,17,1,10.0.0.57,10.0.0.163,35148,39752
11:01:39,17,5,10.0.0.57,10.0.0.163,35148,39752
11:01:39,17,5,10.0.0.57,10.0.0.163,35148,39752
11:01:39,17,1,10.0.0.7,10.0.0.122,62390,309
11:01:39,17,5,10.0.0.7,10.0.0.122,62390,309
11:01:39,17,5,10.0.0.7,10.0.0.122,62390,309
11:01:39,17,1,10.0.0.160,10.0.0.1,57342,3123
11:01:39,17,5,10.0.0.160,10.0.0.1,57342,3123
11:01:39,17,5,10.0.0.160,10.0.0.1,57342,3123
11:01:39,17,1,10.0.0.171,10.0.0.182,24955,34123
11:01:39,17,5,10.0.0.171,10.0.0.182,24955,34123
11:01:39,17,5,10.0.0.171,10.0.0.182,24955,34123
11:01:39,17,1,10.0.0.171,10.0.0.198,47950,27352
11:01:39,17,5,10.0.0.171,10.0.0.198,47950,27352
11:01:39,17,5,10.0.0.171,10.0.0.198,47950,27352
11:01:39,17,1,10.0.0.171,10.0.0.123,27086,30552
11:01:39,17,5,10.0.0.171,10.0.0.123,27086,30552
11:01:39,17,5,10.0.0.171,10.0.0.123,27086,30552
11:01:39,17,1,10.0.0.171,10.0.0.83,46004,25057
11:01:39,17,1,10.0.0.54,10.0.0.54,14852,64292
11:01:39,17,5,10.0.0.171,10.0.0.83,46004,25057
11:01:39,17,5,10.0.0.171,10.0.0.83,46004,25057
11:01:39,17,5,10.0.0.54,10.0.0.54,14852,64292
11:01:39,17,5,10.0.0.54,10.0.0.54,14852,64292
11:01:39,17,1,10.0.0.123,10.0.0.112,8474,19133
11:01:39,17,5,10.0.0.123,10.0.0.112,8474,19133
11:01:39,17,5,10.0.0.123,10.0.0.112,8474,19133
11:01:39,17,1,10.0.0.160,10.0.0.1,57342,3123
11:01:39,17,5,10.0.0.160,10.0.0.1,57342,3123
11:01:39,17,1,10.0.0.160,10.0.0.117,10192,27884
11:01:39,17,5,10.0.0.160,10.0.0.117,10192,27884
11:01:39,17,5,10.0.0.160,10.0.0.1,57342,3123
11:01:39,17,5,10.0.0.160,10.0.0.117,10192,27884
11:01:39,17,1,10.0.0.57,10.0.0.156,17308,12108
11:01:39,17,5,10.0.0.57,10.0.0.156,17308,12108
11:01:39,17,1,10.0.0.160,10.0.0.1,57342,3123
11:01:39,17,5,10.0.0.160,10.0.0.1,57342,3123
11:01:39,17,5,10.0.0.57,10.0.0.156,17308,12108
11:01:39,17,1,10.0.0.57,10.0.0.116,57285,25796
11:01:39,17,5,10.0.0.160,10.0.0.1,57342,3123
11:01:39,17,5,10.0.0.57,10.0.0.116,57285,25796
11:01:39,17,5,10.0.0.57,10.0.0.116,57285,25796
11:01:39,17,1,10.0.0.123,10.0.0.197,37416,1658
11:01:39,17,5,10.0.0.123,10.0.0.197,37416,1658
11:01:39,17,5,10.0.0.123,10.0.0.197,37416,1658
11:01:39,17,1,10.0.0.123,10.0.0.52,33772,28316
11:01:39,17,5,10.0.0.123,10.0.0.52,33772,28316
11:01:39,17,1,10.0.0.133,10.0.0.110,63957,31852
11:01:39,17,5,10.0.0.123,10.0.0.52,33772,28316
11:01:39,17,1,10.0.0.54,10.0.0.119,47070,13780
11:01:39,17,5,10.0.0.133,10.0.0.110,63957,31852
11:01:40,17,5,10.0.0.133,10.0.0.110,63957,31852
11:01:40,17,5,10.0.0.54,10.0.0.119,47070,13780
11:01:40,17,5,10.0.0.54,10.0.0.119,47070,13780
11:01:40,17,1,10.0.0.10,10.0.0.145,56271,57381
11:01:40,17,5,10.0.0.10,10.0.0.145,56271,57381
11:01:40,17,5,10.0.0.10,10.0.0.145,56271,57381
11:01:40,17,1,10.0.0.7,10.0.0.177,3714,43090
11:01:40,17,1,10.0.0.133,10.0.0.42,32535,42608
11:01:40,17,5,10.0.0.7,10.0.0.177,3714,43090
11:01:40,17,5,10.0.0.7,10.0.0.177,3714,43090
11:01:40,17,1,10.0.0.10,10.0.0.176,25828,22787
11:01:40,17,5,10.0.0.133,10.0.0.42,32535,42608
11:01:40,17,5,10.0.0.133,10.0.0.42,32535,42608
11:01:40,17,1,10.0.0.33,10.0.0.21,7031,50357
11:01:40,17,5,10.0.0.10,10.0.0.176,25828,22787
11:01:40,17,1,10.0.0.33,10.0.0.107,33106,12171
11:01:40,17,5,10.0.0.10,10.0.0.176,25828,22787
11:01:40,17,5,10.0.0.33,10.0.0.21,7031,50357
11:01:40,17,5,10.0.0.33,10.0.0.107,33106,12171
11:01:40,17,1,10.0.0.112,10.0.0.55,36521,22544
11:01:40,17,5,10.0.0.33,10.0.0.21,7031,50357
11:01:40,17,5,10.0.0.112,10.0.0.55,36521,22544
11:01:40,17,5,10.0.0.33,10.0.0.107,33106,12171
11:01:40,17,5,10.0.0.112,10.0.0.55,36521,22544
11:01:40,17,1,10.0.0.133,10.0.0.91,20118,50637
11:01:40,17,5,10.0.0.133,10.0.0.91,20118,50637
11:01:40,17,5,10.0.0.133,10.0.0.91,20118,50637
11:01:40,17,1,10.0.0.123,10.0.0.180,58780,35116
11:01:40,17,5,10.0.0.123,10.0.0.180,58780,35116
11:01:40,17,5,10.0.0.123,10.0.0.180,58780,35116
11:01:40,17,1,10.0.0.10,10.0.0.161,2567,27759
11:01:40,17,5,10.0.0.10,10.0.0.161,2567,27759
11:01:40,17,5,10.0.0.10,10.0.0.161,2567,27759
11:01:40,17,1,10.0.0.7,10.0.0.14,1197,25183
11:01:40,17,5,10.0.0.7,10.0.0.14,1197,25183
11:01:40,17,5,10.0.0.7,10.0.0.14,1197,25183
11:01:40,17,1,10.0.0.7,10.0.0.85,9679,30715
11:01:40,17,5,10.0.0.7,10.0.0.85,9679,30715
11:01:40,17,5,10.0.0.7,10.0.0.85,9679,30715
11:01:40,17,1,10.0.0.160,10.0.0.1,57342,3123
11:01:40,17,5,10.0.0.160,10.0.0.1,57342,3123
11:01:40,17,5,10.0.0.160,10.0.0.1,57342,3123
11:01:40,17,1,10.0.0.54,10.0.0.133,56312,48916
11:01:40,17,5,10.0.0.54,10.0.0.133,56312,48916
11:01:40,17,5,10.0.0.54,10.0.0.133,56312,48916
11:01:40,17,1,10.0.0.57,10.0.0.65,50762,43654
11:01:40,17,5,10.0.0.57,10.0.0.65,50762,43654
11:01:40,17,5,10.0.0.57,10.0.0.65,50762,43654
11:01:40,17,1,10.0.0.10,10.0.0.16,60658,6149
11:01:40,17,5,10.0.0.10,10.0.0.16,60658,6149
11:01:40,17,5,10.0.0.10,10.0.0.16,60658,6149
11:01:40,17,1,10.0.0.54,10.0.0.173,2210,16915
11:01:40,17,5,10.0.0.54,10.0.0.173,2210,16915
11:01:40,17,5,10.0.0.54,10.0.0.173,2210,16915
11:03:16,17,1,10.0.0.148,10.0.0.10,11734,14671
11:03:16,17,5,10.0.0.148,10.0.0.10,11734,14671
11:03:16,17,5,10.0.0.148,10.0.0.10,11734,14671
11:03:16,17,1,10.0.0.148,10.0.0.5,38877,54671
11:03:16,17,5,10.0.0.148,10.0.0.5,38877,54671
11:03:16,17,1,10.0.0.183,10.0.0.10,7464,56506
11:03:16,17,5,10.0.0.183,10.0.0.10,7464,56506
11:03:16,17,5,10.0.0.183,10.0.0.10,7464,56506
11:03:16,17,1,10.0.0.183,10.0.0.2,41033,36310
11:03:16,17,1,10.0.0.46,10.0.0.6,5366,29443
11:03:16,17,5,10.0.0.46,10.0.0.6,5366,29443
11:03:16,17,5,10.0.0.46,10.0.0.6,5366,29443
11:03:17,17,1,10.0.0.111,10.0.0.13,11981,45941
11:03:17,17,1,10.0.0.148,10.0.0.5,49354,2399
11:03:17,17,5,10.0.0.148,10.0.0.5,49354,2399
11:03:17,17,1,10.0.0.111,10.0.0.12,56816,17531
11:03:17,17,5,10.0.0.111,10.0.0.12,56816,17531
11:03:17,17,5,10.0.0.111,10.0.0.12,56816,17531
11:03:17,17,1,10.0.0.148,10.0.0.12,8211,26376
11:03:17,17,5,10.0.0.148,10.0.0.12,8211,26376
11:03:17,17,5,10.0.0.148,10.0.0.12,8211,26376
11:03:18,17,1,10.0.0.148,10.0.0.13,23634,25007
11:03:18,17,1,10.0.0.111,10.0.0.123,31739,61160
11:03:18,17,5,10.0.0.111,10.0.0.123,31739,61160
11:03:18,17,5,10.0.0.111,10.0.0.123,31739,61160
11:03:18,17,1,10.0.0.111,10.0.0.182,24047,50627
11:03:18,17,5,10.0.0.111,10.0.0.182,24047,50627
11:03:18,17,5,10.0.0.111,10.0.0.182,24047,50627
11:03:18,17,1,10.0.0.148,10.0.0.198,39864,17459
11:03:18,17,5,10.0.0.148,10.0.0.198,39864,17459
11:03:18,17,5,10.0.0.148,10.0.0.198,39864,17459
11:03:18,17,1,10.0.0.183,10.0.0.62,10732,54463
11:03:18,17,5,10.0.0.183,10.0.0.62,10732,54463
11:03:18,17,5,10.0.0.183,10.0.0.62,10732,54463
11:03:18,17,1,10.0.0.148,10.0.0.143,38995,7654
11:03:18,17,1,10.0.0.148,10.0.0.69,38044,4498
11:03:18,17,5,10.0.0.148,10.0.0.143,38995,7654
11:03:18,17,5,10.0.0.148,10.0.0.69,38044,4498
11:03:18,17,5,10.0.0.148,10.0.0.143,38995,7654
11:03:18,17,1,10.0.0.111,10.0.0.21,19296,53060
11:03:18,17,5,10.0.0.111,10.0.0.21,19296,53060
11:03:18,17,5,10.0.0.148,10.0.0.69,38044,4498
11:03:18,17,1,10.0.0.46,10.0.0.102,10036,49871
11:03:18,17,5,10.0.0.46,10.0.0.102,10036,49871
11:03:18,17,5,10.0.0.111,10.0.0.21,19296,53060
11:03:18,17,5,10.0.0.46,10.0.0.102,10036,49871
11:03:18,17,1,10.0.0.46,10.0.0.188,18723,41413
11:03:18,17,5,10.0.0.46,10.0.0.188,18723,41413
11:03:18,17,1,10.0.0.46,10.0.0.51,61072,50648
11:03:18,17,5,10.0.0.46,10.0.0.51,61072,50648
11:03:18,17,5,10.0.0.46,10.0.0.188,18723,41413
11:03:18,17,1,10.0.0.46,10.0.0.39,46530,60243
11:03:18,17,5,10.0.0.46,10.0.0.39,46530,60243
11:03:18,17,5,10.0.0.46,10.0.0.51,61072,50648
11:03:18,17,5,10.0.0.46,10.0.0.39,46530,60243
11:03:18,17,1,10.0.0.46,10.0.0.14,23069,31724
11:03:18,17,5,10.0.0.46,10.0.0.14,23069,31724
11:03:18,17,1,10.0.0.183,10.0.0.21,12683,27658
11:03:18,17,1,10.0.0.148,10.0.0.132,49350,17513
11:03:18,17,5,10.0.0.46,10.0.0.14,23069,31724
11:03:18,17,5,10.0.0.183,10.0.0.21,12683,27658
11:03:18,17,5,10.0.0.148,10.0.0.132,49350,17513
11:03:18,17,5,10.0.0.183,10.0.0.21,12683,27658
11:03:18,17,1,10.0.0.183,10.0.0.115,172,14265
11:03:18,17,5,10.0.0.183,10.0.0.115,172,14265
11:03:18,17,5,10.0.0.148,10.0.0.132,49350,17513
11:03:18,17,1,10.0.0.183,10.0.0.179,26098,32869
11:03:18,17,5,10.0.0.183,10.0.0.179,26098,32869
11:03:18,17,5,10.0.0.183,10.0.0.115,172,14265
11:03:18,17,1,10.0.0.111,10.0.0.166,22849,15308
11:03:18,17,5,10.0.0.111,10.0.0.166,22849,15308
11:03:18,17,5,10.0.0.183,10.0.0.179,26098,32869
11:03:18,17,1,10.0.0.183,10.0.0.30,29367,43868
11:03:18,17,1,10.0.0.46,10.0.0.50,56401,63226
11:03:18,17,5,10.0.0.111,10.0.0.166,22849,15308
11:03:18,17,5,10.0.0.183,10.0.0.30,29367,43868
11:03:18,17,5,10.0.0.46,10.0.0.50,56401,63226
11:03:18,17,5,10.0.0.183,10.0.0.30,29367,43868
11:03:18,17,5,10.0.0.46,10.0.0.50,56401,63226
11:03:18,17,1,10.0.0.183,10.0.0.131,15703,29807
11:03:18,17,5,10.0.0.183,10.0.0.131,15703,29807
11:03:18,17,1,10.0.0.111,10.0.0.129,4424,15349
11:03:18,17,5,10.0.0.111,10.0.0.129,4424,15349
11:03:18,17,5,10.0.0.183,10.0.0.131,15703,29807
11:03:18,17,5,10.0.0.111,10.0.0.129,4424,15349
11:03:18,17,1,10.0.0.111,10.0.0.172,25529,14023
11:03:18,17,5,10.0.0.111,10.0.0.172,25529,14023
11:03:18,17,1,10.0.0.46,10.0.0.52,122,8456
11:03:18,17,1,10.0.0.111,10.0.0.45,347,34063
11:03:18,17,5,10.0.0.46,10.0.0.52,122,8456
11:03:18,17,5,10.0.0.111,10.0.0.172,25529,14023
11:03:18,17,1,10.0.0.111,10.0.0.127,51704,28634
11:03:18,17,5,10.0.0.111,10.0.0.45,347,34063
11:03:18,17,5,10.0.0.46,10.0.0.52,122,8456
11:03:18,17,1,10.0.0.183,10.0.0.76,24960,62394
11:03:18,17,1,10.0.0.111,10.0.0.12,6663,50826
11:03:18,17,5,10.0.0.111,10.0.0.127,51704,28634
11:03:18,17,5,10.0.0.183,10.0.0.76,24960,62394
11:03:18,17,5,10.0.0.111,10.0.0.45,347,34063
11:03:18,17,5,10.0.0.111,10.0.0.127,51704,28634
11:03:18,17,5,10.0.0.111,10.0.0.12,6663,50826
11:03:18,17,5,10.0.0.183,10.0.0.76,24960,62394
11:03:18,17,5,10.0.0.111,10.0.0.12,6663,50826
11:03:18,17,1,10.0.0.46,10.0.0.188,26900,28701
11:03:18,17,5,10.0.0.46,10.0.0.188,26900,28701
11:03:18,17,5,10.0.0.46,10.0.0.188,26900,28701
11:03:18,17,1,10.0.0.111,10.0.0.32,17592,2077
11:03:19,17,5,10.0.0.111,10.0.0.32,17592,2077
11:03:19,17,1,10.0.0.111,10.0.0.146,46869,16637
11:03:19,17,1,10.0.0.148,10.0.0.93,15144,19802
11:03:19,17,5,10.0.0.111,10.0.0.32,17592,2077
11:03:19,17,5,10.0.0.111,10.0.0.146,46869,16637
11:03:19,17,5,10.0.0.111,10.0.0.146,46869,16637
11:03:19,17,1,10.0.0.183,10.0.0.126,31975,5978
11:03:19,17,5,10.0.0.148,10.0.0.93,15144,19802
11:03:19,17,5,10.0.0.148,10.0.0.93,15144,19802
11:03:19,17,1,10.0.0.183,10.0.0.137,34259,12728
11:03:19,17,5,10.0.0.183,10.0.0.126,31975,5978
11:03:19,17,5,10.0.0.183,10.0.0.126,31975,5978
11:03:19,17,5,10.0.0.183,10.0.0.137,34259,12728
11:03:19,17,5,10.0.0.183,10.0.0.137,34259,12728
11:03:19,17,1,10.0.0.111,10.0.0.3,14477,42448
11:03:19,17,1,10.0.0.183,10.0.0.146,14541,51631
11:03:19,17,5,10.0.0.183,10.0.0.146,14541,51631
11:03:19,17,5,10.0.0.183,10.0.0.146,14541,51631
11:03:19,17,1,10.0.0.183,10.0.0.134,28814,45481
11:03:19,17,5,10.0.0.183,10.0.0.134,28814,45481
11:03:19,17,1,10.0.0.148,10.0.0.109,64408,7915
11:03:19,17,5,10.0.0.148,10.0.0.109,64408,7915
11:03:19,17,5,10.0.0.183,10.0.0.134,28814,45481
11:03:19,17,5,10.0.0.148,10.0.0.109,64408,7915
11:03:19,17,1,10.0.0.148,10.0.0.28,55125,6376
11:03:19,17,5,10.0.0.148,10.0.0.28,55125,6376
11:03:19,17,1,10.0.0.46,10.0.0.189,2518,25820
11:03:19,17,5,10.0.0.46,10.0.0.189,2518,25820
11:03:19,17,5,10.0.0.148,10.0.0.28,55125,6376
11:03:19,17,1,10.0.0.46,10.0.0.123,38357,31107
11:03:19,17,5,10.0.0.46,10.0.0.123,38357,31107
11:03:19,17,5,10.0.0.46,10.0.0.189,2518,25820
11:03:19,17,1,10.0.0.46,10.0.0.109,6591,40709
11:03:19,17,5,10.0.0.46,10.0.0.109,6591,40709
11:03:19,17,5,10.0.0.46,10.0.0.123,38357,31107
11:03:19,17,5,10.0.0.46,10.0.0.109,6591,40709
11:03:19,17,1,10.0.0.111,10.0.0.156,12727,57873
11:03:19,17,5,10.0.0.111,10.0.0.156,12727,57873
11:03:19,17,5,10.0.0.111,10.0.0.156,12727,57873
11:03:19,17,1,10.0.0.183,10.0.0.192,29936,3562
11:03:19,17,5,10.0.0.183,10.0.0.192,29936,3562
11:03:19,17,1,10.0.0.46,10.0.0.61,9496,37665
11:03:19,17,5,10.0.0.46,10.0.0.61,9496,37665
11:03:19,17,5,10.0.0.183,10.0.0.192,29936,3562
11:03:19,17,5,10.0.0.46,10.0.0.61,9496,37665
11:03:19,17,1,10.0.0.111,10.0.0.78,8331,20109
11:03:19,17,1,10.0.0.148,10.0.0.164,6250,38121
11:03:19,17,5,10.0.0.111,10.0.0.78,8331,20109
11:03:19,17,5,10.0.0.148,10.0.0.164,6250,38121
11:03:19,17,5,10.0.0.111,10.0.0.78,8331,20109
11:03:19,17,5,10.0.0.148,10.0.0.164,6250,38121
11:03:19,17,1,10.0.0.148,10.0.0.109,25175,1074
11:03:19,17,5,10.0.0.148,10.0.0.109,25175,1074
11:03:19,17,1,10.0.0.183,10.0.0.45,16383,542
11:03:19,17,5,10.0.0.183,10.0.0.45,16383,542
11:03:19,17,5,10.0.0.148,10.0.0.109,25175,1074
11:03:19,17,1,10.0.0.148,10.0.0.143,33259,6385
11:03:19,17,5,10.0.0.183,10.0.0.45,16383,542
11:03:19,17,5,10.0.0.148,10.0.0.143,33259,6385
11:03:19,17,5,10.0.0.148,10.0.0.143,33259,6385
11:03:19,17,1,10.0.0.111,10.0.0.64,42804,14782
11:03:19,17,5,10.0.0.111,10.0.0.64,42804,14782
11:03:19,17,1,10.0.0.111,10.0.0.185,37350,20213
11:03:19,17,5,10.0.0.111,10.0.0.185,37350,20213
11:03:19,17,5,10.0.0.111,10.0.0.64,42804,14782
11:03:19,17,5,10.0.0.111,10.0.0.185,37350,20213
11:03:19,17,1,10.0.0.111,10.0.0.46,62308,2823
11:03:19,17,5,10.0.0.111,10.0.0.46,62308,2823
11:03:19,17,5,10.0.0.111,10.0.0.46,62308,2823
11:03:19,17,1,10.0.0.111,10.0.0.112,21077,58080
11:03:19,17,5,10.0.0.111,10.0.0.112,21077,58080
11:03:19,17,5,10.0.0.111,10.0.0.112,21077,58080
11:03:19,17,1,10.0.0.111,10.0.0.93,38170,232
11:03:19,17,5,10.0.0.111,10.0.0.93,38170,232
11:03:19,17,5,10.0.0.111,10.0.0.93,38170,232
11:03:19,17,1,10.0.0.46,10.0.0.35,1404,41092
11:03:19,17,5,10.0.0.46,10.0.0.35,1404,41092
11:03:19,17,1,10.0.0.148,10.0.0.104,22667,62201
11:03:19,17,5,10.0.0.148,10.0.0.104,22667,62201
11:03:19,17,5,10.0.0.46,10.0.0.35,1404,41092
11:03:19,17,5,10.0.0.148,10.0.0.104,22667,62201
11:03:19,17,1,10.0.0.183,10.0.0.54,39097,60440
11:03:19,17,5,10.0.0.183,10.0.0.54,39097,60440
11:03:19,17,5,10.0.0.183,10.0.0.54,39097,60440
11:03:19,17,1,10.0.0.183,10.0.0.91,36631,45364
11:03:19,17,5,10.0.0.183,10.0.0.91,36631,45364
11:03:19,17,5,10.0.0.183,10.0.0.91,36631,45364
11:03:19,17,1,10.0.0.148,10.0.0.107,11678,56391
11:03:19,17,5,10.0.0.148,10.0.0.107,11678,56391
11:03:19,17,5,10.0.0.148,10.0.0.107,11678,56391
11:03:19,17,1,10.0.0.46,10.0.0.48,37340,39678
11:03:19,17,5,10.0.0.46,10.0.0.48,37340,39678
11:03:19,17,5,10.0.0.46,10.0.0.48,37340,39678
11:03:19,17,1,10.0.0.183,10.0.0.151,31607,11041
11:03:19,17,5,10.0.0.183,10.0.0.151,31607,11041
11:03:19,17,5,10.0.0.183,10.0.0.151,31607,11041
11:03:19,17,1,10.0.0.148,10.0.0.62,44617,26631
11:03:19,17,5,10.0.0.148,10.0.0.62,44617,26631
11:03:20,17,5,10.0.0.148,10.0.0.62,44617,26631
11:03:20,17,1,10.0.0.46,10.0.0.198,12903,24204
11:03:20,17,5,10.0.0.46,10.0.0.198,12903,24204
11:03:20,17,5,10.0.0.46,10.0.0.198,12903,24204
11:03:20,17,1,10.0.0.111,10.0.0.84,44108,42997
11:03:20,17,5,10.0.0.111,10.0.0.84,44108,42997
11:03:20,17,5,10.0.0.111,10.0.0.84,44108,42997
11:03:20,17,1,10.0.0.111,10.0.0.14,36200,58010
11:03:20,17,5,10.0.0.111,10.0.0.14,36200,58010
11:03:20,17,5,10.0.0.111,10.0.0.14,36200,58010
11:03:20,17,1,10.0.0.111,10.0.0.179,49769,39350
11:03:20,17,5,10.0.0.111,10.0.0.179,49769,39350
11:03:20,17,5,10.0.0.111,10.0.0.179,49769,39350
11:03:20,17,1,10.0.0.111,10.0.0.162,40275,901
11:03:20,17,5,10.0.0.111,10.0.0.162,40275,901
11:03:20,17,5,10.0.0.111,10.0.0.162,40275,901
11:03:20,17,1,10.0.0.183,10.0.0.151,30907,10621
11:03:20,17,5,10.0.0.183,10.0.0.151,30907,10621
11:03:20,17,5,10.0.0.183,10.0.0.151,30907,10621
11:03:20,17,1,10.0.0.183,10.0.0.143,22015,44808
11:03:20,17,5,10.0.0.183,10.0.0.143,22015,44808
11:03:20,17,1,10.0.0.183,10.0.0.199,60956,24102
11:03:20,17,5,10.0.0.183,10.0.0.143,22015,44808
11:03:20,17,5,10.0.0.183,10.0.0.199,60956,24102
11:03:20,17,5,10.0.0.183,10.0.0.199,60956,24102
11:03:20,17,1,10.0.0.46,10.0.0.108,22390,37530
11:03:20,17,5,10.0.0.46,10.0.0.108,22390,37530
11:03:20,17,5,10.0.0.46,10.0.0.108,22390,37530
11:03:20,17,1,10.0.0.111,10.0.0.190,27960,23683
11:03:20,17,5,10.0.0.111,10.0.0.190,27960,23683
11:03:20,17,5,10.0.0.111,10.0.0.190,27960,23683
11:03:20,17,1,10.0.0.111,10.0.0.113,50840,28048
11:03:20,17,5,10.0.0.111,10.0.0.113,50840,28048
11:03:20,17,5,10.0.0.111,10.0.0.113,50840,28048
11:03:20,17,1,10.0.0.111,10.0.0.67,14337,1501
11:03:20,17,5,10.0.0.111,10.0.0.67,14337,1501
11:03:20,17,1,10.0.0.46,10.0.0.107,30027,5932
11:03:20,17,5,10.0.0.46,10.0.0.107,30027,5932
11:03:20,17,5,10.0.0.111,10.0.0.67,14337,1501
11:03:20,17,5,10.0.0.46,10.0.0.107,30027,5932
11:03:20,17,1,10.0.0.46,10.0.0.164,42069,22485
11:03:20,17,5,10.0.0.46,10.0.0.164,42069,22485
11:03:20,17,5,10.0.0.46,10.0.0.164,42069,22485
11:03:20,17,1,10.0.0.46,10.0.0.199,13608,45078
11:03:20,17,5,10.0.0.46,10.0.0.199,13608,45078
11:03:20,17,5,10.0.0.46,10.0.0.199,13608,45078
11:03:20,17,1,10.0.0.111,10.0.0.75,64309,11787
11:03:20,17,5,10.0.0.111,10.0.0.75,64309,11787
11:03:20,17,5,10.0.0.111,10.0.0.75,64309,11787
11:03:20,17,1,10.0.0.183,10.0.0.51,62064,47955
11:03:20,17,5,10.0.0.183,10.0.0.51,62064,47955
11:03:20,17,5,10.0.0.183,10.0.0.51,62064,47955
11:03:20,17,1,10.0.0.148,10.0.0.190,3389,6892
11:03:20,17,5,10.0.0.148,10.0.0.190,3389,6892
11:03:20,17,5,10.0.0.148,10.0.0.190,3389,6892
11:03:21,17,1,10.0.0.148,10.0.0.178,6543,61329
11:03:21,17,1,10.0.0.148,10.0.0.151,55773,46757
11:03:21,17,5,10.0.0.148,10.0.0.178,6543,61329
11:03:21,17,5,10.0.0.148,10.0.0.151,55773,46757
11:03:21,17,5,10.0.0.148,10.0.0.178,6543,61329
11:03:21,17,5,10.0.0.148,10.0.0.151,55773,46757
11:03:21,17,1,10.0.0.111,10.0.0.49,28837,44603
11:03:21,17,5,10.0.0.111,10.0.0.49,28837,44603
11:03:21,17,5,10.0.0.111,10.0.0.49,28837,44603
11:03:21,17,1,10.0.0.183,10.0.0.100,34453,51730
11:03:21,17,5,10.0.0.183,10.0.0.100,34453,51730
11:03:21,17,5,10.0.0.183,10.0.0.100,34453,51730
11:03:21,17,1,10.0.0.111,10.0.0.193,18535,5706
11:03:21,17,5,10.0.0.111,10.0.0.193,18535,5706
11:03:21,17,1,10.0.0.148,10.0.0.33,46627,15945
11:03:21,17,5,10.0.0.111,10.0.0.193,18535,5706
11:03:21,17,5,10.0.0.148,10.0.0.33,46627,15945
11:03:21,17,5,10.0.0.148,10.0.0.33,46627,15945
11:03:21,17,1,10.0.0.111,10.0.0.166,25949,24641
11:03:21,17,5,10.0.0.111,10.0.0.166,25949,24641
11:03:21,17,5,10.0.0.111,10.0.0.166,25949,24641
11:03:21,17,1,10.0.0.46,10.0.0.170,16706,5106
11:03:21,17,5,10.0.0.46,10.0.0.170,16706,5106
11:03:21,17,5,10.0.0.46,10.0.0.170,16706,5106
11:03:21,17,1,10.0.0.111,10.0.0.182,24047,50627
11:03:21,17,5,10.0.0.111,10.0.0.182,24047,50627
11:03:21,17,5,10.0.0.111,10.0.0.182,24047,50627
11:03:21,17,1,10.0.0.148,10.0.0.167,18249,41734
11:03:21,17,5,10.0.0.148,10.0.0.167,18249,41734
11:03:21,17,5,10.0.0.148,10.0.0.167,18249,41734
11:03:21,17,1,10.0.0.148,10.0.0.146,52874,7279
11:03:21,17,5,10.0.0.148,10.0.0.146,52874,7279
11:03:21,17,5,10.0.0.148,10.0.0.146,52874,7279
11:03:21,17,1,10.0.0.111,10.0.0.30,34219,51876
11:03:21,17,5,10.0.0.111,10.0.0.30,34219,51876
11:03:21,17,5,10.0.0.111,10.0.0.30,34219,51876
11:03:21,17,1,10.0.0.148,10.0.0.132,49350,17513
11:03:21,17,5,10.0.0.148,10.0.0.132,49350,17513
11:03:21,17,5,10.0.0.148,10.0.0.132,49350,17513
11:03:21,17,1,10.0.0.111,10.0.0.31,59060,60775
11:03:21,17,5,10.0.0.111,10.0.0.31,59060,60775
11:03:21,17,5,10.0.0.111,10.0.0.31,59060,60775
11:03:21,17,1,10.0.0.111,10.0.0.58,17025,8608
11:03:21,17,5,10.0.0.111,10.0.0.58,17025,8608
11:03:21,17,5,10.0.0.111,10.0.0.58,17025,8608
11:03:21,17,1,10.0.0.111,10.0.0.123,31739,61160
11:03:21,17,5,10.0.0.111,10.0.0.123,31739,61160
11:03:21,17,5,10.0.0.111,10.0.0.123,31739,61160
11:03:22,17,1,10.0.0.111,10.0.0.166,22849,15308
11:03:22,17,5,10.0.0.111,10.0.0.166,22849,15308
11:03:22,17,5,10.0.0.111,10.0.0.166,22849,15308
11:03:22,17,1,10.0.0.46,10.0.0.51,61072,50648
11:03:22,17,5,10.0.0.46,10.0.0.51,61072,50648
11:03:22,17,5,10.0.0.46,10.0.0.51,61072,50648
11:03:22,17,1,10.0.0.111,10.0.0.114,35219,41252
11:03:22,17,5,10.0.0.111,10.0.0.114,35219,41252
11:03:22,17,5,10.0.0.111,10.0.0.114,35219,41252
11:03:22,17,1,10.0.0.46,10.0.0.50,56401,63226
11:03:22,17,5,10.0.0.46,10.0.0.50,56401,63226
11:03:22,17,5,10.0.0.46,10.0.0.50,56401,63226
11:03:22,17,1,10.0.0.46,10.0.0.52,122,8456
11:03:22,17,1,10.0.0.46,10.0.0.19,22193,60418
11:03:22,17,5,10.0.0.46,10.0.0.52,122,8456
11:03:22,17,5,10.0.0.46,10.0.0.19,22193,60418
11:03:22,17,5,10.0.0.46,10.0.0.52,122,8456
11:03:22,17,5,10.0.0.46,10.0.0.19,22193,60418
11:03:22,17,1,10.0.0.183,10.0.0.21,12683,27658
11:03:22,17,5,10.0.0.183,10.0.0.21,12683,27658
11:03:22,17,5,10.0.0.183,10.0.0.21,12683,27658
11:03:22,17,1,10.0.0.46,10.0.0.172,51796,59121
11:03:22,17,5,10.0.0.46,10.0.0.172,51796,59121
11:03:22,17,5,10.0.0.46,10.0.0.172,51796,59121
11:03:22,17,1,10.0.0.111,10.0.0.9,63059,21984
11:03:22,17,5,10.0.0.111,10.0.0.9,63059,21984
11:03:22,17,5,10.0.0.111,10.0.0.9,63059,21984
11:03:22,17,1,10.0.0.183,10.0.0.131,15703,29807
11:03:22,17,5,10.0.0.183,10.0.0.131,15703,29807
11:03:22,17,5,10.0.0.183,10.0.0.131,15703,29807
11:03:22,17,1,10.0.0.148,10.0.0.28,55125,6376
11:03:22,17,1,10.0.0.111,10.0.0.45,347,34063
11:03:22,17,5,10.0.0.148,10.0.0.28,55125,6376
11:03:22,17,5,10.0.0.111,10.0.0.45,347,34063
11:03:22,17,5,10.0.0.148,10.0.0.28,55125,6376
11:03:22,17,5,10.0.0.111,10.0.0.45,347,34063
11:03:22,17,1,10.0.0.183,10.0.0.154,39643,39030
11:03:22,17,5,10.0.0.183,10.0.0.154,39643,39030
11:03:22,17,5,10.0.0.183,10.0.0.154,39643,39030
11:03:22,17,1,10.0.0.46,10.0.0.39,46530,60243
11:03:22,17,5,10.0.0.46,10.0.0.39,46530,60243
11:03:22,17,5,10.0.0.46,10.0.0.39,46530,60243
11:03:22,17,1,10.0.0.183,10.0.0.62,10732,54463
11:03:22,17,5,10.0.0.183,10.0.0.62,10732,54463
11:03:22,17,5,10.0.0.183,10.0.0.62,10732,54463
11:03:22,17,1,10.0.0.46,10.0.0.109,6591,40709
11:03:22,17,5,10.0.0.46,10.0.0.109,6591,40709
11:03:22,17,5,10.0.0.46,10.0.0.109,6591,40709
11:03:22,17,1,10.0.0.148,10.0.0.69,38044,4498
11:03:22,17,5,10.0.0.148,10.0.0.69,38044,4498
11:03:22,17,5,10.0.0.148,10.0.0.69,38044,4498
11:03:22,17,1,10.0.0.148,10.0.0.198,39864,17459
11:03:22,17,5,10.0.0.148,10.0.0.198,39864,17459
11:03:22,17,5,10.0.0.148,10.0.0.198,39864,17459
11:03:22,17,1,10.0.0.183,10.0.0.83,31647,3451
11:03:22,17,5,10.0.0.183,10.0.0.83,31647,3451
11:03:22,17,5,10.0.0.183,10.0.0.83,31647,3451
11:03:22,17,1,10.0.0.111,10.0.0.129,4424,15349
11:03:22,17,5,10.0.0.111,10.0.0.129,4424,15349
11:03:22,17,5,10.0.0.111,10.0.0.129,4424,15349
11:03:22,17,1,10.0.0.111,10.0.0.21,19296,53060
11:03:22,17,5,10.0.0.111,10.0.0.21,19296,53060
11:03:22,17,5,10.0.0.111,10.0.0.21,19296,53060
11:03:22,17,1,10.0.0.46,10.0.0.14,23069,31724
11:03:22,17,5,10.0.0.46,10.0.0.14,23069,31724
11:03:22,17,5,10.0.0.46,10.0.0.14,23069,31724
11:03:22,17,1,10.0.0.111,10.0.0.64,42804,14782
11:03:22,17,5,10.0.0.111,10.0.0.64,42804,14782
11:03:22,17,5,10.0.0.111,10.0.0.64,42804,14782
11:03:22,17,1,10.0.0.183,10.0.0.146,14541,51631
11:03:22,17,5,10.0.0.183,10.0.0.146,14541,51631
11:03:22,17,5,10.0.0.183,10.0.0.146,14541,51631
11:03:22,17,1,10.0.0.46,10.0.0.102,10036,49871
11:03:22,17,5,10.0.0.46,10.0.0.102,10036,49871
11:03:22,17,5,10.0.0.46,10.0.0.102,10036,49871
11:03:22,17,1,10.0.0.111,10.0.0.172,25529,14023
11:03:22,17,5,10.0.0.111,10.0.0.172,25529,14023
11:03:22,17,1,10.0.0.46,10.0.0.61,9496,37665
11:03:22,17,5,10.0.0.111,10.0.0.172,25529,14023
11:03:22,17,5,10.0.0.46,10.0.0.61,9496,37665
11:03:23,17,1,10.0.0.111,10.0.0.146,46869,16637
11:03:23,17,5,10.0.0.46,10.0.0.61,9496,37665
11:03:23,17,5,10.0.0.111,10.0.0.146,46869,16637
11:03:23,17,1,10.0.0.111,10.0.0.14,36200,58010
11:03:23,17,5,10.0.0.111,10.0.0.146,46869,16637
11:03:23,17,5,10.0.0.111,10.0.0.14,36200,58010
11:03:23,17,5,10.0.0.111,10.0.0.14,36200,58010
11:03:23,17,1,10.0.0.183,10.0.0.54,39097,60440
11:03:23,17,5,10.0.0.183,10.0.0.54,39097,60440
11:03:23,17,5,10.0.0.183,10.0.0.54,39097,60440
11:03:23,17,1,10.0.0.148,10.0.0.80,15491,823
11:03:23,17,5,10.0.0.148,10.0.0.80,15491,823
11:03:23,17,5,10.0.0.148,10.0.0.80,15491,823
11:03:23,17,1,10.0.0.111,10.0.0.127,51704,28634
11:03:23,17,5,10.0.0.111,10.0.0.127,51704,28634
11:03:23,17,5,10.0.0.111,10.0.0.127,51704,28634
11:03:23,17,1,10.0.0.183,10.0.0.45,16383,542
11:03:23,17,5,10.0.0.183,10.0.0.45,16383,542
11:03:23,17,5,10.0.0.183,10.0.0.45,16383,542
11:03:23,17,1,10.0.0.46,10.0.0.189,2518,25820
11:03:23,17,1,10.0.0.183,10.0.0.179,26098,32869
11:03:23,17,5,10.0.0.46,10.0.0.189,2518,25820
11:03:23,17,5,10.0.0.46,10.0.0.189,2518,25820
11:03:23,17,1,10.0.0.111,10.0.0.162,40275,901
11:03:23,17,5,10.0.0.183,10.0.0.179,26098,32869
11:03:23,17,1,10.0.0.183,10.0.0.151,31607,11041
11:03:23,17,5,10.0.0.183,10.0.0.179,26098,32869
11:03:23,17,5,10.0.0.111,10.0.0.162,40275,901
11:03:23,17,5,10.0.0.111,10.0.0.162,40275,901
11:03:23,17,1,10.0.0.148,10.0.0.93,15144,19802
11:03:23,17,5,10.0.0.183,10.0.0.151,31607,11041
11:03:23,17,5,10.0.0.148,10.0.0.93,15144,19802
11:03:23,17,5,10.0.0.183,10.0.0.151,31607,11041
11:03:23,17,5,10.0.0.148,10.0.0.93,15144,19802
11:03:23,17,1,10.0.0.46,10.0.0.123,38357,31107
11:03:23,17,5,10.0.0.46,10.0.0.123,38357,31107
11:03:23,17,5,10.0.0.46,10.0.0.123,38357,31107
11:03:23,17,1,10.0.0.111,10.0.0.32,17592,2077
11:03:23,17,5,10.0.0.111,10.0.0.32,17592,2077
11:03:23,17,5,10.0.0.111,10.0.0.32,17592,2077
11:03:23,17,1,10.0.0.148,10.0.0.143,38995,7654
11:03:23,17,5,10.0.0.148,10.0.0.143,38995,7654
11:03:23,17,5,10.0.0.148,10.0.0.143,38995,7654
11:03:23,17,1,10.0.0.183,10.0.0.115,172,14265
11:03:23,17,5,10.0.0.183,10.0.0.115,172,14265
11:03:23,17,5,10.0.0.183,10.0.0.115,172,14265
11:03:23,17,1,10.0.0.46,10.0.0.188,26900,28701
11:03:23,17,5,10.0.0.46,10.0.0.188,26900,28701
11:03:23,17,5,10.0.0.46,10.0.0.188,26900,28701
11:03:23,17,1,10.0.0.183,10.0.0.126,31975,5978
11:03:23,17,5,10.0.0.183,10.0.0.126,31975,5978
11:03:23,17,5,10.0.0.183,10.0.0.126,31975,5978
11:03:23,17,1,10.0.0.183,10.0.0.76,24960,62394
11:03:23,17,5,10.0.0.183,10.0.0.76,24960,62394
11:03:23,17,5,10.0.0.183,10.0.0.76,24960,62394
11:03:23,17,1,10.0.0.183,10.0.0.134,28814,45481
11:03:23,17,5,10.0.0.183,10.0.0.134,28814,45481
11:03:23,17,5,10.0.0.183,10.0.0.134,28814,45481
11:03:23,17,1,10.0.0.183,10.0.0.30,29367,43868
11:03:23,17,5,10.0.0.183,10.0.0.30,29367,43868
11:03:23,17,5,10.0.0.183,10.0.0.30,29367,43868
11:03:23,17,1,10.0.0.111,10.0.0.112,21077,58080
11:03:23,17,5,10.0.0.111,10.0.0.112,21077,58080
11:03:23,17,5,10.0.0.111,10.0.0.112,21077,58080
11:03:23,17,1,10.0.0.111,10.0.0.46,62308,2823
11:03:23,17,5,10.0.0.111,10.0.0.46,62308,2823
11:03:23,17,5,10.0.0.111,10.0.0.46,62308,2823
11:03:23,17,1,10.0.0.148,10.0.0.104,22667,62201
11:03:23,17,5,10.0.0.148,10.0.0.104,22667,62201
11:03:23,17,5,10.0.0.148,10.0.0.104,22667,62201
11:03:23,17,1,10.0.0.111,10.0.0.84,44108,42997
11:03:23,17,5,10.0.0.111,10.0.0.84,44108,42997
11:03:23,17,1,10.0.0.46,10.0.0.48,37340,39678
11:03:23,17,5,10.0.0.46,10.0.0.48,37340,39678
11:03:23,17,5,10.0.0.111,10.0.0.84,44108,42997
11:03:23,17,5,10.0.0.46,10.0.0.48,37340,39678
11:03:23,17,1,10.0.0.111,10.0.0.93,38170,232
11:03:23,17,5,10.0.0.111,10.0.0.93,38170,232
11:03:23,17,5,10.0.0.111,10.0.0.93,38170,232
11:03:23,17,1,10.0.0.46,10.0.0.188,18723,41413
11:03:23,17,5,10.0.0.46,10.0.0.188,18723,41413
11:03:23,17,5,10.0.0.46,10.0.0.188,18723,41413
11:03:23,17,1,10.0.0.111,10.0.0.78,8331,20109
11:03:23,17,5,10.0.0.111,10.0.0.78,8331,20109
11:03:23,17,5,10.0.0.111,10.0.0.78,8331,20109
11:03:24,17,1,10.0.0.111,10.0.0.174,8564,27932
11:03:24,17,5,10.0.0.111,10.0.0.174,8564,27932
11:03:24,17,5,10.0.0.111,10.0.0.174,8564,27932
11:03:24,17,1,10.0.0.148,10.0.0.24,5590,30329
11:03:24,17,5,10.0.0.148,10.0.0.24,5590,30329
11:03:24,17,5,10.0.0.148,10.0.0.24,5590,30329
11:03:24,17,1,10.0.0.183,10.0.0.192,29936,3562
11:03:24,17,1,10.0.0.148,10.0.0.109,64408,7915
11:03:24,17,1,10.0.0.183,10.0.0.137,34259,12728
11:03:24,17,5,10.0.0.183,10.0.0.192,29936,3562
11:03:24,17,5,10.0.0.148,10.0.0.109,64408,7915
11:03:24,17,5,10.0.0.183,10.0.0.192,29936,3562
11:03:24,17,1,10.0.0.111,10.0.0.190,27960,23683
11:03:24,17,5,10.0.0.148,10.0.0.109,64408,7915
11:03:24,17,5,10.0.0.183,10.0.0.137,34259,12728
11:03:24,17,5,10.0.0.111,10.0.0.190,27960,23683
11:03:24,17,5,10.0.0.183,10.0.0.137,34259,12728
11:03:24,17,5,10.0.0.111,10.0.0.190,27960,23683
11:03:24,17,1,10.0.0.111,10.0.0.185,37350,20213
11:03:24,17,1,10.0.0.111,10.0.0.160,2550,29542
11:03:24,17,5,10.0.0.111,10.0.0.185,37350,20213
11:03:24,17,5,10.0.0.111,10.0.0.185,37350,20213
11:03:24,17,5,10.0.0.111,10.0.0.160,2550,29542
11:03:24,17,5,10.0.0.111,10.0.0.160,2550,29542
11:03:24,17,1,10.0.0.111,10.0.0.187,54114,46041
11:03:24,17,1,10.0.0.148,10.0.0.109,25175,1074
11:03:24,17,5,10.0.0.111,10.0.0.187,54114,46041
11:03:24,17,5,10.0.0.148,10.0.0.109,25175,1074
11:03:24,17,5,10.0.0.111,10.0.0.187,54114,46041
11:03:24,17,5,10.0.0.148,10.0.0.109,25175,1074
11:03:24,17,1,10.0.0.46,10.0.0.198,12903,24204
11:03:24,17,5,10.0.0.46,10.0.0.198,12903,24204
11:03:24,17,5,10.0.0.46,10.0.0.198,12903,24204
11:03:24,17,1,10.0.0.111,10.0.0.179,49769,39350
11:03:24,17,5,10.0.0.111,10.0.0.179,49769,39350
11:03:24,17,5,10.0.0.111,10.0.0.179,49769,39350
11:03:24,17,1,10.0.0.148,10.0.0.107,11678,56391
11:03:24,17,5,10.0.0.148,10.0.0.107,11678,56391
11:03:24,17,5,10.0.0.148,10.0.0.107,11678,56391
11:03:24,17,1,10.0.0.111,10.0.0.156,12727,57873
11:03:24,17,5,10.0.0.111,10.0.0.156,12727,57873
11:03:24,17,5,10.0.0.111,10.0.0.156,12727,57873
11:03:24,17,1,10.0.0.183,10.0.0.91,36631,45364
11:03:24,17,5,10.0.0.183,10.0.0.91,36631,45364
11:03:24,17,5,10.0.0.183,10.0.0.91,36631,45364
11:03:24,17,1,10.0.0.46,10.0.0.35,1404,41092
11:03:24,17,5,10.0.0.46,10.0.0.35,1404,41092
11:03:24,17,5,10.0.0.46,10.0.0.35,1404,41092
11:03:24,17,1,10.0.0.183,10.0.0.100,34453,51730
11:03:24,17,5,10.0.0.183,10.0.0.100,34453,51730
11:03:24,17,5,10.0.0.183,10.0.0.100,34453,51730
11:03:24,17,1,10.0.0.183,10.0.0.151,30907,10621
11:03:24,17,5,10.0.0.183,10.0.0.151,30907,10621
11:03:24,17,5,10.0.0.183,10.0.0.151,30907,10621
11:03:24,17,1,10.0.0.148,10.0.0.190,3389,6892
11:03:24,17,5,10.0.0.148,10.0.0.190,3389,6892
11:03:24,17,5,10.0.0.148,10.0.0.190,3389,6892
11:03:24,17,1,10.0.0.183,10.0.0.143,22015,44808
11:03:24,17,5,10.0.0.183,10.0.0.143,22015,44808
11:03:24,17,5,10.0.0.183,10.0.0.143,22015,44808
11:03:24,17,1,10.0.0.183,10.0.0.149,60132,1420
11:03:24,17,5,10.0.0.183,10.0.0.149,60132,1420
11:03:24,17,5,10.0.0.183,10.0.0.149,60132,1420
11:03:24,17,1,10.0.0.111,10.0.0.193,18535,5706
11:03:24,17,5,10.0.0.111,10.0.0.193,18535,5706
11:03:24,17,5,10.0.0.111,10.0.0.193,18535,5706
11:03:24,17,1,10.0.0.111,10.0.0.75,64309,11787
11:03:24,17,5,10.0.0.111,10.0.0.75,64309,11787
11:03:24,17,1,10.0.0.148,10.0.0.143,33259,6385
11:03:24,17,5,10.0.0.111,10.0.0.75,64309,11787
11:03:24,17,5,10.0.0.148,10.0.0.143,33259,6385
11:03:24,17,5,10.0.0.148,10.0.0.143,33259,6385
11:03:24,17,1,10.0.0.183,10.0.0.199,60956,24102
11:03:24,17,5,10.0.0.183,10.0.0.199,60956,24102
11:03:24,17,5,10.0.0.183,10.0.0.199,60956,24102
11:03:25,17,1,10.0.0.111,10.0.0.166,22849,15308
11:03:25,17,5,10.0.0.111,10.0.0.166,22849,15308
11:03:25,17,5,10.0.0.111,10.0.0.166,22849,15308
11:03:25,17,1,10.0.0.148,10.0.0.62,44617,26631
11:03:25,17,5,10.0.0.148,10.0.0.62,44617,26631
11:03:25,17,5,10.0.0.148,10.0.0.62,44617,26631
11:03:25,17,1,10.0.0.111,10.0.0.49,28837,44603
11:03:25,17,5,10.0.0.111,10.0.0.49,28837,44603
11:03:25,17,5,10.0.0.111,10.0.0.49,28837,44603
11:03:25,17,1,10.0.0.148,10.0.0.33,46627,15945
11:03:25,17,5,10.0.0.148,10.0.0.33,46627,15945
11:03:25,17,5,10.0.0.148,10.0.0.33,46627,15945
11:03:25,17,1,10.0.0.46,10.0.0.108,22390,37530
11:03:25,17,5,10.0.0.46,10.0.0.108,22390,37530
11:03:25,17,5,10.0.0.46,10.0.0.108,22390,37530
11:03:25,17,1,10.0.0.111,10.0.0.113,50840,28048
11:03:25,17,5,10.0.0.111,10.0.0.113,50840,28048
11:03:25,17,5,10.0.0.111,10.0.0.113,50840,28048
11:03:25,17,1,10.0.0.46,10.0.0.170,16706,5106
11:03:25,17,5,10.0.0.46,10.0.0.170,16706,5106
11:03:25,17,5,10.0.0.46,10.0.0.170,16706,5106
11:03:25,17,1,10.0.0.148,10.0.0.178,6543,61329
11:03:25,17,5,10.0.0.148,10.0.0.178,6543,61329
11:03:25,17,5,10.0.0.148,10.0.0.178,6543,61329
11:03:25,17,1,10.0.0.46,10.0.0.39,46530,60243
11:03:25,17,5,10.0.0.46,10.0.0.39,46530,60243
11:03:25,17,5,10.0.0.46,10.0.0.39,46530,60243
11:03:25,17,1,10.0.0.148,10.0.0.151,55773,46757
11:03:25,17,5,10.0.0.148,10.0.0.151,55773,46757
11:03:25,17,5,10.0.0.148,10.0.0.151,55773,46757
11:03:25,17,1,10.0.0.148,10.0.0.164,55346,51662
11:03:25,17,5,10.0.0.148,10.0.0.164,55346,51662
11:03:25,17,5,10.0.0.148,10.0.0.164,55346,51662
11:03:25,17,1,10.0.0.111,10.0.0.30,34219,51876
11:03:25,17,1,10.0.0.46,10.0.0.50,56401,63226
11:03:25,17,5,10.0.0.111,10.0.0.30,34219,51876
11:03:25,17,5,10.0.0.111,10.0.0.30,34219,51876
11:03:25,17,1,10.0.0.148,10.0.0.167,18249,41734
11:03:25,17,5,10.0.0.46,10.0.0.50,56401,63226
11:03:25,17,5,10.0.0.46,10.0.0.50,56401,63226
11:03:26,17,5,10.0.0.148,10.0.0.167,18249,41734
11:03:26,17,5,10.0.0.148,10.0.0.167,18249,41734
11:03:26,17,1,10.0.0.183,10.0.0.80,63403,48157
11:03:26,17,1,10.0.0.46,10.0.0.172,51796,59121
11:03:26,17,5,10.0.0.183,10.0.0.80,63403,48157
11:03:26,17,5,10.0.0.183,10.0.0.80,63403,48157
11:03:26,17,5,10.0.0.46,10.0.0.172,51796,59121
11:03:26,17,5,10.0.0.46,10.0.0.172,51796,59121
11:03:26,17,1,10.0.0.46,10.0.0.107,30027,5932
11:03:26,17,5,10.0.0.46,10.0.0.107,30027,5932
11:03:26,17,5,10.0.0.46,10.0.0.107,30027,5932
11:03:26,17,1,10.0.0.111,10.0.0.182,24047,50627
11:03:26,17,5,10.0.0.111,10.0.0.182,24047,50627
11:03:26,17,5,10.0.0.111,10.0.0.182,24047,50627
11:03:26,17,1,10.0.0.46,10.0.0.109,6591,40709
11:03:26,17,5,10.0.0.46,10.0.0.109,6591,40709
11:03:26,17,5,10.0.0.46,10.0.0.109,6591,40709
11:03:26,17,1,10.0.0.111,10.0.0.31,59060,60775
11:03:26,17,5,10.0.0.111,10.0.0.31,59060,60775
11:03:26,17,5,10.0.0.111,10.0.0.31,59060,60775
11:03:26,17,1,10.0.0.183,10.0.0.146,14541,51631
11:03:26,17,5,10.0.0.183,10.0.0.146,14541,51631
11:03:26,17,5,10.0.0.183,10.0.0.146,14541,51631
11:03:26,17,1,10.0.0.46,10.0.0.19,22193,60418
11:03:26,17,5,10.0.0.46,10.0.0.19,22193,60418
11:03:26,17,5,10.0.0.46,10.0.0.19,22193,60418
11:03:26,17,1,10.0.0.183,10.0.0.51,62064,47955
11:03:26,17,5,10.0.0.183,10.0.0.51,62064,47955
11:03:26,17,5,10.0.0.183,10.0.0.51,62064,47955
11:03:26,17,1,10.0.0.148,10.0.0.164,6250,38121
11:03:26,17,5,10.0.0.148,10.0.0.164,6250,38121
11:03:26,17,5,10.0.0.148,10.0.0.164,6250,38121
11:03:26,17,1,10.0.0.111,10.0.0.58,17025,8608
11:03:26,17,5,10.0.0.111,10.0.0.58,17025,8608
11:03:26,17,5,10.0.0.111,10.0.0.58,17025,8608
11:03:26,17,1,10.0.0.46,10.0.0.61,9496,37665
11:03:26,17,5,10.0.0.46,10.0.0.61,9496,37665
11:03:26,17,5,10.0.0.46,10.0.0.61,9496,37665
11:03:26,17,1,10.0.0.111,10.0.0.21,19296,53060
11:03:26,17,5,10.0.0.111,10.0.0.21,19296,53060
11:03:26,17,5,10.0.0.111,10.0.0.21,19296,53060
11:03:26,17,1,10.0.0.148,10.0.0.146,52874,7279
11:03:26,17,1,10.0.0.183,10.0.0.62,10732,54463
11:03:26,17,5,10.0.0.148,10.0.0.146,52874,7279
11:03:26,17,5,10.0.0.148,10.0.0.146,52874,7279
11:03:26,17,5,10.0.0.183,10.0.0.62,10732,54463
11:03:26,17,5,10.0.0.183,10.0.0.62,10732,54463
11:03:26,17,1,10.0.0.111,10.0.0.45,347,34063
11:03:26,17,5,10.0.0.111,10.0.0.45,347,34063
11:03:26,17,1,10.0.0.46,10.0.0.52,122,8456
11:03:26,17,5,10.0.0.111,10.0.0.45,347,34063
11:03:26,17,1,10.0.0.183,10.0.0.120,16872,2002
11:03:26,17,5,10.0.0.46,10.0.0.52,122,8456
11:03:26,17,5,10.0.0.183,10.0.0.120,16872,2002
11:03:26,17,5,10.0.0.46,10.0.0.52,122,8456
11:03:26,17,5,10.0.0.183,10.0.0.120,16872,2002
11:03:26,17,1,10.0.0.46,10.0.0.102,10036,49871
11:03:26,17,5,10.0.0.46,10.0.0.102,10036,49871
11:03:26,17,5,10.0.0.46,10.0.0.102,10036,49871
11:03:26,17,1,10.0.0.46,10.0.0.199,13608,45078
11:03:26,17,5,10.0.0.46,10.0.0.199,13608,45078
11:03:26,17,5,10.0.0.46,10.0.0.199,13608,45078
11:03:26,17,1,10.0.0.46,10.0.0.51,61072,50648
11:03:26,17,5,10.0.0.46,10.0.0.51,61072,50648
11:03:26,17,5,10.0.0.46,10.0.0.51,61072,50648
11:03:26,17,1,10.0.0.183,10.0.0.131,15703,29807
11:03:26,17,5,10.0.0.183,10.0.0.131,15703,29807
11:03:26,17,5,10.0.0.183,10.0.0.131,15703,29807
11:03:26,17,1,10.0.0.183,10.0.0.110,15912,18252
11:03:26,17,1,10.0.0.111,10.0.0.138,54964,28087
11:03:26,17,5,10.0.0.183,10.0.0.110,15912,18252
11:03:26,17,1,10.0.0.148,10.0.0.132,49350,17513
11:03:26,17,5,10.0.0.111,10.0.0.138,54964,28087
11:03:26,17,5,10.0.0.183,10.0.0.110,15912,18252
11:03:26,17,5,10.0.0.148,10.0.0.132,49350,17513
11:03:26,17,5,10.0.0.111,10.0.0.138,54964,28087
11:03:26,17,5,10.0.0.148,10.0.0.132,49350,17513
11:03:26,17,1,10.0.0.183,10.0.0.21,12683,27658
11:03:26,17,5,10.0.0.183,10.0.0.21,12683,27658
11:03:26,17,5,10.0.0.183,10.0.0.21,12683,27658
11:03:26,17,1,10.0.0.111,10.0.0.166,25949,24641
11:03:26,17,5,10.0.0.111,10.0.0.166,25949,24641
11:03:26,17,5,10.0.0.111,10.0.0.166,25949,24641
11:03:27,17,1,10.0.0.111,10.0.0.101,31234,19911
11:03:27,17,5,10.0.0.111,10.0.0.101,31234,19911
11:03:27,17,5,10.0.0.111,10.0.0.101,31234,19911
11:03:27,17,1,10.0.0.46,10.0.0.188,26900,28701
11:03:27,17,5,10.0.0.46,10.0.0.188,26900,28701
11:03:27,17,5,10.0.0.46,10.0.0.188,26900,28701
11:03:27,17,1,10.0.0.46,10.0.0.164,42069,22485
11:03:27,17,5,10.0.0.46,10.0.0.164,42069,22485
11:03:27,17,5,10.0.0.46,10.0.0.164,42069,22485
11:03:27,17,1,10.0.0.148,10.0.0.24,5590,30329
11:03:27,17,5,10.0.0.148,10.0.0.24,5590,30329
11:03:27,17,5,10.0.0.148,10.0.0.24,5590,30329
11:03:27,17,1,10.0.0.111,10.0.0.146,46869,16637
11:03:27,17,5,10.0.0.111,10.0.0.146,46869,16637
11:03:27,17,5,10.0.0.111,10.0.0.146,46869,16637
11:03:27,17,1,10.0.0.111,10.0.0.14,36200,58010
11:03:27,17,5,10.0.0.111,10.0.0.14,36200,58010
11:03:27,17,5,10.0.0.111,10.0.0.14,36200,58010
11:03:27,17,1,10.0.0.111,10.0.0.172,25529,14023
11:03:27,17,5,10.0.0.111,10.0.0.172,25529,14023
11:03:27,17,5,10.0.0.111,10.0.0.172,25529,14023
11:03:27,17,1,10.0.0.46,10.0.0.185,19709,54923
11:03:27,17,5,10.0.0.46,10.0.0.185,19709,54923
11:03:27,17,5,10.0.0.46,10.0.0.185,19709,54923
11:03:27,17,1,10.0.0.111,10.0.0.114,35219,41252
11:03:27,17,5,10.0.0.111,10.0.0.114,35219,41252
11:03:27,17,5,10.0.0.111,10.0.0.114,35219,41252
11:03:27,17,1,10.0.0.148,10.0.0.143,38995,7654
11:03:27,17,5,10.0.0.148,10.0.0.143,38995,7654
11:03:27,17,5,10.0.0.148,10.0.0.143,38995,7654
11:03:27,17,1,10.0.0.111,10.0.0.32,17592,2077
11:03:27,17,5,10.0.0.111,10.0.0.32,17592,2077
11:03:27,17,5,10.0.0.111,10.0.0.32,17592,2077
11:03:27,17,1,10.0.0.111,10.0.0.190,25853,4109
11:03:27,17,5,10.0.0.111,10.0.0.190,25853,4109
11:03:27,17,5,10.0.0.111,10.0.0.190,25853,4109
11:03:27,17,1,10.0.0.46,10.0.0.189,2518,25820
11:03:27,17,5,10.0.0.46,10.0.0.189,2518,25820
11:03:27,17,1,10.0.0.183,10.0.0.154,39643,39030
11:03:27,17,5,10.0.0.183,10.0.0.154,39643,39030
11:03:27,17,5,10.0.0.46,10.0.0.189,2518,25820
11:03:27,17,1,10.0.0.183,10.0.0.151,31607,11041
11:03:27,17,5,10.0.0.183,10.0.0.151,31607,11041
11:03:27,17,5,10.0.0.183,10.0.0.154,39643,39030
11:03:27,17,1,10.0.0.111,10.0.0.112,21077,58080
11:03:27,17,5,10.0.0.183,10.0.0.151,31607,11041
11:03:27,17,5,10.0.0.111,10.0.0.112,21077,58080
11:03:27,17,5,10.0.0.111,10.0.0.112,21077,58080
11:03:27,17,1,10.0.0.148,10.0.0.198,39864,17459
11:03:27,17,5,10.0.0.148,10.0.0.198,39864,17459
11:03:27,17,5,10.0.0.148,10.0.0.198,39864,17459
11:03:27,17,1,10.0.0.183,10.0.0.83,31647,3451
11:03:27,17,1,10.0.0.148,10.0.0.69,38044,4498
11:03:27,17,5,10.0.0.183,10.0.0.83,31647,3451
11:03:27,17,5,10.0.0.183,10.0.0.83,31647,3451
11:03:27,17,5,10.0.0.148,10.0.0.69,38044,4498
11:03:27,17,5,10.0.0.148,10.0.0.69,38044,4498
11:03:27,17,1,10.0.0.111,10.0.0.84,44108,42997
11:03:28,17,1,10.0.0.46,10.0.0.14,23069,31724
11:03:28,17,5,10.0.0.111,10.0.0.84,44108,42997
11:03:28,17,5,10.0.0.46,10.0.0.14,23069,31724
11:03:28,17,5,10.0.0.111,10.0.0.84,44108,42997
11:03:28,17,5,10.0.0.46,10.0.0.14,23069,31724
11:03:28,17,1,10.0.0.148,10.0.0.28,55125,6376
11:03:28,17,1,10.0.0.111,10.0.0.67,14337,1501
11:03:28,17,5,10.0.0.148,10.0.0.28,55125,6376
11:03:28,17,5,10.0.0.111,10.0.0.67,14337,1501
11:03:28,17,5,10.0.0.148,10.0.0.28,55125,6376
11:03:28,17,5,10.0.0.111,10.0.0.67,14337,1501
11:03:28,17,1,10.0.0.111,10.0.0.187,54114,46041
11:03:28,17,5,10.0.0.111,10.0.0.187,54114,46041
11:03:28,17,5,10.0.0.111,10.0.0.187,54114,46041
11:03:28,17,1,10.0.0.111,10.0.0.46,62308,2823
11:03:28,17,5,10.0.0.111,10.0.0.46,62308,2823
11:03:28,17,5,10.0.0.111,10.0.0.46,62308,2823
11:03:28,17,1,10.0.0.111,10.0.0.129,4424,15349
11:03:28,17,5,10.0.0.111,10.0.0.129,4424,15349
11:03:28,17,5,10.0.0.111,10.0.0.129,4424,15349
11:03:28,17,1,10.0.0.183,10.0.0.143,22015,44808
11:03:28,17,5,10.0.0.183,10.0.0.143,22015,44808
11:03:28,17,5,10.0.0.183,10.0.0.143,22015,44808
11:03:28,17,1,10.0.0.183,10.0.0.72,34000,30241
11:03:28,17,1,10.0.0.183,10.0.0.126,31975,5978
11:03:28,17,5,10.0.0.183,10.0.0.72,34000,30241
11:03:28,17,5,10.0.0.183,10.0.0.72,34000,30241
11:03:28,17,1,10.0.0.111,10.0.0.185,37350,20213
11:03:28,17,5,10.0.0.183,10.0.0.126,31975,5978
11:03:28,17,5,10.0.0.183,10.0.0.126,31975,5978
11:03:28,17,1,10.0.0.111,10.0.0.123,31739,61160
11:03:28,17,5,10.0.0.111,10.0.0.185,37350,20213
11:03:28,17,5,10.0.0.111,10.0.0.185,37350,20213
11:03:28,17,5,10.0.0.111,10.0.0.123,31739,61160
11:03:28,17,5,10.0.0.111,10.0.0.123,31739,61160
11:03:28,17,1,10.0.0.183,10.0.0.54,39097,60440
11:03:28,17,5,10.0.0.183,10.0.0.54,39097,60440
11:03:28,17,5,10.0.0.183,10.0.0.54,39097,60440
11:03:28,17,1,10.0.0.183,10.0.0.151,30907,10621
11:03:28,17,5,10.0.0.183,10.0.0.151,30907,10621
11:03:28,17,5,10.0.0.183,10.0.0.151,30907,10621
11:03:28,17,1,10.0.0.183,10.0.0.192,29936,3562
11:03:28,17,5,10.0.0.183,10.0.0.192,29936,3562
11:03:28,17,5,10.0.0.183,10.0.0.192,29936,3562
11:03:29,17,1,10.0.0.46,10.0.0.123,38357,31107
11:03:29,17,5,10.0.0.46,10.0.0.123,38357,31107
11:03:29,17,5,10.0.0.46,10.0.0.123,38357,31107
11:03:29,17,1,10.0.0.183,10.0.0.9,51614,18501
11:03:29,17,1,10.0.0.148,10.0.0.23,47325,28639
11:03:29,17,5,10.0.0.183,10.0.0.9,51614,18501
11:03:29,17,5,10.0.0.148,10.0.0.23,47325,28639
11:03:29,17,5,10.0.0.183,10.0.0.9,51614,18501
11:03:29,17,5,10.0.0.148,10.0.0.23,47325,28639
11:03:29,17,1,10.0.0.183,10.0.0.134,28814,45481
11:03:29,17,5,10.0.0.183,10.0.0.134,28814,45481
11:03:29,17,5,10.0.0.183,10.0.0.134,28814,45481
11:03:29,17,1,10.0.0.111,10.0.0.190,27960,23683
11:03:29,17,5,10.0.0.111,10.0.0.190,27960,23683
11:03:29,17,5,10.0.0.111,10.0.0.190,27960,23683
11:03:29,17,1,10.0.0.183,10.0.0.199,60956,24102
11:03:29,17,5,10.0.0.183,10.0.0.199,60956,24102
11:03:29,17,5,10.0.0.183,10.0.0.199,60956,24102
11:03:29,17,1,10.0.0.111,10.0.0.64,42804,14782
11:03:29,17,5,10.0.0.111,10.0.0.64,42804,14782
11:03:29,17,5,10.0.0.111,10.0.0.64,42804,14782
11:03:29,17,1,10.0.0.148,10.0.0.93,15144,19802
11:03:29,17,5,10.0.0.148,10.0.0.93,15144,19802
11:03:29,17,5,10.0.0.148,10.0.0.93,15144,19802
11:03:29,17,1,10.0.0.46,10.0.0.48,37340,39678
11:03:29,17,5,10.0.0.46,10.0.0.48,37340,39678
11:03:29,17,5,10.0.0.46,10.0.0.48,37340,39678
11:03:29,17,1,10.0.0.111,10.0.0.78,8331,20109
11:03:29,17,5,10.0.0.111,10.0.0.78,8331,20109
11:03:29,17,5,10.0.0.111,10.0.0.78,8331,20109
11:03:29,17,1,10.0.0.148,10.0.0.107,11678,56391
11:03:29,17,5,10.0.0.148,10.0.0.107,11678,56391
11:03:29,17,5,10.0.0.148,10.0.0.107,11678,56391
11:03:29,17,1,10.0.0.46,10.0.0.35,1404,41092
11:03:29,17,5,10.0.0.46,10.0.0.35,1404,41092
11:03:29,17,5,10.0.0.46,10.0.0.35,1404,41092
11:03:29,17,1,10.0.0.148,10.0.0.109,25175,1074
11:03:29,17,1,10.0.0.148,10.0.0.62,44617,26631
11:03:29,17,5,10.0.0.148,10.0.0.109,25175,1074
11:03:29,17,5,10.0.0.148,10.0.0.109,25175,1074
11:03:29,17,5,10.0.0.148,10.0.0.62,44617,26631
11:03:29,17,5,10.0.0.148,10.0.0.62,44617,26631
11:03:29,17,1,10.0.0.183,10.0.0.179,26098,32869
11:03:29,17,5,10.0.0.183,10.0.0.179,26098,32869
11:03:29,17,5,10.0.0.183,10.0.0.179,26098,32869
11:03:29,17,1,10.0.0.111,10.0.0.174,8564,27932
11:03:29,17,1,10.0.0.148,10.0.0.143,33259,6385
11:03:29,17,5,10.0.0.111,10.0.0.174,8564,27932
11:03:29,17,5,10.0.0.111,10.0.0.174,8564,27932
11:03:29,17,5,10.0.0.148,10.0.0.143,33259,6385
11:03:29,17,5,10.0.0.148,10.0.0.143,33259,6385
11:03:29,17,1,10.0.0.111,10.0.0.156,12727,57873
11:03:29,17,1,10.0.0.183,10.0.0.91,36631,45364
11:03:29,17,5,10.0.0.111,10.0.0.156,12727,57873
11:03:29,17,5,10.0.0.111,10.0.0.156,12727,57873
11:03:29,17,1,10.0.0.148,10.0.0.104,22667,62201
11:03:29,17,5,10.0.0.183,10.0.0.91,36631,45364
11:03:29,17,5,10.0.0.183,10.0.0.91,36631,45364
11:03:29,17,1,10.0.0.111,10.0.0.193,18535,5706
11:03:29,17,5,10.0.0.148,10.0.0.104,22667,62201
11:03:29,17,5,10.0.0.111,10.0.0.193,18535,5706
11:03:29,17,5,10.0.0.148,10.0.0.104,22667,62201
11:03:29,17,1,10.0.0.183,10.0.0.137,34259,12728
11:03:29,17,5,10.0.0.111,10.0.0.193,18535,5706
11:03:29,17,1,10.0.0.183,10.0.0.30,29367,43868
11:03:29,17,5,10.0.0.183,10.0.0.137,34259,12728
11:03:29,17,1,10.0.0.183,10.0.0.149,60132,1420
11:03:29,17,5,10.0.0.183,10.0.0.137,34259,12728
11:03:29,17,5,10.0.0.183,10.0.0.30,29367,43868
11:03:29,17,1,10.0.0.148,10.0.0.132,31922,63296
11:03:29,17,5,10.0.0.183,10.0.0.30,29367,43868
11:03:29,17,5,10.0.0.183,10.0.0.149,60132,1420
11:03:29,17,5,10.0.0.183,10.0.0.149,60132,1420
11:03:29,17,5,10.0.0.148,10.0.0.132,31922,63296
11:03:29,17,1,10.0.0.111,10.0.0.31,59060,60775
11:03:29,17,5,10.0.0.148,10.0.0.132,31922,63296
11:03:29,17,5,10.0.0.111,10.0.0.31,59060,60775
11:03:29,17,1,10.0.0.111,10.0.0.127,51704,28634
11:03:29,17,1,10.0.0.148,10.0.0.80,15491,823
11:03:29,17,5,10.0.0.111,10.0.0.127,51704,28634
11:03:29,17,5,10.0.0.111,10.0.0.31,59060,60775
11:03:29,17,1,10.0.0.183,10.0.0.136,37557,47639
11:03:29,17,5,10.0.0.148,10.0.0.80,15491,823
11:03:29,17,5,10.0.0.111,10.0.0.127,51704,28634
11:03:29,17,5,10.0.0.148,10.0.0.80,15491,823
11:03:29,17,5,10.0.0.183,10.0.0.136,37557,47639
11:03:29,17,5,10.0.0.183,10.0.0.136,37557,47639
11:03:29,17,1,10.0.0.148,10.0.0.33,46627,15945
11:03:29,17,5,10.0.0.148,10.0.0.33,46627,15945
11:03:29,17,5,10.0.0.148,10.0.0.33,46627,15945
11:03:30,17,1,10.0.0.46,10.0.0.170,16706,5106
11:03:30,17,5,10.0.0.46,10.0.0.170,16706,5106
11:03:30,17,5,10.0.0.46,10.0.0.170,16706,5106
11:03:30,17,1,10.0.0.111,10.0.0.49,28837,44603
11:03:30,17,1,10.0.0.46,10.0.0.188,18723,41413
11:03:30,17,5,10.0.0.111,10.0.0.49,28837,44603
11:03:30,17,5,10.0.0.111,10.0.0.49,28837,44603
11:03:30,17,5,10.0.0.46,10.0.0.188,18723,41413
11:03:30,17,5,10.0.0.46,10.0.0.188,18723,41413
11:03:30,17,1,10.0.0.183,10.0.0.45,16383,542
11:03:30,17,5,10.0.0.183,10.0.0.45,16383,542
11:03:30,17,5,10.0.0.183,10.0.0.45,16383,542
11:03:30,17,1,10.0.0.148,10.0.0.109,64408,7915
11:03:30,17,5,10.0.0.148,10.0.0.109,64408,7915
11:03:30,17,1,10.0.0.183,10.0.0.100,34453,51730
11:03:30,17,5,10.0.0.148,10.0.0.109,64408,7915
11:03:30,17,1,10.0.0.111,10.0.0.160,2550,29542
11:03:30,17,5,10.0.0.183,10.0.0.100,34453,51730
11:03:30,17,5,10.0.0.111,10.0.0.160,2550,29542
11:03:30,17,5,10.0.0.183,10.0.0.100,34453,51730
11:03:30,17,1,10.0.0.46,10.0.0.107,30027,5932
11:03:30,17,5,10.0.0.111,10.0.0.160,2550,29542
11:03:30,17,5,10.0.0.46,10.0.0.107,30027,5932
11:03:30,17,5,10.0.0.46,10.0.0.107,30027,5932
11:03:30,17,1,10.0.0.111,10.0.0.179,49769,39350
11:03:30,17,5,10.0.0.111,10.0.0.179,49769,39350
11:03:30,17,5,10.0.0.111,10.0.0.179,49769,39350
11:03:30,17,1,10.0.0.111,10.0.0.93,38170,232
11:03:30,17,5,10.0.0.111,10.0.0.93,38170,232
11:03:30,17,5,10.0.0.111,10.0.0.93,38170,232
11:03:30,17,1,10.0.0.46,10.0.0.198,12903,24204
11:03:30,17,5,10.0.0.46,10.0.0.198,12903,24204
11:03:30,17,5,10.0.0.46,10.0.0.198,12903,24204
11:03:30,17,1,10.0.0.183,10.0.0.79,56957,15817
11:03:30,17,5,10.0.0.183,10.0.0.79,56957,15817
11:03:30,17,5,10.0.0.183,10.0.0.79,56957,15817
11:03:30,17,1,10.0.0.183,10.0.0.76,24960,62394
11:03:30,17,5,10.0.0.183,10.0.0.76,24960,62394
11:03:30,17,5,10.0.0.183,10.0.0.76,24960,62394
11:03:30,17,1,10.0.0.183,10.0.0.120,16872,2002
11:03:30,17,5,10.0.0.183,10.0.0.120,16872,2002
11:03:30,17,5,10.0.0.183,10.0.0.120,16872,2002
11:03:30,17,1,10.0.0.111,10.0.0.72,35350,3365
11:03:30,17,5,10.0.0.111,10.0.0.72,35350,3365
11:03:30,17,5,10.0.0.111,10.0.0.72,35350,3365
11:03:30,17,1,10.0.0.111,10.0.0.113,50840,28048
11:03:30,17,5,10.0.0.111,10.0.0.113,50840,28048
11:03:30,17,5,10.0.0.111,10.0.0.113,50840,28048
11:03:30,17,1,10.0.0.148,10.0.0.190,3389,6892
11:03:30,17,5,10.0.0.148,10.0.0.190,3389,6892
11:03:30,17,5,10.0.0.148,10.0.0.190,3389,6892
11:03:30,17,1,10.0.0.183,10.0.0.21,12683,27658
11:03:30,17,5,10.0.0.183,10.0.0.21,12683,27658
11:03:30,17,5,10.0.0.183,10.0.0.21,12683,27658
11:03:31,17,1,10.0.0.183,10.0.0.131,15703,29807
11:03:31,17,5,10.0.0.183,10.0.0.131,15703,29807
11:03:31,17,5,10.0.0.183,10.0.0.131,15703,29807
11:03:31,17,1,10.0.0.111,10.0.0.75,64309,11787
11:03:31,17,5,10.0.0.111,10.0.0.75,64309,11787
11:03:31,17,5,10.0.0.111,10.0.0.75,64309,11787
11:03:31,17,1,10.0.0.46,10.0.0.50,56401,63226
11:03:31,17,5,10.0.0.46,10.0.0.50,56401,63226
11:03:31,17,5,10.0.0.46,10.0.0.50,56401,63226
11:03:31,17,1,10.0.0.111,10.0.0.30,34219,51876
11:03:31,17,5,10.0.0.111,10.0.0.30,34219,51876
11:03:31,17,5,10.0.0.111,10.0.0.30,34219,51876
11:03:31,17,1,10.0.0.183,10.0.0.51,62064,47955
11:03:31,17,5,10.0.0.183,10.0.0.51,62064,47955
11:03:31,17,5,10.0.0.183,10.0.0.51,62064,47955
11:03:31,17,1,10.0.0.111,10.0.0.21,19296,53060
11:03:31,17,5,10.0.0.111,10.0.0.21,19296,53060
11:03:31,17,5,10.0.0.111,10.0.0.21,19296,53060
11:03:31,17,1,10.0.0.111,10.0.0.166,25949,24641
11:03:31,17,1,10.0.0.46,10.0.0.108,22390,37530
11:03:31,17,5,10.0.0.111,10.0.0.166,25949,24641
11:03:31,17,5,10.0.0.111,10.0.0.166,25949,24641
11:03:31,17,5,10.0.0.46,10.0.0.108,22390,37530
11:03:31,17,5,10.0.0.46,10.0.0.108,22390,37530
11:03:31,17,1,10.0.0.183,10.0.0.115,172,14265
11:03:31,17,1,10.0.0.148,10.0.0.132,49350,17513
11:03:31,17,5,10.0.0.183,10.0.0.115,172,14265
11:03:31,17,5,10.0.0.183,10.0.0.115,172,14265
11:03:31,17,5,10.0.0.148,10.0.0.132,49350,17513
11:03:31,17,5,10.0.0.148,10.0.0.132,49350,17513
11:03:31,17,1,10.0.0.111,10.0.0.162,40275,901
11:03:31,17,5,10.0.0.111,10.0.0.162,40275,901
11:03:31,17,5,10.0.0.111,10.0.0.162,40275,901
11:03:31,17,1,10.0.0.111,10.0.0.14,36200,58010
11:03:31,17,5,10.0.0.111,10.0.0.14,36200,58010
11:03:31,17,5,10.0.0.111,10.0.0.14,36200,58010
11:03:31,17,1,10.0.0.46,10.0.0.61,9496,37665
11:03:31,17,5,10.0.0.46,10.0.0.61,9496,37665
11:03:31,17,1,10.0.0.183,10.0.0.112,35794,8004
11:03:31,17,5,10.0.0.183,10.0.0.112,35794,8004
11:03:31,17,5,10.0.0.46,10.0.0.61,9496,37665
11:03:31,17,1,10.0.0.111,10.0.0.172,25529,14023
11:03:31,17,5,10.0.0.111,10.0.0.172,25529,14023
11:03:31,17,5,10.0.0.183,10.0.0.112,35794,8004
11:03:31,17,1,10.0.0.148,10.0.0.198,39864,17459
11:03:31,17,5,10.0.0.148,10.0.0.198,39864,17459
11:03:31,17,5,10.0.0.111,10.0.0.172,25529,14023
11:03:31,17,5,10.0.0.148,10.0.0.198,39864,17459
