module gitlab.com/evolves-fr/go/dsn

go 1.17

require (
	github.com/BurntSushi/toml v0.4.1
	github.com/stretchr/testify v1.7.0
	gopkg.in/yaml.v3 v3.0.0-20200313102051-9f266ea9e77c
)

require (
	github.com/davecgh/go-spew v1.1.0 // indirect
	github.com/pmezard/go-difflib v1.0.0 // indirect
)
