-8.459201007839389774e-01,-3.678747000374330001e-01,-2.262511639073526426e-01,6.854439120126767371e-01,8.993613372865877365e-01
-9.598896858849529368e-01,2.725416832613693496e-01,-4.141632476578009370e-01,-6.465312934645300880e-02,-4.727661793597412454e-01
-1.268140996029380185e-01,-4.235513128849916487e-01,-3.808627559168829002e-01,1.965438973257786770e-01,-3.794425272689253559e-01
-4.069184526650571621e-01,-7.157063178147247129e-01,6.855673868663578752e-01,4.109698827616054678e-02,8.235837511691421198e-02
-2.213178652554060877e-01,-1.135059803222349784e+00,-5.365423526305692636e-01,-2.542841010343981356e-01,-1.518213511872333332e-01
-1.358286500134006758e+00,-6.665384475484553706e-01,6.786356183400525655e-02,-4.296245909769151328e-01,-8.477913933909031474e-01
-1.472581148706577636e+00,-5.331168784902368118e-01,1.191140835507017881e+00,7.604826429628053219e-01,1.096163711958936249e-01
-3.909759582613492879e-01,-3.732713097921085965e-01,-2.629116627033776799e-01,5.712718964078541406e-01,2.491236427749648347e-02
-7.923682283308657315e-01,-2.580345739504820712e-01,9.117932027618995683e-01,6.110927599631594820e-01,-3.279655757024575458e-01
-7.882936675041825048e-01,-6.020936873011302204e-01,-8.305365980471395293e-01,-1.679819056186695470e-01,-8.657375287238077144e-01
-7.006584585242517926e-01,-2.600797564696535336e-01,1.920997444045982605e-01,1.166581188472723518e+00,6.470530240200693672e-01
-6.637844538366137748e-01,-7.558233748980555111e-01,-1.213634231360999766e-01,3.066646583529368808e-01,2.897532123999154718e-01
-4.733515395597815978e-01,-6.513999284131780643e-01,-9.944558049456113658e-01,8.024428809849087907e-01,-1.334573860079392826e+00
-1.486239599456013138e+00,8.047323711035452021e-02,-4.607539671590165642e-01,-6.000982492988899963e-01,-1.027055568468873414e-01
-5.875767892138258341e-01,-8.465388548296046700e-01,-1.048526201963811078e+00,8.516596406395696706e-01,-3.969116485447394260e-01
-8.190073845561408605e-01,6.645597205267904373e-02,-7.303944090475171791e-01,-4.408668041470601984e-01,-1.450264172208634225e-02
-7.017617448379546152e-01,-4.068449510478747144e-01,-4.755084096795425541e-01,1.219676872367572606e+00,1.508129937687386235e+00
-9.873283716050762493e-01,-8.962069356614325855e-02,-7.517516440459400817e-01,-4.944657205349651252e-01,-2.828579137516227388e-02
-5.799152127482190000e-01,-8.789967388880860766e-02,1.300129257334441402e-01,9.448111083303285529e-01,8.901552098420156822e-02
-7.888359269257129158e-01,-1.613279555406422205e-01,-7.548105038995809313e-01,8.836368115146354674e-01,-1.977247841437023146e-01
-4.349325316006830144e-01,-5.051743200918794585e-01,-2.926673878425544717e-01,-6.089575014468206864e-03,-2.435710761474263464e-01
-6.276843151451707570e-01,-5.037001665590706834e-01,-8.492726182477570995e-02,9.960817211649003466e-02,-5.620429481496594937e-01
-3.725513522700155677e-01,-4.830340983882887573e-01,7.631435528421655345e-02,5.304118978419002373e-01,-5.428217399368431284e-01
-4.727533433905119487e-01,7.431463569185739471e-02,-2.425433897199848199e-01,-3.446538232513194910e-01,-2.910529265865022808e-01
-5.626976407446383499e-01,1.836533334579183441e-01,2.592634088598670394e-01,4.544471304138923418e-01,-6.237740519902126302e-01
-3.878999321184122828e-01,9.746112589327733666e-02,-2.935408996489153877e-01,1.409572994203713847e+00,-6.957625326689695910e-01
-2.060285407272282043e+00,7.558630451250598903e-02,1.231886918326306368e+00,-5.829785899957296014e-01,-1.016450634911428175e+00
-7.378770018223648197e-01,-2.871780082381111265e-01,-1.289780066397765157e-01,6.016269962954191586e-01,-9.544678347069379676e-01
-2.059824371314764868e-01,-2.743583423006785704e-01,-1.121454473443479205e-01,-1.436387461328535731e-01,-2.524444910151168453e-01
-1.064576000992689009e+00,1.898580761307814280e-01,-4.447547769941876949e-01,-6.164214477827647531e-01,-3.873589468387124701e-01
-1.022349071176503754e+00,5.376285288717633781e-01,-2.441361323188203092e-01,2.120473151957557589e-01,-3.839929789895045742e-01
-2.041193749425078419e-01,-2.877346972544169157e-01,-2.199055707022627981e-01,2.078826958644671152e-01,-1.957920741799185071e-01
-2.971456681469574757e-01,-7.384680609841905996e-01,-1.418275339091487952e+00,1.277759913144051879e-02,-4.043623996398126308e-01
-1.035225943319449809e-01,-1.972879567609201912e+00,-6.992487905430719852e-01,1.700095332856508545e-01,6.873047766197819264e-02
-1.433034420517524499e+00,3.998086593977535075e-01,8.364460223730862606e-04,-5.033640596648151222e-01,-2.936806445506878749e-01
-6.337477108020996841e-01,-3.810400158382056673e-02,-2.239848561149827277e-01,9.024392330995656408e-02,-4.682695504868491509e-01
-6.317406813271667643e-01,8.722979053864399202e-02,-1.963455777279551895e-01,3.766373434749964444e-01,-1.202166235936600047e-01
-2.939150664891574949e-01,-7.925022708741132904e-01,5.179976744278534939e-01,3.330604365433185721e-01,-2.214088094726062717e-01
-8.159409227785587027e-02,-3.223499494577440339e-01,-8.120984820260729320e-02,3.124029940448890819e-01,-1.002518649827761066e-01
-1.226841626450692058e+00,4.364339844001545732e-01,3.293612164566525613e-01,1.005544697081673711e+00,-1.186048763422155261e+00
-4.248389937417721973e-01,-6.833882381461756084e-02,1.928678542233256965e-01,-8.460090721502928901e-02,-3.276415432772523673e-01
-2.381970941182234569e-01,-8.415849110161708335e-01,4.499188108489591276e-01,5.542119831816767483e-01,-7.463503622352730682e-01
-4.459372619099036816e-01,-6.344785794474147589e-02,-2.987596161685698304e-01,2.190772264717361639e-01,-2.476914681838802146e-01
-1.799107587596198599e+00,-9.249989304801997658e-01,-5.350020211785483371e-01,-1.124897022810271707e+00,1.201870122464034463e+00
-3.654989178516191428e-01,-6.884820700211372602e-01,-1.076552368131770576e+00,-3.274166859516879358e-01,-1.140380854762398505e-01
-1.338410536272403029e+00,-5.319392094140342753e-01,5.385738205504483345e-01,4.462770757258471277e-01,1.010487683061267017e+00
-1.850720936005716688e-01,-7.617632328664243335e-01,-1.173132786322799159e+00,-1.257140654654523571e-01,-2.157231907253163994e-01
-4.857843449606281672e-01,-4.482893956579843686e-01,-8.333975832302252529e-02,8.298664201334927659e-01,8.377742498050478881e-01
-6.570071685577807408e-01,-5.098251184601224062e-02,2.038741341933046625e-01,7.830060929093664024e-01,-8.532620720672893233e-01
-1.744284970773093690e-01,-3.717278510157113747e-01,-1.204058383102038499e-02,3.889721457109493463e-01,-3.743875339704954563e-01
-3.307652209562812473e-01,2.868808522953193024e-02,-4.542845085743866806e-01,5.372238051056089647e-01,-2.578565987714412922e-01
-2.959259506312142407e-01,-4.268107754893823991e-01,-5.656511600229103820e-01,6.327869562114213364e-01,1.303862918715530950e-01
-7.789131190150637707e-01,1.234865364347477873e-01,-3.012254436502961874e-01,9.945385014390939471e-01,-3.012087829435225114e-02
-1.231918115031509775e-01,-5.033068436962183645e-01,-1.521876786980606022e-01,9.912291098276347634e-02,1.701216807291487387e-01
-1.013039010409791052e+00,-4.065125522501797373e-01,-1.900244458856551466e+00,-6.720878486966225251e-01,9.649425885659772273e-02
-8.310193756807443544e-01,-4.093344778468920864e-01,3.223011041598877191e-01,-2.788773199552631657e-02,-4.949852429148140498e-01
-6.565440353274785146e-01,-4.149843076734204828e-01,-2.892039825994818236e-01,2.338688861624585447e-01,6.537952576291219398e-01
-6.323875779895047344e-01,-1.387376963858685808e-01,5.371348725418360892e-02,1.088193119270317588e+00,-3.005369090815786515e-01
-2.018023941116465769e-01,-3.416948065512254162e-01,-2.684032045503585984e-01,5.052401290479943130e-01,-2.546994485669031028e-02
-6.914762339691546966e-01,-1.567070672745854432e-01,-2.512769004971776021e-01,4.153653846902281011e-01,9.620403970647135594e-01
-5.393133464614165984e-01,-2.556523618387066543e-01,-4.431852176670412757e-01,-5.181193154297669690e-02,-3.229589047763073428e-01
-8.580718844278111268e-01,-6.726406436176781203e-03,-6.493875199835608125e-02,4.926351999783500774e-02,-2.507491162088864023e-01
-9.395151324456044728e-01,-1.014570690435864925e-01,-2.775752903732613963e-01,-6.453043071442315926e-02,3.957172719873092159e-01
-6.186259199192128966e-01,-6.843332385232333559e-01,-3.127433222845632521e-01,-7.027988517668313367e-03,-7.301976694761357356e-01
-7.885320595497626872e-01,-6.602179046051555034e-01,-9.299054077288454456e-03,1.252304105853039862e-01,-9.723375925739540238e-01
-4.156065093731277083e-01,-1.792282191921832080e-01,-1.370326099571506639e-01,1.707867168714157502e-01,2.495649091079266135e-01
-1.242043024860660649e+00,1.106408167021529221e-01,4.399720101233828284e-01,-3.896417682737738364e-01,-3.018898550726914487e-01
-5.906412473546686082e-01,-3.461051803606117749e-01,-1.597570604712804931e-01,1.866111423595646912e-01,4.302940744963902331e-01
-7.780234882353733727e-01,-2.633593991685074243e-01,-2.233753517988245341e-01,6.873767147504498132e-01,1.286679604436767210e+00
-8.772537626169569780e-01,-5.998341600581749179e-03,-1.643197767369924123e-01,2.007671095667390437e-01,-5.045265962760088208e-01
-2.081643125239453496e-01,-5.634541734651117295e-01,-6.132513680001778766e-01,4.332981422743965166e-02,-3.695639427925364595e-01
-1.016535597936187724e-01,-9.391540693789550698e-01,1.349316867845064827e-01,5.409197143306792438e-02,-2.281719755614640410e-01
-4.126629097609444408e-01,-2.686867031861452371e-01,-4.500758733802085604e-02,1.813515771003587629e-01,-6.123178567852666232e-01
-5.075228916349535657e-01,-8.230989372440991048e-01,1.038458777157830470e-01,-1.068295061232777121e-01,-3.828835162069142428e-01
-1.028195935481549084e+00,-2.199279791505318327e-01,3.524103972677153918e-01,-1.498926248880712020e-01,2.422151698679925746e-01
-6.619225005508718729e-01,2.034517879105758043e-01,-1.761545135935642659e-01,-3.358385151588314521e-01,-2.386000634590202674e-01
-7.525935410942984349e-01,-3.235141219346546193e-01,-1.104470992158241183e+00,8.189725340284216282e-01,1.475684216877019006e-01
-6.606606809028108263e-01,3.354378827427076382e-01,-4.981902505136635573e-01,5.376954488951350974e-01,3.787373052116855265e-01
-2.965966790942706766e-01,-1.667341983761519153e-01,-2.243257945570682754e-01,1.215081669420438604e-01,-5.939063626973073440e-02
-6.332242864341275368e-01,1.142766331698579080e-01,-6.578901331754892501e-03,1.357212196189387488e+00,-4.038002095719889217e-01
-3.596118383286286968e-01,-1.684773097249636642e+00,2.035587239541479798e-01,-2.670549014146046327e-02,-4.784501359027388823e-01
-7.504214500060876203e-01,3.547556915012813061e-02,-1.200425363214181695e+00,6.707878059237525337e-01,-2.250212361962639906e-01
-7.323566588100607344e-01,1.568566954842619543e-01,-2.431568889933862221e-01,1.021464158231887021e-01,3.262608118503911026e-02
-7.964645769304459222e-01,1.793435752226113511e-01,-6.219432300125116164e-01,2.021118146387040904e-02,-4.169423635868517719e-01
-5.977469126776522312e-01,-4.930571126137634486e-01,1.862477446557747607e-01,2.762002020274522684e-01,2.326995978612625970e-01
-6.475077400718236564e-01,-3.220757580558192279e-02,-7.951794196597773423e-01,3.725065100885312508e-01,7.749471784497828641e-02
-2.805608832563142863e-01,-1.965298954844383050e-01,-1.801267051248029438e-01,6.438283687033901082e-01,1.604081132198602044e-01
-1.024948190602143816e+00,-1.819485071313103663e+00,8.907321095491584906e-01,-1.989986885372352354e-01,-4.110269583243250646e-02
-7.420768422934145292e-01,-1.242914821939343356e-01,-8.688907579158154926e-01,5.216059116967274034e-02,-7.204886849247625902e-01
-2.396704677477437817e-01,-6.683546002318463408e-01,3.012670846970008642e-01,5.883919846881440208e-01,1.674819863046771162e-01
-7.174972124806372475e-01,5.526363838438929504e-02,4.961196154476306408e-02,6.565399693216336097e-01,-2.458430485634639229e-01
-4.766471918155228416e-01,-1.219050044976902614e-01,5.445410351448332770e-02,-1.903983569566222445e-01,8.763376701950353898e-02
-6.278770250971942024e-02,-1.177131744909300920e-01,-1.495236676229103334e-01,1.620266005110596597e-01,5.211197219617404175e-02
-1.967238547924163999e-03,-1.599670560674361308e+00,-7.246070226928855162e-02,6.168418424107798836e-01,-1.226016469255279073e+00
-9.054708964204493116e-01,5.339215868181576008e-01,-6.009217479473338841e-01,1.977417943668110967e+00,-4.020503044754143995e-01
-3.499200832439723907e-01,-1.445725264260525167e+00,5.011277213878817527e-01,6.548041304462901557e-01,-3.910303244125658273e-02
-5.034540004352120457e-01,-1.203964888800886923e+00,5.470179390873231018e-01,4.162895073297561699e-01,5.191297120962412581e-01
-1.109716859376427972e-01,-6.298340103457057415e-01,-3.153010722162323254e-01,5.194430175626630897e-01,-5.420539568083017068e-01
-6.301625533119711298e-01,-9.807924425314687999e-01,-1.280141011585945662e-02,2.782873365846289318e-02,4.958646463007972821e-02
-6.012326040767030921e-01,-5.110919782805052325e-01,2.938791281040564751e-02,6.778154618785945384e-01,3.178826492085958244e-01
