14,6,12
13,5,18
13,6,26
12,7,30
12,5,38
11,4,40
10,3,44
9,5,38
9,4,42
9,3,56
8,3,54
7,3,54
7,3,48
7,1,68
6,4,54
7,2,60
7,2,58
7,1,70
6,2,62
5,1,68
5,1,68
4,1,66
4,1,64
4,1,74
3,1,76
2,1,64
5,1,78
5,1,80
4,1,76
4,1,76
3,2,80
3,0,80
2,1,68
3,1,70
4,1,70
3,1,72
2,1,70
2,1,74
1,1,66
2,1,96
1,2,92
1,2,90
1,1,98
1,2,94
0,0,90
0,0,84
0,0,86
0,0,96
