14,13,8
13,13,10
13,14,12
13,13,16
13,12,22
12,9,26
12,9,30
11,14,20
11,10,36
10,12,26
10,11,30
11,13,26
11,13,30
11,13,28
11,11,32
10,8,40
9,11,34
9,8,40
9,12,36
9,11,44
10,10,38
9,11,34
11,12,38
10,11,38
10,13,38
9,12,44
8,14,36
9,13,38
9,12,40
8,10,44
8,11,46
8,11,42
8,12,44
8,14,40
8,9,54
9,10,50
9,11,52
9,10,52
8,13,46
9,9,50
9,11,46
10,12,44
10,12,48
9,8,60
9,13,48
9,10,58
9,9,56
9,10,56
10,9,54
9,9,54
9,11,58
8,12,50
8,9,60
8,11,60
8,11,58
8,9,60
8,11,58
8,10,58
9,11,58
8,7,68
8,9,62
8,10,62
8,11,58
8,11,52
7,12,50
8,12,54
8,11,58
8,8,68
8,9,70
8,12,56
8,10,64
8,11,62
8,10,62
8,11,60
8,9,68
7,9,70
6,8,72
7,10,64
7,8,64
8,13,52
8,13,54
8,12,58
9,14,50
8,8,70
9,10,64
8,7,70
8,8,72
8,12,64
9,11,70
8,8,70
8,10,72
7,10,68
7,10,68
6,12,64
6,12,62
7,8,72
7,11,62
8,11,58
8,9,70
9,9,66
8,11,58
8,8,72
7,9,64
8,11,62
7,11,64
7,9,64
7,10,64
8,6,84
7,8,78
6,10,68
6,10,66
6,8,74
7,10,66
7,9,70
8,12,64
7,11,60
7,8,66
6,12,58
6,9,64
6,12,64
5,10,74
6,11,62
7,11,66
7,9,76
6,7,74
6,12,64
6,11,72
6,8,74
7,9,66
8,11,74
7,11,70
7,10,64
7,9,70
8,10,70
7,11,68
7,10,70
7,10,78
6,10,76
6,12,60
6,10,68
5,10,68
5,13,64
5,9,70
6,10,68
6,12,66
6,13,64
7,7,82
7,10,76
6,4,126
5,7,106
4,9,80
4,7,86
4,7,86
5,7,84
5,8,90
4,8,84
3,6,86
5,9,82
6,9,72
6,9,82
7,11,70
7,10,74
6,11,64
8,10,70
8,9,68
7,9,66
7,8,70
6,10,66
6,8,72
5,10,66
5,7,72
7,11,72
7,12,66
7,10,72
6,13,66
7,6,86
6,9,78
5,7,80
6,12,68
6,7,84
6,7,84
6,9,80
7,9,76
7,10,82
6,12,74
6,6,88
6,9,82
6,10,84
5,9,78
5,11,76
4,13,70
4,12,74
4,12,72
5,9,86
6,8,82
6,11,76
6,11,76
6,10,82
5,9,90
4,9,76
3,8,84
3,7,84
4,9,80
3,11,74
3,10,80
4,8,86
3,10,78
2,2,114
3,4,114
4,5,124
4,4,124
4,6,130
4,7,106
4,6,104
3,6,108
4,6,110
5,6,100
5,8,94
5,9,92
5,9,98
5,7,108
6,6,108
6,6,104
7,7,100
6,10,92
6,7,100
6,9,90
6,9,96
6,7,92
7,6,96
6,11,86
6,9,92
6,9,98
5,12,88
6,10,90
6,11,90
6,6,102
6,7,94
6,6,102
6,10,98
6,9,96
6,9,98
6,9,98
6,9,98
7,8,98
6,9,94
6,9,98
5,8,92
5,8,92
5,8,94
4,7,86
4,8,84
5,10,88
4,7,94
3,10,86
3,9,86
4,8,88
4,7,94
4,8,88
3,8,88
3,9,84
3,8,90
2,10,80
4,8,92
5,6,88
4,8,86
4,9,84
5,8,92
5,8,94
5,9,108
5,8,94
5,8,96
4,7,96
4,9,92
4,5,98
5,10,84
5,9,80
5,10,82
5,9,82
5,11,82
5,11,76
5,11,82
5,11,80
5,10,84
5,8,84
5,8,88
4,11,80
4,11,80
4,11,82
4,11,76
5,11,82
7,10,84
8,10,84
8,12,78
7,9,92
7,11,84
8,12,78
8,12,80
8,13,72
8,10,80
7,11,78
8,9,82
8,9,84
7,11,78
7,11,78
7,10,80
6,11,82
5,12,76
6,11,82
5,13,76
6,10,84
5,12,76
5,13,76
5,9,88
4,3,130
3,4,120
2,2,132
3,3,132
2,3,108
2,3,114
1,4,106
0,4,106
2,3,114
2,4,106
1,3,120
2,4,122
3,1,130
3,2,126
3,4,118
4,4,128
4,2,126
3,4,126
3,5,122
4,4,120
4,0,124
4,2,124
3,5,110
3,3,114
3,5,108
3,4,112
2,5,104
2,5,110
1,4,110
0,4,106
0,4,106
1,4,110
0,4,104
