14,6,18
13,5,22
12,6,22
12,6,20
11,6,22
11,7,22
11,4,42
10,5,30
10,6,34
10,4,40
10,5,40
9,6,36
9,6,38
9,6,32
10,4,52
9,3,60
8,4,60
8,4,62
8,4,48
9,4,58
8,4,54
8,3,54
8,2,64
7,2,70
7,3,64
6,4,62
7,4,58
7,4,60
7,3,64
6,3,74
5,1,68
5,1,68
4,2,60
6,3,72
6,2,70
5,2,68
5,2,70
4,1,78
5,1,80
4,2,70
4,2,68
4,2,74
4,1,86
4,2,84
4,1,88
3,2,80
3,1,84
2,2,78
3,1,92
4,3,82
6,2,88
5,1,102
5,2,94
5,1,98
6,2,104
5,1,102
4,1,104
4,1,98
4,1,96
5,3,88
5,2,94
4,3,80
6,2,94
5,1,104
5,4,90
5,1,112
5,1,108
5,1,108
5,1,114
5,2,110
5,1,110
4,2,104
3,0,114
3,0,116
2,1,108
1,0,112
