14,10,10
14,9,20
13,11,18
13,13,16
13,9,26
12,11,28
11,12,24
12,12,26
12,11,28
12,11,32
12,10,34
11,13,26
11,11,36
10,11,36
11,11,42
11,10,46
11,8,42
11,11,38
11,11,42
10,12,38
11,11,42
10,12,38
10,11,44
10,10,44
10,10,52
10,13,38
10,12,44
11,12,46
10,11,44
9,10,46
9,10,46
8,12,42
9,11,44
9,9,54
9,13,44
9,10,54
9,9,54
8,10,48
8,9,58
7,10,58
8,9,56
8,12,48
8,8,60
9,10,60
9,12,52
9,12,56
8,10,58
8,12,54
9,10,56
8,10,56
7,10,56
7,10,58
6,11,50
8,10,66
9,11,60
8,12,58
8,11,54
8,7,70
7,9,66
6,9,62
6,10,58
6,10,58
6,8,62
6,7,76
7,10,64
7,9,64
7,9,62
7,11,58
7,8,64
6,7,64
7,7,74
8,9,60
8,9,72
8,10,70
8,9,60
9,12,56
9,11,50
8,8,70
7,10,56
8,12,56
8,9,72
7,12,56
8,12,60
7,14,54
7,10,60
7,9,64
7,10,62
8,10,72
8,10,64
9,9,78
8,8,66
8,11,64
8,10,62
8,13,54
8,12,64
7,9,70
8,11,58
8,11,62
8,13,58
8,13,58
8,10,72
8,8,78
7,10,66
7,12,66
8,12,62
8,14,56
9,11,64
8,12,60
7,12,62
7,14,58
8,8,80
7,9,78
6,8,76
6,8,76
6,10,70
7,13,64
6,10,80
6,11,72
6,13,64
6,12,68
5,13,62
5,12,64
6,11,68
5,12,70
5,13,62
4,9,78
6,11,74
6,11,68
6,11,70
7,9,66
7,11,70
7,10,72
8,12,64
8,14,54
9,9,68
9,10,74
10,12,58
9,12,54
9,10,64
8,13,56
7,6,92
6,10,64
6,11,60
8,13,60
7,7,80
6,8,70
5,12,64
5,13,60
6,11,66
7,6,88
6,11,64
6,13,60
6,12,64
6,10,70
6,9,70
7,6,88
7,8,80
7,9,78
7,9,80
8,11,74
9,10,78
9,10,72
9,13,62
9,10,72
8,11,68
8,11,72
8,7,76
9,10,72
8,11,68
8,11,70
8,10,70
8,10,72
7,8,76
7,8,78
7,11,72
7,10,76
8,9,80
8,9,74
7,11,74
6,10,74
6,12,70
6,12,72
6,12,70
7,11,76
7,12,70
7,10,82
6,9,76
5,12,70
5,12,72
5,10,74
5,10,72
5,11,68
6,11,78
6,10,78
6,11,70
7,10,70
8,12,68
8,8,80
8,10,74
7,10,74
7,11,70
7,7,84
6,8,78
5,10,70
4,9,76
5,9,78
5,11,74
6,11,78
6,8,86
5,8,82
5,8,82
7,10,74
6,10,78
5,9,80
4,11,74
4,10,78
4,9,80
5,8,86
5,7,86
5,6,86
5,9,82
5,13,70
7,6,94
6,7,90
6,8,86
6,9,80
6,9,88
5,8,90
5,9,84
5,10,88
6,11,84
7,11,80
6,10,82
7,11,76
6,11,76
6,9,82
6,9,80
5,8,82
6,8,80
5,9,82
4,8,78
4,8,82
5,9,84
5,11,80
4,10,80
5,12,74
5,9,86
4,8,84
5,11,78
4,10,78
3,10,76
3,9,80
3,11,74
4,7,88
5,11,72
6,10,88
6,8,90
6,11,78
6,9,86
5,11,80
5,10,84
4,11,80
4,9,84
4,10,84
3,11,80
4,7,84
3,8,82
3,3,142
2,6,108
4,9,96
4,7,100
4,8,104
4,9,100
5,6,124
5,5,128
4,5,118
4,6,112
3,5,124
3,6,122
3,6,124
3,5,116
3,7,120
3,6,124
2,6,122
2,3,134
1,5,140
2,4,142
3,2,128
6,6,104
6,5,106
5,8,98
4,7,100
5,7,106
5,8,100
5,8,98
4,4,128
3,9,94
4,7,98
5,8,96
6,6,110
7,8,104
6,5,104
5,6,100
4,6,104
5,6,96
6,7,92
6,10,80
6,10,82
7,10,88
7,11,82
7,10,80
7,8,94
6,8,86
6,10,88
6,8,86
5,10,80
5,11,80
4,9,84
5,10,82
5,12,74
6,10,90
6,10,86
6,8,88
6,11,80
6,9,86
8,12,76
8,13,76
7,12,80
7,10,84
6,10,82
5,11,78
5,11,76
6,11,82
6,12,78
7,11,78
8,9,88
8,13,76
8,9,92
8,12,82
7,10,88
6,12,82
6,9,90
6,11,82
7,10,90
7,11,80
6,11,82
6,11,78
5,12,78
5,10,78
6,12,78
6,11,94
5,5,152
5,10,104
5,6,112
4,6,118
3,6,114
4,8,100
4,7,104
4,7,106
4,10,100
4,10,100
4,10,106
3,10,100
4,8,116
3,9,108
5,1,136
4,2,136
3,5,130
3,5,128
3,5,126
2,4,128
2,3,128
3,4,132
3,2,134
4,0,144
5,3,136
5,3,134
5,4,132
5,6,118
5,6,118
5,5,118
6,8,116
7,8,116
6,4,150
5,7,118
5,5,120
5,7,118
4,6,118
3,3,122
4,4,114
5,4,118
4,7,114
4,6,116
3,8,108
3,7,114
3,7,116
2,3,128
1,6,114
3,9,110
4,8,108
3,2,132
3,3,150
2,3,142
2,5,140
1,4,138
1,4,136
2,5,132
3,5,136
3,4,128
2,3,136
2,7,126
3,7,124
2,7,130
2,8,124
4,8,138
5,6,126
5,6,130
4,9,120
4,7,116
3,5,126
4,5,116
4,8,112
4,7,112
3,6,120
3,7,112
4,7,110
4,8,112
5,8,106
5,11,96
5,10,94
5,13,82
6,11,98
5,4,168
6,10,116
6,10,112
5,8,112
5,9,106
6,8,108
7,7,116
7,10,110
7,6,120
6,7,118
6,7,116
6,7,124
6,5,112
5,8,122
5,7,124
6,9,116
5,7,126
5,8,126
4,7,122
4,6,114
4,8,118
5,7,122
5,8,118
4,9,112
5,10,110
4,10,106
4,10,108
5,9,110
6,8,118
5,6,112
5,5,116
4,7,122
4,6,114
3,5,112
5,9,106
4,8,108
4,9,108
3,8,108
5,8,106
4,2,140
3,7,110
2,7,112
1,7,106
0,7,102
0,7,106
