14,8,8
13,7,10
13,6,22
12,7,18
12,5,26
12,8,18
12,7,24
12,7,26
12,6,26
12,6,26
11,7,28
11,5,38
10,7,28
9,7,30
11,7,30
11,7,32
12,6,36
12,6,32
12,8,28
11,8,30
10,5,44
10,4,54
10,8,36
10,4,58
9,7,40
9,6,44
9,6,46
8,6,46
9,6,48
8,6,44
7,5,48
6,6,48
5,7,40
7,7,44
6,8,42
6,7,48
6,5,52
6,5,54
7,8,48
7,4,66
8,4,58
9,6,50
10,4,64
9,4,60
8,4,64
8,5,60
7,4,62
7,5,62
6,5,58
7,4,68
6,3,74
5,4,64
6,4,66
6,4,62
6,3,68
6,6,60
6,4,68
6,4,62
6,6,56
7,5,60
6,5,62
6,5,58
7,5,70
6,4,66
7,6,60
7,3,70
6,4,68
6,6,60
6,6,62
6,5,62
7,5,74
8,7,50
9,5,58
9,7,54
9,7,56
10,5,66
10,6,58
9,3,76
8,5,64
7,6,62
7,4,68
7,6,64
7,5,66
8,5,68
9,5,68
9,4,62
8,3,68
8,6,58
8,4,70
8,5,70
7,4,72
6,4,68
6,4,70
5,5,64
5,5,64
6,5,64
6,5,64
7,6,66
8,5,68
8,7,62
9,6,64
9,6,62
8,6,62
8,4,70
8,6,62
7,5,62
7,7,58
7,5,68
6,6,64
6,5,68
6,7,62
6,7,62
6,5,70
7,3,76
7,7,64
7,6,68
8,4,74
8,5,70
7,5,68
8,6,66
7,3,78
7,5,72
6,4,74
5,4,72
5,4,70
5,3,76
5,5,66
6,5,70
5,6,68
6,5,78
5,5,72
4,6,68
4,7,64
5,2,86
6,5,76
5,3,80
5,5,76
4,4,76
4,5,72
4,5,78
4,3,82
3,4,74
3,5,72
3,4,74
3,2,112
4,4,80
4,4,82
6,4,82
7,4,76
6,4,78
5,4,86
5,4,78
5,3,92
4,2,90
5,4,84
6,4,88
6,5,84
6,5,84
5,5,82
6,5,76
5,5,74
7,4,84
6,4,86
6,5,80
8,6,70
8,5,70
8,6,72
8,4,72
8,4,76
7,5,72
6,5,70
6,7,64
6,6,68
7,6,66
7,7,68
8,7,72
8,5,74
7,6,68
8,5,78
7,3,126
6,3,102
5,2,102
5,4,96
4,3,110
3,2,106
2,1,108
4,3,102
4,2,106
4,2,106
3,4,98
4,5,92
4,3,104
4,3,96
4,0,126
4,1,126
3,1,126
3,3,112
4,4,110
4,2,118
4,2,124
3,1,126
3,0,124
2,1,128
1,2,122
1,2,124
0,2,118
