{
    "extends": [
        "tslint-config-airbnb",
        "tslint-config-prettier",
        "tslint-plugin-prettier"
    ],
    "rules": {
        "function-name": false,
        "import-name": false,
        "interface-name": false,
        "member-access": [true, "no-public"],
        "no-empty-interface": false,
        "no-empty": false,
        "object-literal-sort-keys": false,
        "object-shorthand-properties-first": false,
        "ordered-imports": true,
        "prettier": [true, ".prettierrc"],
        "variable-name": [true, "allow-pascal-case", "ban-keywords"]
    }
}
