%YAML 1.1
%TAG !u! tag:unity3d.com,2011:
--- !u!1045 &1
EditorBuildSettings:
  m_ObjectHideFlags: 0
  serializedVersion: 2
  m_Scenes:
  - enabled: 0
    path: Assets/Scenes/SampleScene.unity
    guid: 2cda990e2423bbf4892e6590ba056729
  m_configObjects:
    com.unity.adaptiveperformance.simulator.provider_settings: {fileID: 11400000, guid: 5a5372d0d0656134cb9d18abdfa16f6a, type: 2}
    com.unity.addressableassets: {fileID: 11400000, guid: 95ada8fcd4cbdc0449f527e8a8f7c7b2, type: 2}
