%YAML 1.1
%TAG !u! tag:unity3d.com,2011:
--- !u!114 &11400000
MonoBehaviour:
  m_ObjectHideFlags: 0
  m_CorrespondingSourceObject: {fileID: 0}
  m_PrefabInstance: {fileID: 0}
  m_PrefabAsset: {fileID: 0}
  m_GameObject: {fileID: 0}
  m_Enabled: 1
  m_EditorHideFlags: 0
  m_Script: {fileID: 11500000, guid: 099387cbc34c48a198a0bd00809f3509, type: 3}
  m_Name: Money
  m_EditorClassIdentifier: 
  Key: Money
  Icon: {fileID: 21300000, guid: ff3957f48a5f01a4a98e753b961bfee7, type: 3}
