{
    "name": "WalletAssembly",
    "rootNamespace": "",
    "references": [
        "GUID:734d92eba21c94caba915361bd5ac177",
        "GUID:6055be8ebefd69e48b49212b09b47b2f",
        "GUID:e0cd26848372d4e5c891c569017e11f1",
        "GUID:2665a8d13d1b3f18800f46e256720795",
        "GUID:c38fb62397af04c51b143415e1db6d90",
        "GUID:8819f35a0fc84499b990e90a4ca1911f",
        "GUID:b0214a6008ed146ff8f122a6a9c2f6cc",
        "GUID:9e24947de15b9834991c9d8411ea37cf",
        "GUID:84651a3751eca9349aac36a66bba901b",
        "GUID:d8b63aba1907145bea998dd612889d6b"
    ],
    "includePlatforms": [],
    "excludePlatforms": [],
    "allowUnsafeCode": false,
    "overrideReferences": false,
    "precompiledReferences": [],
    "autoReferenced": true,
    "defineConstraints": [],
    "versionDefines": [],
    "noEngineReferences": false
}