%YAML 1.1
%TAG !u! tag:unity3d.com,2011:
--- !u!1045 &1
EditorBuildSettings:
  m_ObjectHideFlags: 0
  serializedVersion: 2
  m_Scenes:
  - enabled: 1
    path: Assets/Game/Scenes/MenuScene.unity
    guid: 0c6daad327471df4894bb6dbd584b70e
  - enabled: 1
    path: Assets/Game/Scenes/Level_1.unity
    guid: 4725225ea25604ab181fcfb2510c367b
  - enabled: 1
    path: Assets/Game/Scenes/Level_2.unity
    guid: 3303d20518a927943a4dc58e9792eeda
  m_configObjects: {}
