%YAML 1.1
%TAG !u! tag:unity3d.com,2011:
--- !u!114 &11400000
MonoBehaviour:
  m_ObjectHideFlags: 0
  m_CorrespondingSourceObject: {fileID: 0}
  m_PrefabInstance: {fileID: 0}
  m_PrefabAsset: {fileID: 0}
  m_GameObject: {fileID: 0}
  m_Enabled: 1
  m_EditorHideFlags: 0
  m_Script: {fileID: 11500000, guid: 30b14a2f232d24506b98740d4ab216fb, type: 3}
  m_Name: Level5
  m_EditorClassIdentifier: 
  _levelNumber: 5
  _playerAbilityDatas:
  - Time: 2.8
    CooldownTime: 0
    AbilityType: 0
  - Time: 2
    CooldownTime: 4.8
    AbilityType: 1
  - Time: 2
    CooldownTime: 4.8
    AbilityType: 2
  - Time: 1
    CooldownTime: 2.8
    AbilityType: 3
  _enemyAbilityDatas:
  - Time: 2.5
    CooldownTime: 0
    AbilityType: 0
