<svg width="164" height="164" viewBox="0 0 164 164" fill="none" xmlns="http://www.w3.org/2000/svg">
<path id="Ellipse 2" opacity="0.2" fill-rule="evenodd" clip-rule="evenodd" d="M81.9998 0.998806C127.247 0.998806 163.927 37.4395 163.927 82.3919C163.927 127.345 127.247 163.786 81.9998 163.786C36.7524 163.786 0.072028 127.345 0.072028 82.3919C0.072028 37.4395 36.7524 0.998806 81.9998 0.998806Z" fill="#1FDAB5"/>
</svg>
