<svg 
 xmlns="http://www.w3.org/2000/svg"
 xmlns:xlink="http://www.w3.org/1999/xlink"
 width="6px" height="9px">
<path fill-rule="evenodd"  opacity="0.851" fill="rgb(255, 255, 255)"
 d="M3.482,8.564 C4.046,9.128 4.961,9.128 5.525,8.564 C6.089,8.000 6.089,7.085 5.525,6.520 C4.961,5.956 3.487,4.502 3.487,4.502 C3.487,4.502 4.961,3.024 5.525,2.460 C6.089,1.896 6.089,0.981 5.525,0.417 C4.961,-0.147 4.046,-0.147 3.482,0.417 C3.468,0.432 3.453,0.446 3.437,0.462 C3.434,0.465 3.431,0.469 3.428,0.471 C3.415,0.484 3.403,0.496 3.391,0.509 C3.384,0.515 3.377,0.522 3.370,0.529 C3.361,0.538 3.352,0.548 3.342,0.557 C3.335,0.564 3.328,0.571 3.321,0.578 C3.312,0.588 3.302,0.598 3.292,0.608 C3.285,0.615 3.278,0.622 3.271,0.629 C3.261,0.639 3.251,0.649 3.240,0.659 C3.233,0.667 3.225,0.674 3.217,0.682 C3.207,0.692 3.197,0.703 3.187,0.713 C3.179,0.721 3.171,0.729 3.164,0.736 C3.153,0.747 3.143,0.757 3.133,0.767 C3.124,0.776 3.115,0.785 3.106,0.794 C3.096,0.804 3.087,0.813 3.077,0.823 C3.068,0.832 3.059,0.841 3.050,0.850 C3.040,0.860 3.030,0.871 3.020,0.881 C3.012,0.889 3.003,0.898 2.995,0.906 C2.984,0.917 2.973,0.928 2.962,0.939 C2.953,0.948 2.945,0.956 2.937,0.964 C2.925,0.976 2.914,0.988 2.902,1.000 C2.894,1.007 2.886,1.015 2.878,1.023 C2.866,1.035 2.854,1.048 2.842,1.060 C2.834,1.068 2.825,1.077 2.817,1.085 C2.805,1.097 2.793,1.109 2.781,1.121 C2.773,1.130 2.764,1.138 2.756,1.147 C2.743,1.159 2.731,1.171 2.719,1.184 C2.711,1.192 2.703,1.200 2.694,1.208 C2.682,1.221 2.669,1.234 2.656,1.247 C2.648,1.255 2.640,1.263 2.632,1.272 C2.619,1.285 2.606,1.298 2.593,1.311 C2.584,1.319 2.576,1.328 2.568,1.336 C2.555,1.349 2.542,1.362 2.529,1.375 C2.521,1.383 2.512,1.392 2.504,1.400 C2.491,1.414 2.478,1.427 2.464,1.440 C2.456,1.448 2.448,1.457 2.440,1.465 C2.426,1.479 2.413,1.492 2.399,1.506 C2.392,1.514 2.384,1.521 2.376,1.529 C2.362,1.544 2.347,1.558 2.333,1.573 C2.326,1.579 2.320,1.586 2.313,1.593 C2.298,1.608 2.283,1.624 2.267,1.639 C2.261,1.645 2.255,1.652 2.249,1.658 C2.232,1.675 2.216,1.691 2.199,1.708 C2.195,1.712 2.191,1.716 2.186,1.721 C2.168,1.739 2.151,1.757 2.133,1.775 C2.129,1.779 2.125,1.782 2.122,1.786 C2.103,1.805 2.084,1.824 2.066,1.842 C2.063,1.845 2.060,1.848 2.057,1.851 C2.038,1.871 2.019,1.890 2.000,1.909 C1.997,1.911 1.995,1.914 1.992,1.917 C1.972,1.937 1.951,1.958 1.931,1.979 C1.931,1.979 1.931,1.979 1.930,1.979 C1.126,2.790 0.384,3.541 0.396,3.524 C0.308,3.621 0.232,3.729 0.172,3.847 C0.172,3.848 0.172,3.848 0.172,3.848 C0.162,3.867 0.152,3.887 0.143,3.907 C0.143,3.908 0.142,3.909 0.142,3.910 C0.133,3.929 0.125,3.948 0.117,3.968 C0.116,3.970 0.116,3.972 0.115,3.973 C0.108,3.992 0.100,4.011 0.094,4.031 C0.093,4.034 0.092,4.037 0.091,4.039 C0.085,4.058 0.079,4.076 0.073,4.095 C0.072,4.099 0.071,4.103 0.070,4.108 C0.065,4.125 0.060,4.142 0.056,4.160 C0.054,4.166 0.053,4.172 0.052,4.177 C0.048,4.193 0.045,4.210 0.041,4.226 C0.040,4.234 0.039,4.242 0.037,4.249 C0.035,4.264 0.032,4.279 0.030,4.294 C0.029,4.304 0.028,4.314 0.026,4.324 C0.025,4.337 0.023,4.349 0.022,4.362 C0.020,4.376 0.020,4.389 0.019,4.402 C0.018,4.412 0.017,4.422 0.017,4.432 C0.016,4.455 0.015,4.478 0.015,4.502 C0.015,4.875 0.156,5.215 0.388,5.471 C0.297,5.370 2.544,7.625 3.482,8.564 Z"/>
</svg>