<svg xmlns="http://www.w3.org/2000/svg" width="18" height="18" viewBox="0 0 18 18" fill="none">
    <path fill-rule="evenodd" clip-rule="evenodd" d="M11.017 2.24943C11.228 2.03845 11.5141 1.91992 11.8125 1.91992C12.1109 1.91992 12.397 2.03845 12.608 2.24943L15.75 5.39143C15.961 5.60241 16.0795 5.88856 16.0795 6.18693C16.0795 6.48529 15.961 6.77144 15.75 6.98242L7.14775 15.5847C7.04226 15.6902 6.89918 15.7494 6.75 15.7494H3.375C3.07663 15.7494 2.79048 15.6309 2.5795 15.4199C2.36853 15.2089 2.25 14.9228 2.25 14.6244V11.4824C2.25 11.3347 2.2791 11.1884 2.33564 11.0519C2.39217 10.9154 2.47504 10.7914 2.57951 10.6869L11.017 2.24943ZM14.9545 6.18693L11.8125 3.04492L3.375 11.4824L2.98172 11.0891L3.375 11.4824L3.375 14.6244H6.517L14.9545 6.18693Z" fill="#5C99FC"/>
    <path fill-rule="evenodd" clip-rule="evenodd" d="M9.16475 4.10225C9.38442 3.88258 9.74058 3.88258 9.96025 4.10225L13.8977 8.03975C14.1174 8.25942 14.1174 8.61558 13.8977 8.83525C13.6781 9.05492 13.3219 9.05492 13.1023 8.83525L9.16475 4.89775C8.94508 4.67808 8.94508 4.32192 9.16475 4.10225Z" fill="#5C99FC"/>
</svg>
