{
  "BACKEND_BASE_URL": "http://localhost",
  "BACKEND_BASE_URL2": "https://hub.coolmanul.com",
  "BACKEND_BASE_URL1": "https://hub.thekiosko.com",
  "BACKEND_BASE_URL3": "https://hub1.thekiosko.com",
  "MERCURE_BASE_URL": "http://localhost:3000/.well-known/mercure",
  "MERCURE_BASE_URL2": "https://chat.coolmanul.com/.well-known/mercure",
  "MERCURE_BASE_URL1": "https://chat.thekiosko.com/.well-known/mercure",
  "MERCURE_BASE_URL3": "https://chat1.thekiosko.com/.well-known/mercure"
}
