<?xml version="1.0" encoding="UTF-8" standalone="no"?>
<svg width="21px" height="21px" viewBox="0 0 21 21" version="1.1" xmlns="http://www.w3.org/2000/svg" xmlns:xlink="http://www.w3.org/1999/xlink" xmlns:sketch="http://www.bohemiancoding.com/sketch/ns">
    <!-- Generator: Sketch 3.4.4 (17249) - http://www.bohemiancoding.com/sketch -->
    <title>Plus@2x</title>
    <desc>Created with Sketch.</desc>
    <defs></defs>
    <g id="Page-1" stroke="none" stroke-width="1" fill="none" fill-rule="evenodd" sketch:type="MSPage">
        <g id="Forsto--HD---КОЗ---Категория-1---Экран-4" sketch:type="MSArtboardGroup" transform="translate(-331.000000, -842.000000)" fill="#48595E">
            <g id="2-copy-3" sketch:type="MSLayerGroup" transform="translate(325.000000, 830.000000)">
                <g id="Plus" transform="translate(6.000000, 12.000000)" sketch:type="MSShapeGroup">
                    <path d="M19.6875,18.375 C19.6875,19.096875 19.0995,19.6875 18.375,19.6875 L2.625,19.6875 C1.9005,19.6875 1.3125,19.096875 1.3125,18.375 L1.3125,2.625 C1.3125,1.903125 1.9005,1.3125 2.625,1.3125 L18.375,1.3125 C19.0995,1.3125 19.6875,1.903125 19.6875,2.625 L19.6875,18.375 L19.6875,18.375 Z M18.375,0 L2.625,0 C1.17534375,0 0,1.1746875 0,2.625 L0,18.375 C0,19.8253125 1.17534375,21 2.625,21 L18.375,21 C19.8246563,21 21,19.8253125 21,18.375 L21,2.625 C21,1.1746875 19.8246563,0 18.375,0 L18.375,0 Z M14.4375,9.84375 L11.15625,9.84375 L11.15625,6.5625 C11.15625,6.2015625 10.86225,5.90625 10.5,5.90625 C10.13775,5.90625 9.84375,6.2015625 9.84375,6.5625 L9.84375,9.84375 L6.5625,9.84375 C6.20025,9.84375 5.90625,10.1390625 5.90625,10.5 C5.90625,10.8609375 6.20025,11.15625 6.5625,11.15625 L9.84375,11.15625 L9.84375,14.4375 C9.84375,14.7984375 10.13775,15.09375 10.5,15.09375 C10.86225,15.09375 11.15625,14.7984375 11.15625,14.4375 L11.15625,11.15625 L14.4375,11.15625 C14.79975,11.15625 15.09375,10.8609375 15.09375,10.5 C15.09375,10.1390625 14.79975,9.84375 14.4375,9.84375 L14.4375,9.84375 Z" id="Fill-42"></path>
                </g>
            </g>
        </g>
    </g>
</svg>