<?xml version="1.0" encoding="UTF-8" standalone="no"?>
<svg width="56px" height="44px" viewBox="0 0 56 44" version="1.1" xmlns="http://www.w3.org/2000/svg" xmlns:xlink="http://www.w3.org/1999/xlink" xmlns:sketch="http://www.bohemiancoding.com/sketch/ns">
    <!-- Generator: Sketch 3.5.2 (25235) - http://www.bohemiancoding.com/sketch -->
    <title>Group@2x</title>
    <desc>Created with Sketch.</desc>
    <defs></defs>
    <g id="Page-1" stroke="none" stroke-width="1" fill="none" fill-rule="evenodd" sketch:type="MSPage">
        <g id="Forsto--HD---Каталог-ТО---Выбор-другой-категории" sketch:type="MSArtboardGroup" transform="translate(-880.000000, -296.000000)">
            <g id="Готовые-комплекты-ТО" sketch:type="MSLayerGroup" transform="translate(866.000000, 278.000000)">
                <g id="Group" transform="translate(14.000000, 18.000000)" sketch:type="MSShapeGroup">
                    <path d="M48.1875,36.2857143 C49.602,36.2857143 50.75,37.4377143 50.75,38.8571429 C50.75,40.2765714 49.602,41.4285714 48.1875,41.4285714 C46.773,41.4285714 45.625,40.2765714 45.625,38.8571429 C45.625,37.4377143 46.773,36.2857143 48.1875,36.2857143 L48.1875,36.2857143 Z M43.0625,38.8571429 C43.0625,41.6972857 45.3572188,44 48.1875,44 C51.0177813,44 53.3125,41.6972857 53.3125,38.8571429 C53.3125,36.017 51.0177813,33.7142857 48.1875,33.7142857 C45.3572188,33.7142857 43.0625,36.017 43.0625,38.8571429 L43.0625,38.8571429 Z M7.6875,28.5714286 L7.6875,8 L7.6875,5.42857143 L8.96875,5.42857143 C9.67728125,5.42857143 10.25,4.85385714 10.25,4.14285714 C10.25,3.43314286 9.67728125,2.85714286 8.96875,2.85714286 L1.28125,2.85714286 C0.57271875,2.85714286 0,3.43314286 0,4.14285714 C0,4.85385714 0.57271875,5.42857143 1.28125,5.42857143 L5.125,5.42857143 L5.125,28.5714286 C5.125,31.4115714 7.41971875,33.7142857 10.25,33.7142857 L55.71875,33.7142857 C55.7584688,33.7142857 55.71875,32.4401429 55.71875,31.1428571 L10.25,31.1428571 C8.8355,31.1428571 7.6875,29.9908571 7.6875,28.5714286 Z M12.8125,36.2857143 C14.227,36.2857143 15.375,37.4377143 15.375,38.8571429 C15.375,40.2765714 14.227,41.4285714 12.8125,41.4285714 C11.398,41.4285714 10.25,40.2765714 10.25,38.8571429 C10.25,37.4377143 11.398,36.2857143 12.8125,36.2857143 L12.8125,36.2857143 Z M7.6875,38.8571429 C7.6875,41.6972857 9.98221875,44 12.8125,44 C15.6427813,44 17.9375,41.6972857 17.9375,38.8571429 C17.9375,36.017 15.6427813,33.7142857 12.8125,33.7142857 C9.98221875,33.7142857 7.6875,36.017 7.6875,38.8571429 L7.6875,38.8571429 Z" id="Fill-94" fill="#98BFCD"></path>
                    <rect id="Rectangle-1544" fill="#5C8999" x="14" y="10" width="8" height="18" rx="2"></rect>
                    <rect id="Rectangle-1544-Copy" fill="#1A3445" x="28" y="0" width="8" height="28" rx="2"></rect>
                    <rect id="Rectangle-1544-Copy-2" fill="#000000" x="42" y="6" width="8" height="23" rx="2"></rect>
                </g>
            </g>
        </g>
    </g>
</svg>