<?xml version="1.0" encoding="utf-8"?>
<!-- Generator: Adobe Illustrator 18.1.1, SVG Export Plug-In . SVG Version: 6.00 Build 0)  -->
<svg version="1.1" id="Layer_1" xmlns="http://www.w3.org/2000/svg" xmlns:xlink="http://www.w3.org/1999/xlink" x="0px" y="0px"
	 width="25.3px" height="60.1px" viewBox="0 0 25.3 60.1" enable-background="new 0 0 25.3 60.1" xml:space="preserve">
<path fill-rule="evenodd" clip-rule="evenodd" fill="#EA454E" d="M24.4,28.9l-4.1-3.2V24v-5v-3.2V14v-1.8V9.9l-3.2-1.8V6.8l-0.5-0.5
	L17.1,5l-0.5-2.3L15.3,0H9.9L8.6,2.7L8.1,5l0.5,1.4L8.1,6.8v1.4L5,9.9v2.3V14v1.8V19v5v1.8l-4.1,3.2v5.4L0,34.8l0.5,6.8h0.5v1.4h2.7
	l-0.5,9.5l1.4,0.5v2.7h3.6v0.9h1.4v0.5l0.5,3.2h5.4h0.5h0.5l0.5-0.5h0.5l0.5-0.5h0.5l0.5-0.5l0.5-0.5l0.5-0.5l0.5-0.5v-0.5l0.5-0.5
	V56v-0.5v-0.5h0.5v-0.5v-0.5v-0.5v-0.5v-0.5l0.9-0.5v-9.5h2.7v-1.4h0.5l0.5-6.8l-1.4-0.5L24.4,28.9z M19.9,34.8h-2.7v-4.5h4.5v3.6
	L19.9,34.8z M3.6,30.3h0.9h3.6v4.5H5l-1.4-0.9V30.3z M9,30.3h7.2v4.5H9V30.3z M7.7,19l0.5-0.5h9l0.5,0.5v5v3.2H7.7V24V19z M7.7,14
	v-0.5l0.2-0.5h0.2h9l0.5,0.5V14H7.7z M7.7,10.8l1.8-0.9h0.9h4.5h0.5l1.8,1.4l0.5,0.9H7.7V10.8z M10.4,4.5l0.5-0.9l0.5-1.4H14
	l0.5,1.4V5L14,5.9v0.9l0.9,0.9V9h-4.5V7.7l0.9-0.9V5.9L10.4,4.5z M7.2,15.4l0.5-0.5h0.5h9.3l0.2,0.5v0.5H7.2V15.4z M7.2,17.2
	l0.5-0.5h0.5h9.5l0.5,0.5v0.5H7.2V17.2z M5.9,28h0.9h0.9h9.9h1.8l1.4,1.4H4.5L5.9,28z M2.7,36.6L5,35.7h1.4h14l2.3,0.9v2.3h-2.3H5
	H2.7V36.6z M18.5,51.5v0.9c0,3.2-1.4,5-3.6,5c-0.9,0-1.8,0-2.7,0c0,0-0.5-0.5-0.5-0.9c0.9,0,1.8,0,2.7,0c1.4-0.5,1.8-1.4,1.8-3.6
	h-1.4l-0.5,1.4l-0.9,0.5v0.5h-0.5h-0.9h-0.5v-0.5l-0.9-0.5l-0.5-1.4H6.8v-1.4l-0.9-0.5v-9.5h0.9h12.6v9.5L18.5,51.5z M19.4,40.7H5.9
	l-2.7-0.5v-0.5h1.4h17.6v0.5L19.4,40.7z"/>
<g>
</g>
<g>
</g>
<g>
</g>
<g>
</g>
<g>
</g>
<g>
</g>
<g>
</g>
<g>
</g>
<g>
</g>
<g>
</g>
<g>
</g>
<g>
</g>
<g>
</g>
<g>
</g>
<g>
</g>
</svg>
