{
  "version": 1,
  "dependencies": [
    {
      "source": {
        "git": {
          "remote": "https://github.com/prometheus-operator/kube-prometheus",
          "subdir": "jsonnet/kube-prometheus"
        }
      },
      "version": "release-0.10"
    }
  ],
  "legacyImports": true
}
