<!-- Generated by IcoMoon.io -->
<svg version="1.1" xmlns="http://www.w3.org/2000/svg" width="331" height="512" viewBox="0 0 331 512">
<g id="icomoon-ignore">
</g>
<path d="M330.712 0c-38.455 232.927-10.987 512-10.987 512-102.18-13.185-206.558-13.185-308.738 0 0 0 27.468-279.073-10.987-512 0 0 115.365 24.172 330.712 0z"></path>
</svg>
