<?xml version="1.0" encoding="utf-8"?>
<!-- Generated by IcoMoon.io -->
<!DOCTYPE svg PUBLIC "-//W3C//DTD SVG 1.1//EN" "http://www.w3.org/Graphics/SVG/1.1/DTD/svg11.dtd">
<svg version="1.1" xmlns="http://www.w3.org/2000/svg" xmlns:xlink="http://www.w3.org/1999/xlink" width="1042" height="1024" viewBox="0 0 1042 1024">
<g id="icomoon-ignore">
</g>
<path d="M256.519 656.186c0.601 0.004 1.202 0.005 1.803 0.005 50.564 0 98.142-12.786 138.265-34.605 8.383-4.753 14.040-13.758 14.040-24.083 0-4.657-1.151-9.045-3.179-12.895-4.327-8.535-13.185-14.385-23.409-14.385-4.562 0-8.852 1.165-11.171 2.512-34.094 18.4-73.115 28.843-114.574 28.843-0.592 0-1.183-0.002-1.683-0.006-112.209 0-203.507-71.824-203.507-159.96s91.298-159.996 203.556-159.997c14.619-0.547 26.302-12.571 26.302-27.323s-11.683-26.776-26.352-27.325c-141.635 0-256.611 96.328-256.611 214.645s115.119 214.573 256.611 214.573zM785.354 656.186c141.635 0 256.611-96.22 256.611-214.573s-115.119-214.645-256.661-214.643c-14.619 0.547-26.302 12.571-26.302 27.323s11.683 26.776 26.352 27.325c112.173 0 203.471 71.896 203.471 159.996s-91.298 159.96-203.374 159.959c-0.632 0.005-1.265 0.007-1.899 0.007-41.529 0-80.609-10.485-113.326-28.251-3.742-2.061-8.043-3.234-12.618-3.234-10.212 0-19.059 5.844-23.375 14.367-2.027 3.853-3.174 8.24-3.174 12.896 0 10.334 5.651 19.347 12.626 23.425 41.55 22.582 89.169 35.409 139.784 35.409 0.663 0 1.325-0.002 1.884-0.006zM306.086 283.917h-1.186l-49.475-2.3c-14.194-0.873-25.375-12.599-25.375-26.935 0-0.548 0.016-1.092 0.048-1.631 0.743-14.488 12.732-26.012 27.413-26.012 0.1 0 0.201 0.001 0.301 0.002l16.512 0.79c-0.323-4.24-0.467-8.515-0.467-12.791 0-118.353 114.975-214.645 256.611-214.645s256.575 96.292 256.575 214.645c0 3.916 0 7.833-0.395 11.749l14.695 0.647c14.574 0.643 26.146 12.614 26.146 27.289 0 15.085-12.229 27.314-27.314 27.314-0.411 0-0.819-0.009-1.226-0.027l-44.423-2.046c-8.337-0.395-15.61-4.624-20.139-10.951-3.315-4.566-5.271-10.185-5.271-16.26 0-2.447 0.317-4.819 0.913-7.079 2.367-9.070 3.756-19.706 3.765-30.665 0-88.25-91.298-160.037-203.471-160.037s-203.471 71.86-203.471 160.031c-0.001 0.137-0.001 0.298-0.001 0.46 0 9.465 1.074 18.679 3.106 27.527 0.38 1.512 0.883 3.847 1.529 6.147 0.645 2.237 1.016 4.806 1.016 7.462 0 6.397-2.152 12.292-5.771 17-4.76 6.205-12.224 10.232-20.633 10.318zM800.157 1023.856h-543.546c-14.713-0.221-26.555-12.2-26.555-26.945 0-0.127 0.001-0.254 0.003-0.381v-367.687c0-14.664 11.888-26.552 26.552-26.552s26.552 11.888 26.552 26.552v340.399h490.442v-340.399c-0.011-0.291-0.018-0.634-0.018-0.977 0-14.684 11.904-26.588 26.588-26.588s26.588 11.904 26.588 26.588c0 0.344-0.007 0.686-0.019 1.026l0.001 367.657c0.002 0.108 0.002 0.234 0.002 0.362 0 14.757-11.862 26.744-26.572 26.945zM805.151 909.42c7.541 0 13.653-6.113 13.653-13.653s-6.113-13.653-13.653-13.653h-548.541c-7.541 0-13.653 6.113-13.653 13.653s6.113 13.653 13.653 13.653h548.541z"></path>
</svg>
