{
	"info": {
		"_postman_id": "c0418b27-713d-43d7-ad6a-7edbf3f55e18",
		"name": "POC - Entity Framework",
		"schema": "https://schema.getpostman.com/json/collection/v2.1.0/collection.json"
	},
	"item": [
		{
			"name": "Negócios",
			"request": {
				"method": "POST",
				"header": [],
				"body": {
					"mode": "raw",
					"raw": "{\r\n    \"descricao\": \"teste\"\r\n}",
					"options": {
						"raw": {
							"language": "json"
						}
					}
				},
				"url": {
					"raw": "http://localhost:5000/api/v1/selic/negocios",
					"protocol": "http",
					"host": [
						"localhost"
					],
					"port": "5000",
					"path": [
						"api",
						"v1",
						"selic",
						"negocios"
					]
				}
			},
			"response": []
		},
		{
			"name": "Negócios",
			"request": {
				"method": "GET",
				"header": [],
				"url": {
					"raw": "http://localhost:5000/api/v1/selic/negocios",
					"protocol": "http",
					"host": [
						"localhost"
					],
					"port": "5000",
					"path": [
						"api",
						"v1",
						"selic",
						"negocios"
					]
				}
			},
			"response": []
		},
		{
			"name": "Negócios/{Id}",
			"request": {
				"method": "GET",
				"header": [],
				"url": {
					"raw": "http://localhost:5000/api/v1/selic/negocios/1",
					"protocol": "http",
					"host": [
						"localhost"
					],
					"port": "5000",
					"path": [
						"api",
						"v1",
						"selic",
						"negocios",
						"1"
					]
				}
			},
			"response": []
		},
		{
			"name": "Negócios/{Id}/Especificações",
			"request": {
				"method": "POST",
				"header": [],
				"body": {
					"mode": "raw",
					"raw": "{\r\n    \"descricao\": \"teste\"\r\n}",
					"options": {
						"raw": {
							"language": "json"
						}
					}
				},
				"url": {
					"raw": "http://localhost:5000/api/v1/selic/negocios/3/especificacoes",
					"protocol": "http",
					"host": [
						"localhost"
					],
					"port": "5000",
					"path": [
						"api",
						"v1",
						"selic",
						"negocios",
						"3",
						"especificacoes"
					]
				}
			},
			"response": []
		},
		{
			"name": "Negócios/{Id}/Especificações",
			"request": {
				"method": "GET",
				"header": [],
				"url": {
					"raw": "http://localhost:5000/api/v1/selic/negocios/1",
					"protocol": "http",
					"host": [
						"localhost"
					],
					"port": "5000",
					"path": [
						"api",
						"v1",
						"selic",
						"negocios",
						"1"
					]
				}
			},
			"response": []
		},
		{
			"name": "Negócios/{Id}/Especificações/{IdEspecificação}",
			"request": {
				"method": "GET",
				"header": [],
				"url": {
					"raw": "http://localhost:5000/api/v1/selic/negocios/1/especificacoes/1",
					"protocol": "http",
					"host": [
						"localhost"
					],
					"port": "5000",
					"path": [
						"api",
						"v1",
						"selic",
						"negocios",
						"1",
						"especificacoes",
						"1"
					]
				}
			},
			"response": []
		},
		{
			"name": "Negócios/{Id}/Especificações/{IdEspecificação}/partes",
			"request": {
				"method": "POST",
				"header": [],
				"body": {
					"mode": "raw",
					"raw": "{\r\n    \"id_tipo\": 1,\r\n    \"descricao\": \"teste\"\r\n}",
					"options": {
						"raw": {
							"language": "json"
						}
					}
				},
				"url": {
					"raw": "http://localhost:5000/api/v1/selic/negocios/3/especificacoes/3/partes",
					"protocol": "http",
					"host": [
						"localhost"
					],
					"port": "5000",
					"path": [
						"api",
						"v1",
						"selic",
						"negocios",
						"3",
						"especificacoes",
						"3",
						"partes"
					]
				}
			},
			"response": []
		},
		{
			"name": "Negócios/{Id}/Especificações/{IdEspecificação}/partes",
			"request": {
				"method": "GET",
				"header": [],
				"url": {
					"raw": "http://localhost:5000/api/v1/selic/negocios/1/especificacoes/1/partes",
					"protocol": "http",
					"host": [
						"localhost"
					],
					"port": "5000",
					"path": [
						"api",
						"v1",
						"selic",
						"negocios",
						"1",
						"especificacoes",
						"1",
						"partes"
					]
				}
			},
			"response": []
		},
		{
			"name": "Negócios/{Id}/Especificações/{IdEspecificação}/partes/{IdTipo}",
			"request": {
				"method": "GET",
				"header": [],
				"url": {
					"raw": "http://localhost:5000/api/v1/selic/negocios/1/especificacoes/1/partes/1",
					"protocol": "http",
					"host": [
						"localhost"
					],
					"port": "5000",
					"path": [
						"api",
						"v1",
						"selic",
						"negocios",
						"1",
						"especificacoes",
						"1",
						"partes",
						"1"
					]
				}
			},
			"response": []
		}
	]
}