{
  "users": [
    {
      "id": 27,
      "email": "valeria.delafuente@fakeemail.cl",
      "firstName": "Valeria",
      "lastName": "De la Fuente",
      "phone": "+56951172346683",
      "dateOfBirth": "1993-01-01",
      "employeeId": "13.560.996-Q",
      "locationId": [1],
      "positionId": [2],
      "hireDate": "2017-08-02",
      "address": "Padre Mariano 82",
      "region": null,
      "commune": null,
      "isActive": false,
      "isAssociated": false,
      "contract": 2,
      "avatarUrl": null
    },
    {
      "id": 5,
      "email": "benjamin.delvalle@fakeemail.cl",
      "firstName": "Ricardo",
      "lastName": "Del Valle",
      "phone": "56995003525432",
      "dateOfBirth": "1985-01-01",
      "employeeId": "16.799.100-Q",
      "locationId": [1],
      "positionId": [2],
      "hireDate": "2015-02-05",
      "address": "Padre Mariano 82",
      "region": null,
      "commune": null,
      "isActive": false,
      "isAssociated": true,
      "contract": 2,
      "avatarUrl": "https://randomuser.me/api/portraits/men/80.jpg"
    },
    {
      "id": 21,
      "email": "nicole.silva@fakeemail.cl",
      "firstName": "Nicole",
      "lastName": "Silva",
      "phone": "56951352234224",
      "dateOfBirth": "1994-01-01",
      "employeeId": "18.609.038-Q",
      "locationId": [2],
      "positionId": [6],
      "hireDate": "2016-06-02",
      "address": "Padre Mariano 82",
      "region": null,
      "commune": null,
      "isActive": false,
      "isAssociated": true,
      "contract": 2,
      "avatarUrl": "https://randomuser.me/api/portraits/women/24.jpg"
    },
    {
      "id": 3,
      "email": "ariel.mollo@fakeemail.cl",
      "firstName": "Ariel",
      "lastName": "Mollo",
      "phone": "569511983232",
      "dateOfBirth": "1992-01-01",
      "employeeId": "18.291.907-Q",
      "locationId": [3],
      "positionId": [3],
      "hireDate": "2018-09-14",
      "address": "Padre Mariano 82",
      "region": null,
      "commune": null,
      "isActive": false,
      "isAssociated": true,
      "contract": 2,
      "avatarUrl": "https://randomuser.me/api/portraits/men/35.jpg"
    },
    {
      "id": 30,
      "email": "fwufgwef@fakeemail.cl",
      "firstName": "Rick",
      "lastName": "Sanchez",
      "phone": "+56 234 234 234",
      "dateOfBirth": "2004-11-11",
      "employeeId": "42.342.343-Q",
      "locationId": [3],
      "positionId": [2],
      "hireDate": "2020-11-11",
      "address": "werwerwer",
      "region": null,
      "commune": null,
      "isActive": false,
      "isAssociated": false,
      "contract": 1,
      "avatarUrl": "https://pm1.narvii.com/6423/e2c1644c8814feb8d774afb50a5521fd8ad30202_hq.jpg"
    },
    {
      "id": 26,
      "email": "tamara.cantillana@fakeemail.cl",
      "firstName": "Tamara",
      "lastName": "Cantillana",
      "phone": "569525453245278",
      "dateOfBirth": "1991-01-01",
      "employeeId": "11.816.029-Q",
      "locationId": [1],
      "positionId": [2],
      "hireDate": "2018-11-01",
      "address": "Padre Mariano 82",
      "region": null,
      "commune": null,
      "isActive": false,
      "isAssociated": true,
      "contract": 2,
      "avatarUrl": "https://randomuser.me/api/portraits/women/57.jpg"
    },
    {
      "id": 22,
      "email": "patricio.villena@fakeemail.cl",
      "firstName": "Patricio",
      "lastName": "Villena",
      "phone": "5697719433419",
      "dateOfBirth": "1987-01-01",
      "employeeId": "16.628.004-Q",
      "locationId": [2],
      "positionId": [6],
      "hireDate": "2017-12-19",
      "address": "Padre Mariano 82",
      "region": null,
      "commune": null,
      "isActive": false,
      "isAssociated": true,
      "contract": 2,
      "avatarUrl": "https://randomuser.me/api/portraits/men/86.jpg"
    },
    {
      "id": 16,
      "email": "nata.oya@fakeemail.cl",
      "firstName": "Nathaly",
      "lastName": "Oyanedel",
      "phone": "569772942232454",
      "dateOfBirth": "1992-01-01",
      "employeeId": "18.270.085-Q",
      "locationId": [2],
      "positionId": [2],
      "hireDate": "2019-01-29",
      "address": "Padre Mariano 82",
      "region": null,
      "commune": null,
      "isActive": false,
      "isAssociated": true,
      "contract": 2,
      "avatarUrl": "https://randomuser.me/api/portraits/women/4.jpg"
    },
    {
      "id": 29,
      "email": "ash.ketchum@fakepokemail.cl",
      "firstName": "Ash",
      "lastName": "Ketchum",
      "phone": "+564543523467",
      "dateOfBirth": "2004-11-11",
      "employeeId": "66.666.666-Q",
      "locationId": [1],
      "positionId": [3],
      "hireDate": "2020-11-11",
      "address": "Pueblo Paleta",
      "region": null,
      "commune": null,
      "isActive": false,
      "isAssociated": false,
      "contract": 1,
      "avatarUrl": "https://avatarfiles.alphacoders.com/261/261848.gif"
    },
    {
      "id": 20,
      "email": "nicolas.vargas@fakeemail.cl",
      "firstName": "Karen",
      "lastName": "Quininao",
      "phone": "5699535842372",
      "dateOfBirth": "1989-01-01",
      "employeeId": "17.391.504-Q",
      "locationId": [1],
      "positionId": [1],
      "hireDate": "2018-03-01",
      "address": "Padre Mariano 82",
      "region": null,
      "commune": null,
      "isActive": false,
      "isAssociated": true,
      "contract": 2,
      "avatarUrl": "https://randomuser.me/api/portraits/women/88.jpg"
    },
    {
      "id": 10,
      "email": "cynthia.gutierrez@fakeemail.cl",
      "firstName": "Cynthia",
      "lastName": "Gutierrez",
      "phone": "5695472204434",
      "dateOfBirth": "1993-01-01",
      "employeeId": "18.537.505-Q",
      "locationId": [2],
      "positionId": [6],
      "hireDate": "2019-12-30",
      "address": "Padre Mariano 82",
      "region": null,
      "commune": null,
      "isActive": false,
      "isAssociated": true,
      "contract": 2,
      "avatarUrl": "https://randomuser.me/api/portraits/women/8.jpg"
    },
    {
      "id": 28,
      "email": "vaneza.flores@fakeemail.cl",
      "firstName": "Vaneza",
      "lastName": "Flores",
      "phone": "+56959278622",
      "dateOfBirth": "1978-01-01",
      "employeeId": "11.129.908-Q",
      "locationId": [1],
      "positionId": [1],
      "hireDate": "2016-03-01",
      "address": "Padre Mariano 82",
      "region": null,
      "commune": null,
      "isActive": false,
      "isAssociated": false,
      "contract": 2,
      "avatarUrl": "https://randomuser.me/api/portraits/women/10.jpg"
    },
    {
      "id": 7,
      "email": "catalina.guerra@fakeemail.cl",
      "firstName": "Catalina",
      "lastName": "Guerra",
      "phone": "56986535628634",
      "dateOfBirth": "1996-01-01",
      "employeeId": "19.208.012-Q",
      "locationId": [1],
      "positionId": [4],
      "hireDate": "2019-12-30",
      "address": "Padre Mariano 82",
      "region": null,
      "commune": null,
      "isActive": false,
      "isAssociated": true,
      "contract": 2,
      "avatarUrl": "https://randomuser.me/api/portraits/women/36.jpg"
    },
    {
      "id": 12,
      "email": "elizabeth.valdebenito@fakeemail.cl",
      "firstName": "Elizabeth",
      "lastName": "Valdebenito",
      "phone": "56934576006035",
      "dateOfBirth": "1988-01-01",
      "employeeId": "17.085.016-Q",
      "locationId": [2],
      "positionId": [7],
      "hireDate": "2016-11-02",
      "address": "Padre Mariano 82",
      "region": null,
      "commune": null,
      "isActive": false,
      "isAssociated": true,
      "contract": 2,
      "avatarUrl": "https://randomuser.me/api/portraits/women/52.jpg"
    },
    {
      "id": 17,
      "email": "mariaines.pino@fakeemail.cl",
      "firstName": "Karla",
      "lastName": "Coloma",
      "phone": "56951345234820",
      "dateOfBirth": "1988-01-01",
      "employeeId": "16.868.701-Q",
      "locationId": [2],
      "positionId": [8],
      "hireDate": "2013-01-01",
      "address": "Padre Mariano 82",
      "region": null,
      "commune": null,
      "isActive": false,
      "isAssociated": true,
      "contract": 2,
      "avatarUrl": "https://randomuser.me/api/portraits/men/61.jpg"
    },
    {
      "id": 13,
      "email": "jennifer.urrutia@fakeemail.cl",
      "firstName": "Jennifer",
      "lastName": "Urrutia",
      "phone": "56951111812227",
      "dateOfBirth": "1991-01-01",
      "employeeId": "17.940.952-Q",
      "locationId": [1],
      "positionId": [8],
      "hireDate": "2018-03-05",
      "address": "Padre Mariano 82",
      "region": null,
      "commune": null,
      "isActive": false,
      "isAssociated": true,
      "contract": 1,
      "avatarUrl": "https://randomuser.me/api/portraits/women/63.jpg"
    },
    {
      "id": 6,
      "email": "camilo.tapia@virginmoffdile.cl",
      "firstName": "Camilo",
      "lastName": "Tapia",
      "phone": "56978615753434",
      "dateOfBirth": "1984-01-01",
      "employeeId": "15.936.040-Q",
      "locationId": [1],
      "positionId": [4, 7],
      "hireDate": "2017-07-03",
      "address": "Padre Mariano 82",
      "region": null,
      "commune": null,
      "isActive": false,
      "isAssociated": true,
      "contract": 1,
      "avatarUrl": "https://randomuser.me/api/portraits/men/41.jpg"
    },
    {
      "id": 9,
      "email": "cristian.traslavina@fakeemail.clv",
      "firstName": "Cristian",
      "lastName": "Traslaviña",
      "phone": "56993338180346",
      "dateOfBirth": "1992-01-01",
      "employeeId": "18.362.066-Q",
      "locationId": [3],
      "positionId": [3],
      "hireDate": "2019-03-28",
      "address": "Padre Mariano 82",
      "region": null,
      "commune": null,
      "isActive": false,
      "isAssociated": true,
      "contract": 2,
      "avatarUrl": "https://randomuser.me/api/portraits/men/66.jpg"
    },
    {
      "id": 15,
      "email": "jonathan.bettancourt@fakeemail.cl",
      "firstName": "Jonathan",
      "lastName": "Bettancourt",
      "phone": "56952402282342",
      "dateOfBirth": "1990-01-01",
      "employeeId": "17.609.960-Q",
      "locationId": [3],
      "positionId": [7, 8],
      "hireDate": "2018-09-14",
      "address": "Padre Mariano 82",
      "region": null,
      "commune": null,
      "isActive": false,
      "isAssociated": true,
      "contract": 2,
      "avatarUrl": "https://randomuser.me/api/portraits/men/8.jpg"
    },
    {
      "id": 11,
      "email": "edgardo.perez@fakeemail.clf",
      "firstName": "Edgardo",
      "lastName": "Pérez",
      "phone": "5695496970235",
      "dateOfBirth": "1988-01-01",
      "employeeId": "17.128.706-Q",
      "locationId": [3],
      "positionId": [6],
      "hireDate": "2017-07-03",
      "address": "Padre Mariano 82",
      "region": null,
      "commune": null,
      "isActive": false,
      "isAssociated": true,
      "contract": 2,
      "avatarUrl": "https://randomuser.me/api/portraits/men/34.jpg"
    },
    {
      "id": 14,
      "email": "jhonathan.cornejo@fakeemail.cl",
      "firstName": "Jhonathan",
      "lastName": "Cornejo",
      "phone": "56995461438234",
      "dateOfBirth": "1994-01-01",
      "employeeId": "18.830.015-Q",
      "locationId": [2],
      "positionId": [8],
      "hireDate": "2019-01-29",
      "address": "Padre Mariano 82",
      "region": null,
      "commune": null,
      "isActive": false,
      "isAssociated": true,
      "contract": 1,
      "avatarUrl": "https://randomuser.me/api/portraits/men/11.jpg"
    },
    {
      "id": 8,
      "email": "cinthya.fredes@fakeemail.cl",
      "firstName": "Cinthya",
      "lastName": "Fredes",
      "phone": "56951031234356",
      "dateOfBirth": "1997-01-01",
      "employeeId": "19.803.740-Q",
      "locationId": [1],
      "positionId": [2, 7],
      "hireDate": "2019-09-30",
      "address": "Padre Mariano 82",
      "region": null,
      "commune": null,
      "isActive": false,
      "isAssociated": true,
      "contract": 2,
      "avatarUrl": "https://randomuser.me/api/portraits/women/27.jpg"
    },
    {
      "id": 24,
      "email": "ricardo.rojas@fakeemail.cl",
      "firstName": "Ricardo",
      "lastName": "Rojas",
      "phone": "569883142354214",
      "dateOfBirth": "1991-01-01",
      "employeeId": "17.664.909-Q",
      "locationId": [3],
      "positionId": [7],
      "hireDate": "2018-09-01",
      "address": "Padre Mariano 82",
      "region": null,
      "commune": null,
      "isActive": false,
      "isAssociated": true,
      "contract": 2,
      "avatarUrl": "https://randomuser.me/api/portraits/men/72.jpg"
    },
    {
      "id": 25,
      "email": "sebastian.escobar@fakeemail.cl",
      "firstName": "Sebastian",
      "lastName": "Escobar",
      "phone": "+56985132356035",
      "dateOfBirth": "1995-01-01",
      "employeeId": "19.317.498-Q",
      "locationId": [3],
      "positionId": [1, 6],
      "hireDate": "2019-12-30",
      "address": "Padre Mariano 82",
      "region": null,
      "commune": null,
      "isActive": false,
      "isAssociated": false,
      "contract": 2,
      "avatarUrl": null
    },
    {
      "id": 4,
      "email": "beatriz.higuera@fakeemail.cl",
      "firstName": "Beatriz",
      "lastName": "Higuera",
      "phone": "569662420521",
      "dateOfBirth": "1986-01-01",
      "employeeId": "15.920.021-Q",
      "locationId": [1],
      "positionId": [4],
      "hireDate": "2018-03-01",
      "address": "Padre Mariano 82",
      "region": null,
      "commune": null,
      "isActive": false,
      "isAssociated": true,
      "contract": 2,
      "avatarUrl": "https://randomuser.me/api/portraits/women/33.jpg"
    },
    {
      "id": 23,
      "email": "ricardo.rivera@fakeemail.cl",
      "firstName": "Monica",
      "lastName": "Novoa",
      "phone": "56965949698345",
      "dateOfBirth": "1996-01-01",
      "employeeId": "14.710.905-Q",
      "locationId": [1],
      "positionId": [2],
      "hireDate": "2019-12-30",
      "address": "Padre Mariano 82",
      "region": null,
      "commune": null,
      "isActive": false,
      "isAssociated": true,
      "contract": 2,
      "avatarUrl": "https://randomuser.me/api/portraits/men/62.jpg"
    },
    {
      "id": 18,
      "email": "marina.aedo@fakeemail.cl",
      "firstName": "Marina",
      "lastName": "Aedo",
      "phone": "56961028823490",
      "dateOfBirth": "1991-01-01",
      "employeeId": "17.907.005-Q",
      "locationId": [1],
      "positionId": [6],
      "hireDate": "2019-09-26",
      "address": "Padre Mariano 82",
      "region": null,
      "commune": null,
      "isActive": false,
      "isAssociated": true,
      "contract": 1,
      "avatarUrl": "https://randomuser.me/api/portraits/women/51.jpg"
    },
    {
      "id": 19,
      "email": "mauricio.vicencio@fakeemail.cl",
      "firstName": "Mauricio",
      "lastName": "Vicencio",
      "phone": "5695125493225",
      "dateOfBirth": "1981-01-01",
      "employeeId": "14.190.673-Q",
      "locationId": [2],
      "positionId": [1],
      "hireDate": "2019-12-01",
      "address": "Padre Mariano 82",
      "region": null,
      "commune": null,
      "isActive": false,
      "isAssociated": true,
      "contract": 2,
      "avatarUrl": "https://randomuser.me/api/portraits/men/57.jpg"
    }
  ],
  "locations": [
    {
      "id": 1,
      "name": "Ñuñoa",
      "address1": "Av. José Pedro Alessandri 19",
      "address2": null,
      "startTime": "07:00",
      "endTime": "22:00",
      "region": "Metropolitana de Santiago",
      "commune": "Ñuñoa"
    },
    {
      "id": 2,
      "name": "Providencia",
      "address1": "Av. Nueva Providencia 1341",
      "address2": "Local 103",
      "startTime": "08:00",
      "endTime": "23:00",
      "region": "Metropolitana de Santiago",
      "commune": "Providencia"
    },
    {
      "id": 3,
      "name": "Santiago",
      "address1": "Estado 125",
      "address2": null,
      "startTime": "06:00",
      "endTime": "00:00",
      "region": "Metropolitana de Santiago",
      "commune": "Santiago"
    }
  ],
  "positions": [
    {
      "id": 1,
      "name": "Copero/a",
      "description": null
    },
    {
      "id": 2,
      "name": "Recepcionista",
      "description": null
    },
    {
      "id": 3,
      "name": "Chef",
      "description": null
    },
    {
      "id": 4,
      "name": "Garzón/a",
      "description": null
    },
    {
      "id": 6,
      "name": "Barista",
      "description": null
    },
    {
      "id": 7,
      "name": "Supervisor/a",
      "description": null
    },
    {
      "id": 8,
      "name": "Aseo",
      "description": null
    }
  ],
  "contracts": [
    {
      "id": 1,
      "code": "JLO40",
      "kind": 0,
      "name": "Jornada Laboral Ordinaria",
        "legalMaxWeeklyHours": 40
    },
    {
      "id": 2,
      "code": "JP20",
      "kind": 1,
      "name": "Jornada Parcial",
      "legalMaxWeeklyHours": 25
    }
  ],
  "turnTemplates": [
    {
      "id": 1,
      "checkIn": "08:00",
      "checkOut": "16:00",
      "name": "Apertura Chef",
      "restType": "Horario Libre",
      "breakTime": 60,
      "notes": "",
      "positionId": 3,
      "locationId": []
    },
    {
      "id": 2,
      "checkIn": "13:00",
      "checkOut": "20:00",
      "name": "Intermedio Barista",
      "restType": "Horario Libre",
      "breakTime": 60,
      "notes": "",
      "positionId": 6,
      "locationId": [2, 3]
    },
    {
      "id": 3,
      "checkIn": "17:00",
      "checkOut": "23:00",
      "name": "Cierre Barista",
      "restType": "Horario Libre",
      "breakTime": 30,
      "notes": "",
      "positionId": 6,
      "locationId": [2]
    },
    {
      "id": 4,
      "checkIn": "16:00",
      "checkOut": "23:00",
      "name": "Cierre Garzón/a",
      "restType": "Horario Libre",
      "breakTime": 30,
      "notes": "",
      "positionId": 4,
      "locationId": [1]
    },
    {
      "id": 5,
      "checkIn": "07:00",
      "checkOut": "14:00",
      "name": "Apertura Barista",
      "restType": "Horario Libre",
      "breakTime": 30,
      "notes": "",
      "positionId": 6,
      "locationId": [1, 2]
    },
    {
      "id": 6,
      "checkIn": "13:00",
      "checkOut": "21:00",
      "name": "Intermedio Aseo",
      "restType": "Horario Libre",
      "breakTime": 60,
      "notes": "",
      "positionId": 8,
      "locationId": [3]
    },
    {
      "id": 7,
      "checkIn": "07:00",
      "checkOut": "14:00",
      "name": "Apertura Aseo",
      "restType": "Horario Libre",
      "breakTime": 30,
      "notes": "",
      "positionId": 8,
      "locationId": [1, 2, 3]
    },
    {
      "id": 8,
      "checkIn": "12:00",
      "checkOut": "21:00",
      "name": "Intermedio Garzón/a",
      "restType": "Horario Libre",
      "breakTime": 60,
      "notes": "",
      "positionId": 4,
      "locationId": [3]
    },
    {
      "id": 9,
      "checkIn": "15:00",
      "checkOut": "22:00",
      "name": "Intermedio Chef",
      "restType": "Horario Libre",
      "breakTime": 30,
      "notes": "",
      "positionId": 3,
      "locationId": [3]
    },
    {
      "id": 10,
      "checkIn": "07:00",
      "checkOut": "13:00",
      "name": "Apertura Supervisor",
      "restType": "Horario Libre",
      "breakTime": 30,
      "notes": "",
      "positionId": 8,
      "locationId": [1, 2, 3]
    },
    {
      "id": 11,
      "checkIn": "09:00",
      "checkOut": "18:00",
      "name": "Cierre Copero/a",
      "restType": "Horario Libre",
      "breakTime": 60,
      "notes": "",
      "position": 1,
      "locations": [1, 2, 3]
    }
  ],
  "turns": [
    {
      "id": 45,
      "turnTemplateId": 9,
      "userId": [9],
      "permitType": 1,
      "maxSlots": 1,
      "date": "2021-04-23"
    },
    {
      "id": 50,
      "turnTemplateId": 6,
      "userId": [15],
      "permitType": 1,
      "maxSlots": 3,
      "date": "2021-04-19"
    },
    {
      "id": 67,
      "turnTemplateId": 3,
      "userId": [21, 10],
      "permitType": 1,
      "maxSlots": 5,
      "date": "2021-04-29"
    },
    {
      "id": 53,
      "turnTemplateId": 6,
      "userId": [15],
      "permitType": 1,
      "maxSlots": 3,
      "date": "2021-04-23"
    },
    {
      "id": 58,
      "turnTemplateId": 9,
      "userId": [9],
      "permitType": 1,
      "maxSlots": 2,
      "date": "2021-04-29"
    },
    {
      "id": 18,
      "turnTemplateId": 11,
      "userId": [20, 28],
      "permitType": 1,
      "maxSlots": 2,
      "date": "2021-04-23"
    },
    {
      "id": 75,
      "turnTemplateId": null,
      "userId": [],
      "permitType": -1,
      "maxSlots": 2,
      "date": "2021-04-23"
    },
    {
      "id": 36,
      "turnTemplateId": 2,
      "userId": [10],
      "permitType": 1,
      "maxSlots": 2,
      "date": "2021-04-22"
    },
    {
      "id": 65,
      "turnTemplateId": 3,
      "userId": [21],
      "permitType": 1,
      "maxSlots": 5,
      "date": "2021-04-27"
    },
    {
      "id": 19,
      "turnTemplateId": 4,
      "userId": [4],
      "permitType": 1,
      "maxSlots": 1,
      "date": "2021-04-19"
    },
    {
      "id": 27,
      "turnTemplateId": 10,
      "userId": [13],
      "permitType": 1,
      "maxSlots": 1,
      "date": "2021-04-21"
    },
    {
      "id": 31,
      "turnTemplateId": 10,
      "userId": [13],
      "permitType": 1,
      "maxSlots": 1,
      "date": "2021-04-25"
    },
    {
      "id": 72,
      "turnTemplateId": null,
      "userId": [9],
      "permitType": -1,
      "maxSlots": 2,
      "date": "2021-04-20"
    },
    {
      "id": 44,
      "turnTemplateId": 9,
      "userId": [3],
      "permitType": 1,
      "maxSlots": 1,
      "date": "2021-04-22"
    },
    {
      "id": 22,
      "turnTemplateId": 5,
      "userId": [18],
      "permitType": 1,
      "maxSlots": 1,
      "date": "2021-04-19"
    },
    {
      "id": 57,
      "turnTemplateId": 9,
      "userId": [3],
      "permitType": 1,
      "maxSlots": 2,
      "date": "2021-04-28"
    },
    {
      "id": 70,
      "turnTemplateId": 10,
      "userId": [15, 13],
      "permitType": 1,
      "maxSlots": 3,
      "date": "2021-04-27"
    },
    {
      "id": 59,
      "turnTemplateId": 9,
      "userId": [9],
      "permitType": 1,
      "maxSlots": 2,
      "date": "2021-04-30"
    },
    {
      "id": 43,
      "turnTemplateId": 9,
      "userId": [3],
      "permitType": 1,
      "maxSlots": 1,
      "date": "2021-04-21"
    },
    {
      "id": 85,
      "turnTemplateId": 11,
      "userId": [20],
      "permitType": 1,
      "maxSlots": 2,
      "date": "2021-04-27"
    },
    {
      "id": 87,
      "turnTemplateId": 11,
      "userId": [28],
      "permitType": 1,
      "maxSlots": 2,
      "date": "2021-04-29"
    },
    {
      "id": 17,
      "turnTemplateId": 11,
      "userId": [20],
      "permitType": 1,
      "maxSlots": 2,
      "date": "2021-04-22"
    },
    {
      "id": 77,
      "turnTemplateId": null,
      "userId": [26],
      "permitType": -2,
      "maxSlots": 1,
      "date": "2021-04-22"
    },
    {
      "id": 79,
      "turnTemplateId": 5,
      "userId": [18],
      "permitType": 1,
      "maxSlots": 1,
      "date": "2021-04-26"
    },
    {
      "id": 25,
      "turnTemplateId": 5,
      "userId": [18],
      "permitType": 1,
      "maxSlots": 1,
      "date": "2021-04-23"
    },
    {
      "id": 37,
      "turnTemplateId": 2,
      "userId": [21],
      "permitType": 1,
      "maxSlots": 2,
      "date": "2021-04-24"
    },
    {
      "id": 20,
      "turnTemplateId": 4,
      "userId": [],
      "permitType": 1,
      "maxSlots": 1,
      "date": "2021-04-21"
    },
    {
      "id": 66,
      "turnTemplateId": 3,
      "userId": [10],
      "permitType": 1,
      "maxSlots": 5,
      "date": "2021-04-28"
    },
    {
      "id": 46,
      "turnTemplateId": 9,
      "userId": [3],
      "permitType": 1,
      "maxSlots": 1,
      "date": "2021-04-25"
    },
    {
      "id": 26,
      "turnTemplateId": 10,
      "userId": [13],
      "permitType": 1,
      "maxSlots": 1,
      "date": "2021-04-20"
    },
    {
      "id": 42,
      "turnTemplateId": 9,
      "userId": [3],
      "permitType": 1,
      "maxSlots": 1,
      "date": "2021-04-20"
    },
    {
      "id": 41,
      "turnTemplateId": 9,
      "userId": [3],
      "permitType": 1,
      "maxSlots": 1,
      "date": "2021-04-19"
    },
    {
      "id": 39,
      "turnTemplateId": 7,
      "userId": [14],
      "permitType": 1,
      "maxSlots": 1,
      "date": "2021-04-22"
    },
    {
      "id": 29,
      "turnTemplateId": 10,
      "userId": [14],
      "permitType": 1,
      "maxSlots": 1,
      "date": "2021-04-23"
    },
    {
      "id": 21,
      "turnTemplateId": 4,
      "userId": [4],
      "permitType": 1,
      "maxSlots": 1,
      "date": "2021-04-23"
    },
    {
      "id": 64,
      "turnTemplateId": 3,
      "userId": [10, 21],
      "permitType": 1,
      "maxSlots": 5,
      "date": "2021-04-26"
    },
    {
      "id": 24,
      "turnTemplateId": 5,
      "userId": [18],
      "permitType": 1,
      "maxSlots": 1,
      "date": "2021-04-21"
    },
    {
      "id": 33,
      "turnTemplateId": 2,
      "userId": [21, 22],
      "permitType": 1,
      "maxSlots": 2,
      "date": "2021-04-19"
    },
    {
      "id": 35,
      "turnTemplateId": 2,
      "userId": [21, 22],
      "permitType": 1,
      "maxSlots": 2,
      "date": "2021-04-21"
    },
    {
      "id": 23,
      "turnTemplateId": 5,
      "userId": [21],
      "permitType": 1,
      "maxSlots": 1,
      "date": "2021-04-20"
    },
    {
      "id": 14,
      "turnTemplateId": 11,
      "userId": [20, 28],
      "permitType": 1,
      "maxSlots": 2,
      "date": "2021-04-19"
    },
    {
      "id": 81,
      "turnTemplateId": 5,
      "userId": [18],
      "permitType": 1,
      "maxSlots": 1,
      "date": "2021-04-28"
    },
    {
      "id": 51,
      "turnTemplateId": 6,
      "userId": [15],
      "permitType": 1,
      "maxSlots": 3,
      "date": "2021-04-21"
    },
    {
      "id": 73,
      "turnTemplateId": null,
      "userId": [9],
      "permitType": -1,
      "maxSlots": 2,
      "date": "2021-04-21"
    },
    {
      "id": 52,
      "turnTemplateId": 6,
      "userId": [],
      "permitType": 1,
      "maxSlots": 3,
      "date": "2021-04-22"
    },
    {
      "id": 88,
      "turnTemplateId": 11,
      "userId": [20, 28],
      "permitType": 1,
      "maxSlots": 2,
      "date": "2021-04-30"
    },
    {
      "id": 86,
      "turnTemplateId": 11,
      "userId": [20, 28],
      "permitType": 1,
      "maxSlots": 2,
      "date": "2021-04-28"
    },
    {
      "id": 69,
      "turnTemplateId": 8,
      "userId": [],
      "permitType": 1,
      "maxSlots": 2,
      "date": "2021-04-29"
    },
    {
      "id": 84,
      "turnTemplateId": 11,
      "userId": [28],
      "permitType": 1,
      "maxSlots": 2,
      "date": "2021-04-26"
    },
    {
      "id": 78,
      "turnTemplateId": null,
      "userId": [26],
      "permitType": -2,
      "maxSlots": 1,
      "date": "2021-04-23"
    },
    {
      "id": 15,
      "turnTemplateId": 11,
      "userId": [28],
      "permitType": 1,
      "maxSlots": 2,
      "date": "2021-04-20"
    },
    {
      "id": 56,
      "turnTemplateId": 9,
      "userId": [9],
      "permitType": 1,
      "maxSlots": 2,
      "date": "2021-04-27"
    },
    {
      "id": 71,
      "turnTemplateId": null,
      "userId": [9],
      "permitType": -1,
      "maxSlots": 2,
      "date": "2021-04-19"
    },
    {
      "id": 74,
      "turnTemplateId": null,
      "userId": [9],
      "permitType": -1,
      "maxSlots": 2,
      "date": "2021-04-22"
    },
    {
      "id": 54,
      "turnTemplateId": 6,
      "userId": [15],
      "permitType": 1,
      "maxSlots": 3,
      "date": "2021-04-25"
    },
    {
      "id": 34,
      "turnTemplateId": 2,
      "userId": [10],
      "permitType": 1,
      "maxSlots": 2,
      "date": "2021-04-20"
    },
    {
      "id": 40,
      "turnTemplateId": 7,
      "userId": [17],
      "permitType": 1,
      "maxSlots": 1,
      "date": "2021-04-24"
    },
    {
      "id": 30,
      "turnTemplateId": 10,
      "userId": [13],
      "permitType": 1,
      "maxSlots": 1,
      "date": "2021-04-24"
    },
    {
      "id": 83,
      "turnTemplateId": 5,
      "userId": [18],
      "permitType": 1,
      "maxSlots": 1,
      "date": "2021-04-30"
    },
    {
      "id": 16,
      "turnTemplateId": 11,
      "userId": [20, 28],
      "permitType": 1,
      "maxSlots": 2,
      "date": "2021-04-21"
    },
    {
      "id": 76,
      "turnTemplateId": null,
      "userId": [26],
      "permitType": -2,
      "maxSlots": 1,
      "date": "2021-04-21"
    },
    {
      "id": 28,
      "turnTemplateId": 10,
      "userId": [17],
      "permitType": 1,
      "maxSlots": 1,
      "date": "2021-04-22"
    },
    {
      "id": 55,
      "turnTemplateId": 9,
      "userId": [3],
      "permitType": 1,
      "maxSlots": 2,
      "date": "2021-04-26"
    },
    {
      "id": 80,
      "turnTemplateId": 5,
      "userId": [18],
      "permitType": 1,
      "maxSlots": 1,
      "date": "2021-04-27"
    },
    {
      "id": 82,
      "turnTemplateId": 5,
      "userId": [18],
      "permitType": 1,
      "maxSlots": 1,
      "date": "2021-04-29"
    },
    {
      "id": 38,
      "turnTemplateId": 7,
      "userId": [17],
      "permitType": 1,
      "maxSlots": 1,
      "date": "2021-04-19"
    },
    {
      "id": 68,
      "turnTemplateId": 3,
      "userId": [22],
      "permitType": 1,
      "maxSlots": 5,
      "date": "2021-04-30"
    }
  ]
}
