%YAML 1.1
%TAG !u! tag:unity3d.com,2011:
--- !u!114 &11400000
MonoBehaviour:
  m_ObjectHideFlags: 0
  m_CorrespondingSourceObject: {fileID: 0}
  m_PrefabInstance: {fileID: 0}
  m_PrefabAsset: {fileID: 0}
  m_GameObject: {fileID: 0}
  m_Enabled: 1
  m_EditorHideFlags: 0
  m_Script: {fileID: 11500000, guid: 99f3c86fa39b08a438ed987947aa34c7, type: 3}
  m_Name: ArmatureCorrectBones
  m_EditorClassIdentifier: 
  Weight: 1
  _correctPositionsLateUpdate: 1
  _shoulderCorrectionWeightLateUpdate: 0
  _fingerPositionCorrectionWeight: 0
