2021-06-02T16:21:38.228-0300	INFO	instance/beat.go:665	Home path: [/Users/evelyn.correa/troubleshooting-assignment/filebeat-7.13.1-darwin-x86_64] Config path: [/Users/evelyn.correa/troubleshooting-assignment/filebeat-7.13.1-darwin-x86_64] Data path: [/Users/evelyn.correa/troubleshooting-assignment/filebeat-7.13.1-darwin-x86_64/data] Logs path: [/Users/evelyn.correa/troubleshooting-assignment/filebeat-7.13.1-darwin-x86_64/logs]
2021-06-02T16:21:38.229-0300	INFO	instance/beat.go:673	Beat ID: c95d1365-94f5-42c3-8107-4994a53e073f
2021-06-02T16:21:38.259-0300	INFO	[beat]	instance/beat.go:1014	Beat info	{"system_info": {"beat": {"path": {"config": "/Users/evelyn.correa/troubleshooting-assignment/filebeat-7.13.1-darwin-x86_64", "data": "/Users/evelyn.correa/troubleshooting-assignment/filebeat-7.13.1-darwin-x86_64/data", "home": "/Users/evelyn.correa/troubleshooting-assignment/filebeat-7.13.1-darwin-x86_64", "logs": "/Users/evelyn.correa/troubleshooting-assignment/filebeat-7.13.1-darwin-x86_64/logs"}, "type": "filebeat", "uuid": "c95d1365-94f5-42c3-8107-4994a53e073f"}}}
2021-06-02T16:21:38.260-0300	INFO	[beat]	instance/beat.go:1023	Build info	{"system_info": {"build": {"commit": "2d80f6e99f41b65a270d61706fa98d13cfbda18d", "libbeat": "7.13.1", "time": "2021-05-28T17:43:52.000Z", "version": "7.13.1"}}}
2021-06-02T16:21:38.260-0300	INFO	[beat]	instance/beat.go:1026	Go runtime info	{"system_info": {"go": {"os":"darwin","arch":"amd64","max_procs":8,"version":"go1.15.12"}}}
2021-06-02T16:21:38.260-0300	INFO	[beat]	instance/beat.go:1030	Host info	{"system_info": {"host": {"architecture":"x86_64","boot_time":"2021-04-15T15:02:23.411397-03:00","name":"AC-LPT-00720.local","ip":["127.0.0.1/8","::1/128","fe80::1/64","fe80::aede:48ff:fe00:1122/64","fe80::4e2:ed49:dd3f:7456/64","192.168.0.10/24","2804:14d:5c51:9325:142b:af51:9390:b3d/64","2804:14d:5c51:9325:7c34:4d5a:4b29:9c60/64","2804:14d:5c51:9325::1000/64","2804:14d:5c51:9325:2c58:608d:4c12:ec96/64","fe80::84f7:c2ff:fe25:6498/64","fe80::84f7:c2ff:fe25:6498/64","fe80::d518:3df:ded3:b36c/64","fe80::d5a3:57b1:f5a2:2a4e/64"],"kernel_version":"20.3.0","mac":["ac:de:48:00:11:22","36:7d:da:cc:15:78","14:7d:da:cc:15:78","82:ba:31:e9:d4:01","82:ba:31:e9:d4:00","82:ba:31:e9:d4:01","86:f7:c2:25:64:98","86:f7:c2:25:64:98"],"os":{"type":"macos","family":"darwin","platform":"darwin","name":"Mac OS X","version":"10.16","major":10,"minor":16,"patch":0,"build":"20D91"},"timezone":"-03","timezone_offset_sec":-10800,"id":"32306AF1-86D9-500B-B5A5-D035B2FED6D0"}}}
2021-06-02T16:21:38.260-0300	INFO	[beat]	instance/beat.go:1059	Process info	{"system_info": {"process": {"cwd": "/Users/evelyn.correa/troubleshooting-assignment/filebeat-7.13.1-darwin-x86_64", "exe": "./filebeat", "name": "filebeat", "pid": 27945, "ppid": 27827, "start_time": "2021-06-02T16:21:38.109-0300"}}}
2021-06-02T16:21:38.261-0300	INFO	instance/beat.go:309	Setup Beat: filebeat; Version: 7.13.1
2021-06-02T16:21:38.261-0300	INFO	[index-management]	idxmgmt/std.go:184	Set output.elasticsearch.index to 'filebeat-7.13.1' as ILM is enabled.
2021-06-02T16:21:38.261-0300	INFO	eslegclient/connection.go:99	elasticsearch url: http://localhost:9200
2021-06-02T16:21:38.262-0300	INFO	[publisher]	pipeline/module.go:113	Beat name: AC-LPT-00720.local
2021-06-02T16:21:38.263-0300	INFO	eslegclient/connection.go:99	elasticsearch url: http://localhost:9200
2021-06-02T16:21:38.276-0300	INFO	[esclientleg]	eslegclient/connection.go:314	Attempting to connect to Elasticsearch version 7.13.1
2021-06-02T16:21:38.292-0300	INFO	[index-management]	idxmgmt/std.go:261	Auto ILM enable success.
2021-06-02T16:21:38.406-0300	INFO	[index-management.ilm]	ilm/std.go:170	ILM policy filebeat successfully created.
2021-06-02T16:21:38.407-0300	INFO	[index-management]	idxmgmt/std.go:401	Set setup.template.name to '{filebeat-7.13.1 {now/d}-000001}' as ILM is enabled.
2021-06-02T16:21:38.407-0300	INFO	[index-management]	idxmgmt/std.go:406	Set setup.template.pattern to 'filebeat-7.13.1-*' as ILM is enabled.
2021-06-02T16:21:38.407-0300	INFO	[index-management]	idxmgmt/std.go:440	Set settings.index.lifecycle.rollover_alias in template to {filebeat-7.13.1 {now/d}-000001} as ILM is enabled.
2021-06-02T16:21:38.407-0300	INFO	[index-management]	idxmgmt/std.go:444	Set settings.index.lifecycle.name in template to {filebeat {"policy":{"phases":{"hot":{"actions":{"rollover":{"max_age":"30d","max_size":"50gb"}}}}}}} as ILM is enabled.
2021-06-02T16:21:38.410-0300	INFO	template/load.go:228	Existing template will be overwritten, as overwrite is enabled.
2021-06-02T16:21:39.406-0300	INFO	template/load.go:131	Try loading template filebeat-7.13.1 to Elasticsearch
2021-06-02T16:21:39.772-0300	INFO	template/load.go:123	template with name 'filebeat-7.13.1' loaded.
2021-06-02T16:21:39.772-0300	INFO	[index-management]	idxmgmt/std.go:297	Loaded index template.
2021-06-02T16:21:41.130-0300	INFO	[index-management.ilm]	ilm/std.go:135	Index Alias filebeat-7.13.1 successfully created.
2021-06-02T16:21:41.145-0300	INFO	kibana/client.go:119	Kibana url: http://localhost:5601
2021-06-02T16:21:41.231-0300	INFO	[add_cloud_metadata]	add_cloud_metadata/add_cloud_metadata.go:101	add_cloud_metadata: hosting provider type not detected.
2021-06-02T16:21:42.368-0300	INFO	kibana/client.go:119	Kibana url: http://localhost:5601
2021-06-02T16:23:03.457-0300	INFO	instance/beat.go:848	Kibana dashboards successfully loaded.
2021-06-02T16:23:03.476-0300	WARN	[cfgwarn]	instance/beat.go:574	DEPRECATED: Setting up ML using Filebeat is going to be removed. Please use the ML app to setup jobs. Will be removed in version: 8.0.0
2021-06-02T16:23:03.476-0300	INFO	eslegclient/connection.go:99	elasticsearch url: http://localhost:9200
2021-06-02T16:23:03.483-0300	INFO	[esclientleg]	eslegclient/connection.go:314	Attempting to connect to Elasticsearch version 7.13.1
2021-06-02T16:23:03.499-0300	INFO	kibana/client.go:119	Kibana url: http://localhost:5601
2021-06-02T16:23:03.528-0300	WARN	fileset/modules.go:425	X-Pack Machine Learning is not enabled
2021-06-02T16:23:03.546-0300	WARN	fileset/modules.go:425	X-Pack Machine Learning is not enabled
2021-06-02T16:23:03.546-0300	INFO	eslegclient/connection.go:99	elasticsearch url: http://localhost:9200
2021-06-02T16:23:03.549-0300	INFO	[esclientleg]	eslegclient/connection.go:314	Attempting to connect to Elasticsearch version 7.13.1
2021-06-02T16:23:03.551-0300	INFO	eslegclient/connection.go:99	elasticsearch url: http://localhost:9200
2021-06-02T16:23:03.555-0300	INFO	[esclientleg]	eslegclient/connection.go:314	Attempting to connect to Elasticsearch version 7.13.1
2021-06-02T16:23:03.744-0300	INFO	[modules]	fileset/pipelines.go:133	Elasticsearch pipeline loaded.	{"pipeline": "filebeat-7.13.1-mongodb-log-pipeline"}
2021-06-02T16:23:03.744-0300	INFO	cfgfile/reload.go:262	Loading of config files completed.
2021-06-02T16:23:03.744-0300	INFO	[load]	cfgfile/list.go:129	Stopping 1 runners ...
