[2021-06-04T13:17:07,118][INFO ][o.e.n.Node               ] [AC-LPT-00720.local] version[7.13.1], pid[45245], build[default/tar/9a7758028e4ea59bcab41c12004603c5a7dd84a9/2021-05-28T17:40:59.346932922Z], OS[Mac OS X/10.16/x86_64], JVM[AdoptOpenJDK/OpenJDK 64-Bit Server VM/16/16+36]
[2021-06-04T13:17:07,136][INFO ][o.e.n.Node               ] [AC-LPT-00720.local] JVM home [/Users/evelyn.correa/troubleshooting-assignment/elasticsearch-7.13.1/jdk.app/Contents/Home], using bundled JDK [true]
[2021-06-04T13:17:07,137][INFO ][o.e.n.Node               ] [AC-LPT-00720.local] JVM arguments [-Xshare:auto, -Des.networkaddress.cache.ttl=60, -Des.networkaddress.cache.negative.ttl=10, -XX:+AlwaysPreTouch, -Xss1m, -Djava.awt.headless=true, -Dfile.encoding=UTF-8, -Djna.nosys=true, -XX:-OmitStackTraceInFastThrow, -XX:+ShowCodeDetailsInExceptionMessages, -Dio.netty.noUnsafe=true, -Dio.netty.noKeySetOptimization=true, -Dio.netty.recycler.maxCapacityPerThread=0, -Dio.netty.allocator.numDirectArenas=0, -Dlog4j.shutdownHookEnabled=false, -Dlog4j2.disable.jmx=true, -Djava.locale.providers=SPI,COMPAT, --add-opens=java.base/java.io=ALL-UNNAMED, -XX:+UseG1GC, -Djava.io.tmpdir=/var/folders/v1/0pdzvwv91vl5_s76h0svkv9w0000gq/T/elasticsearch-16988062256017726273, -XX:+HeapDumpOnOutOfMemoryError, -XX:HeapDumpPath=data, -XX:ErrorFile=logs/hs_err_pid%p.log, -Xlog:gc*,gc+age=trace,safepoint:file=logs/gc.log:utctime,pid,tags:filecount=32,filesize=64m, -Xms8192m, -Xmx8192m, -XX:MaxDirectMemorySize=4294967296, -XX:InitiatingHeapOccupancyPercent=30, -XX:G1ReservePercent=25, -Des.path.home=/Users/evelyn.correa/troubleshooting-assignment/elasticsearch-7.13.1, -Des.path.conf=/Users/evelyn.correa/troubleshooting-assignment/elasticsearch-7.13.1/config, -Des.distribution.flavor=default, -Des.distribution.type=tar, -Des.bundled_jdk=true]
[2021-06-04T13:17:09,649][INFO ][o.e.p.PluginsService     ] [AC-LPT-00720.local] loaded module [aggs-matrix-stats]
[2021-06-04T13:17:09,650][INFO ][o.e.p.PluginsService     ] [AC-LPT-00720.local] loaded module [analysis-common]
[2021-06-04T13:17:09,650][INFO ][o.e.p.PluginsService     ] [AC-LPT-00720.local] loaded module [constant-keyword]
[2021-06-04T13:17:09,650][INFO ][o.e.p.PluginsService     ] [AC-LPT-00720.local] loaded module [frozen-indices]
[2021-06-04T13:17:09,651][INFO ][o.e.p.PluginsService     ] [AC-LPT-00720.local] loaded module [ingest-common]
[2021-06-04T13:17:09,651][INFO ][o.e.p.PluginsService     ] [AC-LPT-00720.local] loaded module [ingest-geoip]
[2021-06-04T13:17:09,651][INFO ][o.e.p.PluginsService     ] [AC-LPT-00720.local] loaded module [ingest-user-agent]
[2021-06-04T13:17:09,651][INFO ][o.e.p.PluginsService     ] [AC-LPT-00720.local] loaded module [kibana]
[2021-06-04T13:17:09,652][INFO ][o.e.p.PluginsService     ] [AC-LPT-00720.local] loaded module [lang-expression]
[2021-06-04T13:17:09,652][INFO ][o.e.p.PluginsService     ] [AC-LPT-00720.local] loaded module [lang-mustache]
[2021-06-04T13:17:09,652][INFO ][o.e.p.PluginsService     ] [AC-LPT-00720.local] loaded module [lang-painless]
[2021-06-04T13:17:09,652][INFO ][o.e.p.PluginsService     ] [AC-LPT-00720.local] loaded module [mapper-extras]
[2021-06-04T13:17:09,652][INFO ][o.e.p.PluginsService     ] [AC-LPT-00720.local] loaded module [mapper-version]
[2021-06-04T13:17:09,653][INFO ][o.e.p.PluginsService     ] [AC-LPT-00720.local] loaded module [parent-join]
[2021-06-04T13:17:09,653][INFO ][o.e.p.PluginsService     ] [AC-LPT-00720.local] loaded module [percolator]
[2021-06-04T13:17:09,653][INFO ][o.e.p.PluginsService     ] [AC-LPT-00720.local] loaded module [rank-eval]
[2021-06-04T13:17:09,653][INFO ][o.e.p.PluginsService     ] [AC-LPT-00720.local] loaded module [reindex]
[2021-06-04T13:17:09,654][INFO ][o.e.p.PluginsService     ] [AC-LPT-00720.local] loaded module [repositories-metering-api]
[2021-06-04T13:17:09,654][INFO ][o.e.p.PluginsService     ] [AC-LPT-00720.local] loaded module [repository-encrypted]
[2021-06-04T13:17:09,655][INFO ][o.e.p.PluginsService     ] [AC-LPT-00720.local] loaded module [repository-url]
[2021-06-04T13:17:09,655][INFO ][o.e.p.PluginsService     ] [AC-LPT-00720.local] loaded module [runtime-fields-common]
[2021-06-04T13:17:09,655][INFO ][o.e.p.PluginsService     ] [AC-LPT-00720.local] loaded module [search-business-rules]
[2021-06-04T13:17:09,655][INFO ][o.e.p.PluginsService     ] [AC-LPT-00720.local] loaded module [searchable-snapshots]
[2021-06-04T13:17:09,656][INFO ][o.e.p.PluginsService     ] [AC-LPT-00720.local] loaded module [snapshot-repo-test-kit]
[2021-06-04T13:17:09,656][INFO ][o.e.p.PluginsService     ] [AC-LPT-00720.local] loaded module [spatial]
[2021-06-04T13:17:09,656][INFO ][o.e.p.PluginsService     ] [AC-LPT-00720.local] loaded module [transform]
[2021-06-04T13:17:09,656][INFO ][o.e.p.PluginsService     ] [AC-LPT-00720.local] loaded module [transport-netty4]
[2021-06-04T13:17:09,656][INFO ][o.e.p.PluginsService     ] [AC-LPT-00720.local] loaded module [unsigned-long]
[2021-06-04T13:17:09,656][INFO ][o.e.p.PluginsService     ] [AC-LPT-00720.local] loaded module [vectors]
[2021-06-04T13:17:09,657][INFO ][o.e.p.PluginsService     ] [AC-LPT-00720.local] loaded module [wildcard]
[2021-06-04T13:17:09,657][INFO ][o.e.p.PluginsService     ] [AC-LPT-00720.local] loaded module [x-pack-aggregate-metric]
[2021-06-04T13:17:09,657][INFO ][o.e.p.PluginsService     ] [AC-LPT-00720.local] loaded module [x-pack-analytics]
[2021-06-04T13:17:09,657][INFO ][o.e.p.PluginsService     ] [AC-LPT-00720.local] loaded module [x-pack-async]
[2021-06-04T13:17:09,657][INFO ][o.e.p.PluginsService     ] [AC-LPT-00720.local] loaded module [x-pack-async-search]
[2021-06-04T13:17:09,657][INFO ][o.e.p.PluginsService     ] [AC-LPT-00720.local] loaded module [x-pack-autoscaling]
[2021-06-04T13:17:09,658][INFO ][o.e.p.PluginsService     ] [AC-LPT-00720.local] loaded module [x-pack-ccr]
[2021-06-04T13:17:09,658][INFO ][o.e.p.PluginsService     ] [AC-LPT-00720.local] loaded module [x-pack-core]
[2021-06-04T13:17:09,658][INFO ][o.e.p.PluginsService     ] [AC-LPT-00720.local] loaded module [x-pack-data-streams]
[2021-06-04T13:17:09,658][INFO ][o.e.p.PluginsService     ] [AC-LPT-00720.local] loaded module [x-pack-deprecation]
[2021-06-04T13:17:09,659][INFO ][o.e.p.PluginsService     ] [AC-LPT-00720.local] loaded module [x-pack-enrich]
[2021-06-04T13:17:09,659][INFO ][o.e.p.PluginsService     ] [AC-LPT-00720.local] loaded module [x-pack-eql]
[2021-06-04T13:17:09,659][INFO ][o.e.p.PluginsService     ] [AC-LPT-00720.local] loaded module [x-pack-fleet]
[2021-06-04T13:17:09,659][INFO ][o.e.p.PluginsService     ] [AC-LPT-00720.local] loaded module [x-pack-graph]
[2021-06-04T13:17:09,660][INFO ][o.e.p.PluginsService     ] [AC-LPT-00720.local] loaded module [x-pack-identity-provider]
[2021-06-04T13:17:09,660][INFO ][o.e.p.PluginsService     ] [AC-LPT-00720.local] loaded module [x-pack-ilm]
[2021-06-04T13:17:09,660][INFO ][o.e.p.PluginsService     ] [AC-LPT-00720.local] loaded module [x-pack-logstash]
[2021-06-04T13:17:09,660][INFO ][o.e.p.PluginsService     ] [AC-LPT-00720.local] loaded module [x-pack-ml]
[2021-06-04T13:17:09,661][INFO ][o.e.p.PluginsService     ] [AC-LPT-00720.local] loaded module [x-pack-monitoring]
[2021-06-04T13:17:09,661][INFO ][o.e.p.PluginsService     ] [AC-LPT-00720.local] loaded module [x-pack-ql]
[2021-06-04T13:17:09,661][INFO ][o.e.p.PluginsService     ] [AC-LPT-00720.local] loaded module [x-pack-rollup]
[2021-06-04T13:17:09,662][INFO ][o.e.p.PluginsService     ] [AC-LPT-00720.local] loaded module [x-pack-security]
[2021-06-04T13:17:09,662][INFO ][o.e.p.PluginsService     ] [AC-LPT-00720.local] loaded module [x-pack-shutdown]
[2021-06-04T13:17:09,663][INFO ][o.e.p.PluginsService     ] [AC-LPT-00720.local] loaded module [x-pack-sql]
[2021-06-04T13:17:09,663][INFO ][o.e.p.PluginsService     ] [AC-LPT-00720.local] loaded module [x-pack-stack]
[2021-06-04T13:17:09,663][INFO ][o.e.p.PluginsService     ] [AC-LPT-00720.local] loaded module [x-pack-text-structure]
[2021-06-04T13:17:09,664][INFO ][o.e.p.PluginsService     ] [AC-LPT-00720.local] loaded module [x-pack-voting-only-node]
[2021-06-04T13:17:09,664][INFO ][o.e.p.PluginsService     ] [AC-LPT-00720.local] loaded module [x-pack-watcher]
[2021-06-04T13:17:09,664][INFO ][o.e.p.PluginsService     ] [AC-LPT-00720.local] no plugins loaded
[2021-06-04T13:17:09,704][INFO ][o.e.e.NodeEnvironment    ] [AC-LPT-00720.local] using [1] data paths, mounts [[/System/Volumes/Data (/dev/disk1s1)]], net usable_space [147.9gb], net total_space [233.4gb], types [apfs]
[2021-06-04T13:17:09,704][INFO ][o.e.e.NodeEnvironment    ] [AC-LPT-00720.local] heap size [8gb], compressed ordinary object pointers [true]
[2021-06-04T13:17:09,811][INFO ][o.e.n.Node               ] [AC-LPT-00720.local] node name [AC-LPT-00720.local], node ID [mxt95fiLTICs1rHUanILYA], cluster name [elasticsearch], roles [transform, data_frozen, master, remote_cluster_client, data, ml, data_content, data_hot, data_warm, data_cold, ingest]
[2021-06-04T13:17:13,501][INFO ][o.e.x.m.p.l.CppLogMessageHandler] [AC-LPT-00720.local] [controller/45292] [Main.cc@117] controller (64 bit): Version 7.13.1 (Build acaddbdef328f8) Copyright (c) 2021 Elasticsearch BV
[2021-06-04T13:17:14,037][INFO ][o.e.x.s.a.s.FileRolesStore] [AC-LPT-00720.local] parsed [0] roles from file [/Users/evelyn.correa/troubleshooting-assignment/elasticsearch-7.13.1/config/roles.yml]
[2021-06-04T13:17:14,628][INFO ][o.e.i.g.LocalDatabases   ] [AC-LPT-00720.local] initialized default databases [[GeoLite2-Country.mmdb, GeoLite2-City.mmdb, GeoLite2-ASN.mmdb]], config databases [[]] and watching [/Users/evelyn.correa/troubleshooting-assignment/elasticsearch-7.13.1/config/ingest-geoip] for changes
[2021-06-04T13:17:14,629][INFO ][o.e.i.g.DatabaseRegistry ] [AC-LPT-00720.local] initialized database registry, using geoip-databases directory [/var/folders/v1/0pdzvwv91vl5_s76h0svkv9w0000gq/T/elasticsearch-16988062256017726273/geoip-databases/mxt95fiLTICs1rHUanILYA]
[2021-06-04T13:17:15,346][INFO ][o.e.t.NettyAllocator     ] [AC-LPT-00720.local] creating NettyAllocator with the following configs: [name=elasticsearch_configured, chunk_size=1mb, suggested_max_allocation_size=1mb, factors={es.unsafe.use_netty_default_chunk_and_page_size=false, g1gc_enabled=true, g1gc_region_size=4mb}]
[2021-06-04T13:17:15,407][INFO ][o.e.d.DiscoveryModule    ] [AC-LPT-00720.local] using discovery type [zen] and seed hosts providers [settings]
[2021-06-04T13:17:15,829][INFO ][o.e.g.DanglingIndicesState] [AC-LPT-00720.local] gateway.auto_import_dangling_indices is disabled, dangling indices will not be automatically detected or imported and must be managed manually
[2021-06-04T13:17:16,254][INFO ][o.e.n.Node               ] [AC-LPT-00720.local] initialized
[2021-06-04T13:17:16,255][INFO ][o.e.n.Node               ] [AC-LPT-00720.local] starting ...
[2021-06-04T13:17:16,343][INFO ][o.e.x.s.c.f.PersistentCache] [AC-LPT-00720.local] persistent cache index loaded
[2021-06-04T13:17:21,506][INFO ][o.e.t.TransportService   ] [AC-LPT-00720.local] publish_address {127.0.0.1:9300}, bound_addresses {[::1]:9300}, {127.0.0.1:9300}
[2021-06-04T13:17:22,482][WARN ][o.e.b.BootstrapChecks    ] [AC-LPT-00720.local] the default discovery settings are unsuitable for production use; at least one of [discovery.seed_hosts, discovery.seed_providers, cluster.initial_master_nodes] must be configured
[2021-06-04T13:17:22,483][INFO ][o.e.c.c.Coordinator      ] [AC-LPT-00720.local] cluster UUID [3OD_fXdrSyKiIWV3ld1FLw]
[2021-06-04T13:17:22,492][INFO ][o.e.c.c.ClusterBootstrapService] [AC-LPT-00720.local] no discovery configuration found, will perform best-effort cluster bootstrapping after [3s] unless existing master is discovered
[2021-06-04T13:17:22,651][INFO ][o.e.c.s.MasterService    ] [AC-LPT-00720.local] elected-as-master ([1] nodes joined)[{AC-LPT-00720.local}{mxt95fiLTICs1rHUanILYA}{p48g6l9fTL-k9CQSc4VqzA}{127.0.0.1}{127.0.0.1:9300}{cdfhilmrstw} elect leader, _BECOME_MASTER_TASK_, _FINISH_ELECTION_], term: 3, version: 160, delta: master node changed {previous [], current [{AC-LPT-00720.local}{mxt95fiLTICs1rHUanILYA}{p48g6l9fTL-k9CQSc4VqzA}{127.0.0.1}{127.0.0.1:9300}{cdfhilmrstw}]}
[2021-06-04T13:17:22,805][INFO ][o.e.c.s.ClusterApplierService] [AC-LPT-00720.local] master node changed {previous [], current [{AC-LPT-00720.local}{mxt95fiLTICs1rHUanILYA}{p48g6l9fTL-k9CQSc4VqzA}{127.0.0.1}{127.0.0.1:9300}{cdfhilmrstw}]}, term: 3, version: 160, reason: Publication{term=3, version=160}
[2021-06-04T13:17:22,853][INFO ][o.e.h.AbstractHttpServerTransport] [AC-LPT-00720.local] publish_address {127.0.0.1:9200}, bound_addresses {[::1]:9200}, {127.0.0.1:9200}
[2021-06-04T13:17:22,853][INFO ][o.e.n.Node               ] [AC-LPT-00720.local] started
[2021-06-04T13:17:23,421][INFO ][o.e.l.LicenseService     ] [AC-LPT-00720.local] license [999605d5-8274-4b67-a4b8-d198b6a93476] mode [basic] - valid
[2021-06-04T13:17:23,422][INFO ][o.e.x.s.s.SecurityStatusChangeListener] [AC-LPT-00720.local] Active license is now [BASIC]; Security is disabled
[2021-06-04T13:17:23,422][WARN ][o.e.x.s.s.SecurityStatusChangeListener] [AC-LPT-00720.local] Elasticsearch built-in security features are not enabled. Without authentication, your cluster could be accessible to anyone. See https://www.elastic.co/guide/en/elasticsearch/reference/7.13/security-minimal-setup.html to enable security.
[2021-06-04T13:17:23,427][INFO ][o.e.g.GatewayService     ] [AC-LPT-00720.local] recovered [15] indices into cluster_state
[2021-06-04T13:17:28,376][INFO ][o.e.c.r.a.AllocationService] [AC-LPT-00720.local] Cluster health status changed from [RED] to [YELLOW] (reason: [shards started [[filebeat-7.13.1-2021.06.02-000001][0], [.kibana-event-log-7.13.1-000001][0]]]).
[2021-06-04T13:59:27,886][INFO ][o.e.t.LoggingTaskListener] [AC-LPT-00720.local] 2146 finished with response BulkByScrollResponse[took=250.7ms,timed_out=false,sliceId=null,updated=10,created=0,deleted=0,batches=1,versionConflicts=0,noops=0,retries=0,throttledUntil=0s,bulk_failures=[],search_failures=[]]
[2021-06-04T13:59:28,677][INFO ][o.e.t.LoggingTaskListener] [AC-LPT-00720.local] 2153 finished with response BulkByScrollResponse[took=993.4ms,timed_out=false,sliceId=null,updated=676,created=0,deleted=0,batches=1,versionConflicts=0,noops=0,retries=0,throttledUntil=0s,bulk_failures=[],search_failures=[]]
[2021-06-04T14:52:30,111][INFO ][o.e.x.m.p.NativeController] [AC-LPT-00720.local] Native controller process has stopped - no new native processes can be started
[2021-06-04T14:52:30,112][INFO ][o.e.n.Node               ] [AC-LPT-00720.local] stopping ...
[2021-06-04T14:52:30,127][INFO ][o.e.x.w.WatcherService   ] [AC-LPT-00720.local] stopping watch service, reason [shutdown initiated]
[2021-06-04T14:52:30,128][INFO ][o.e.x.w.WatcherLifeCycleService] [AC-LPT-00720.local] watcher has stopped and shutdown
[2021-06-04T14:52:31,675][INFO ][o.e.n.Node               ] [AC-LPT-00720.local] stopped
[2021-06-04T14:52:31,676][INFO ][o.e.n.Node               ] [AC-LPT-00720.local] closing ...
[2021-06-04T14:52:31,696][INFO ][o.e.n.Node               ] [AC-LPT-00720.local] closed
