2021-06-02T17:41:17.196-0300	INFO	instance/beat.go:665	Home path: [/Users/evelyn.correa/troubleshooting-assignment/filebeat-7.13.1-darwin-x86_64] Config path: [/Users/evelyn.correa/troubleshooting-assignment/filebeat-7.13.1-darwin-x86_64] Data path: [/Users/evelyn.correa/troubleshooting-assignment/filebeat-7.13.1-darwin-x86_64/data] Logs path: [/Users/evelyn.correa/troubleshooting-assignment/filebeat-7.13.1-darwin-x86_64/logs]
2021-06-02T17:41:17.293-0300	INFO	instance/beat.go:673	Beat ID: c95d1365-94f5-42c3-8107-4994a53e073f
2021-06-02T17:41:17.298-0300	INFO	[add_cloud_metadata]	add_cloud_metadata/add_cloud_metadata.go:101	add_cloud_metadata: hosting provider type not detected.
