2021-06-02T17:36:18.358-0300	INFO	instance/beat.go:665	Home path: [/Users/evelyn.correa/troubleshooting-assignment/filebeat-7.13.1-darwin-x86_64] Config path: [/Users/evelyn.correa/troubleshooting-assignment/filebeat-7.13.1-darwin-x86_64] Data path: [/Users/evelyn.correa/troubleshooting-assignment/filebeat-7.13.1-darwin-x86_64/data] Logs path: [/Users/evelyn.correa/troubleshooting-assignment/filebeat-7.13.1-darwin-x86_64/logs]
2021-06-02T17:36:18.358-0300	INFO	instance/beat.go:673	Beat ID: c95d1365-94f5-42c3-8107-4994a53e073f
2021-06-02T17:36:18.360-0300	INFO	[beat]	instance/beat.go:1014	Beat info	{"system_info": {"beat": {"path": {"config": "/Users/evelyn.correa/troubleshooting-assignment/filebeat-7.13.1-darwin-x86_64", "data": "/Users/evelyn.correa/troubleshooting-assignment/filebeat-7.13.1-darwin-x86_64/data", "home": "/Users/evelyn.correa/troubleshooting-assignment/filebeat-7.13.1-darwin-x86_64", "logs": "/Users/evelyn.correa/troubleshooting-assignment/filebeat-7.13.1-darwin-x86_64/logs"}, "type": "filebeat", "uuid": "c95d1365-94f5-42c3-8107-4994a53e073f"}}}
2021-06-02T17:36:18.360-0300	INFO	[beat]	instance/beat.go:1023	Build info	{"system_info": {"build": {"commit": "2d80f6e99f41b65a270d61706fa98d13cfbda18d", "libbeat": "7.13.1", "time": "2021-05-28T17:43:52.000Z", "version": "7.13.1"}}}
2021-06-02T17:36:18.360-0300	INFO	[beat]	instance/beat.go:1026	Go runtime info	{"system_info": {"go": {"os":"darwin","arch":"amd64","max_procs":8,"version":"go1.15.12"}}}
2021-06-02T17:36:18.361-0300	INFO	[beat]	instance/beat.go:1030	Host info	{"system_info": {"host": {"architecture":"x86_64","boot_time":"2021-04-15T15:02:23.411397-03:00","name":"AC-LPT-00720.local","ip":["127.0.0.1/8","::1/128","fe80::1/64","fe80::aede:48ff:fe00:1122/64","fe80::4e2:ed49:dd3f:7456/64","192.168.0.10/24","2804:14d:5c51:9325:142b:af51:9390:b3d/64","2804:14d:5c51:9325:7c34:4d5a:4b29:9c60/64","2804:14d:5c51:9325::1000/64","2804:14d:5c51:9325:2c58:608d:4c12:ec96/64","fe80::84f7:c2ff:fe25:6498/64","fe80::84f7:c2ff:fe25:6498/64","fe80::d518:3df:ded3:b36c/64","fe80::d5a3:57b1:f5a2:2a4e/64"],"kernel_version":"20.3.0","mac":["ac:de:48:00:11:22","36:7d:da:cc:15:78","14:7d:da:cc:15:78","82:ba:31:e9:d4:01","82:ba:31:e9:d4:00","82:ba:31:e9:d4:01","86:f7:c2:25:64:98","86:f7:c2:25:64:98"],"os":{"type":"macos","family":"darwin","platform":"darwin","name":"Mac OS X","version":"10.16","major":10,"minor":16,"patch":0,"build":"20D91"},"timezone":"-03","timezone_offset_sec":-10800,"id":"32306AF1-86D9-500B-B5A5-D035B2FED6D0"}}}
2021-06-02T17:36:18.361-0300	INFO	[beat]	instance/beat.go:1059	Process info	{"system_info": {"process": {"cwd": "/Users/evelyn.correa/troubleshooting-assignment/filebeat-7.13.1-darwin-x86_64", "exe": "./filebeat", "name": "filebeat", "pid": 29376, "ppid": 29260, "start_time": "2021-06-02T17:36:18.265-0300"}}}
2021-06-02T17:36:18.361-0300	INFO	instance/beat.go:309	Setup Beat: filebeat; Version: 7.13.1
2021-06-02T17:36:18.362-0300	INFO	[index-management]	idxmgmt/std.go:184	Set output.elasticsearch.index to 'filebeat-7.13.1' as ILM is enabled.
2021-06-02T17:36:18.363-0300	INFO	eslegclient/connection.go:99	elasticsearch url: http://localhost:9200
2021-06-02T17:36:18.363-0300	INFO	[publisher]	pipeline/module.go:113	Beat name: AC-LPT-00720.local
2021-06-02T17:36:18.367-0300	INFO	eslegclient/connection.go:99	elasticsearch url: http://localhost:9200
2021-06-02T17:36:18.369-0300	ERROR	[esclientleg]	eslegclient/connection.go:261	error connecting to Elasticsearch at http://localhost:9200: Get "http://localhost:9200": dial tcp 127.0.0.1:9200: connect: connection refused
2021-06-02T17:36:18.370-0300	ERROR	instance/beat.go:989	Exiting: couldn't connect to any of the configured Elasticsearch hosts. Errors: [error connecting to Elasticsearch at http://localhost:9200: Get "http://localhost:9200": dial tcp 127.0.0.1:9200: connect: connection refused]
