<svg width="333" height="333" viewBox="0 0 333 333" fill="none" xmlns="http://www.w3.org/2000/svg">
<ellipse cx="166.5" cy="279" rx="140.5" ry="25" fill="#494949"/>
<path d="M205.493 171.552C205.626 169.697 212.973 153.973 213.282 138.602C213.561 124.894 210.926 113.189 206.789 100.071C205.155 94.8738 205.199 89.5145 210.322 88.6311C214.842 87.8655 217.522 92.8714 218.597 96.4786C220.069 101.44 222.233 108.817 223.132 113.926C225.546 127.574 224.574 139.205 220.526 149.35C217.61 156.638 209.233 172.185 208.688 172.863C208.644 172.922 206.038 171.744 205.493 171.552Z" fill="#FFA631"/>
<path d="M205.42 171.067C205.42 171.067 202.357 174.203 200.061 176.426C199.442 177.795 198.515 182.389 199.545 182.58C201.71 182.978 201.386 178.811 201.386 178.811C201.386 178.811 201.415 179.709 200.326 182.86C199.118 186.379 202.269 188.72 205.538 189C208.6 189.265 205.39 186.173 206.009 184.141C207.599 178.885 208.791 172.893 208.791 172.893L205.42 171.067Z" fill="#FCC490"/>
<path d="M205.125 76.1752C207.437 77.0439 211.147 77.4414 212.561 77.3236C212.914 77.2942 213.238 77.5445 213.311 77.8979C213.856 80.2241 215.432 86.6582 215.711 87.6741C216.742 91.4432 222.911 91.296 222.617 86.1576C222.455 83.4043 222.175 79.2966 222.219 77.942C223.367 77.7506 226.577 78.4279 227.711 78.0745C231.023 77.0439 232.82 74.4673 233.644 71.2577C234.896 66.399 236.191 61.5256 236.986 56.5786C238.017 50.1887 235.853 44.8589 230.832 40.7217C227.019 37.5856 222.749 35.598 217.964 34.641C214.401 33.9196 211.368 35.0238 208.644 37.247C202.446 42.2971 194.363 52.5444 195.526 63.3219C196.365 70.9927 201.827 74.9385 205.125 76.1752Z" fill="#FCC490"/>
<path d="M207.584 91.9295C207.996 87.8511 223.647 85.0979 229.654 86.0107C235.852 86.953 237.781 92.0473 240.093 97.4949C243.729 106.049 250.708 133.832 250.369 153.723C250.369 153.723 227.342 151.367 221.806 151.632C218.729 138.749 204.816 119.521 207.584 91.9295Z" fill="#FFA631"/>
<path d="M208.894 59.8179C208.806 60.3479 209.159 60.8632 209.675 60.9515C210.205 61.0399 210.705 60.6865 210.794 60.1565C210.882 59.6265 210.529 59.1111 210.013 59.0228C209.483 58.9345 208.983 59.2878 208.894 59.8179Z" fill="#000200"/>
<path d="M198.411 57.8892C198.323 58.4339 198.676 58.964 199.221 59.067C199.766 59.1701 200.281 58.802 200.37 58.2425C200.458 57.6978 200.105 57.1677 199.56 57.0647C199.015 56.9616 198.5 57.3297 198.411 57.8892Z" fill="#000200"/>
<path d="M200.016 66.7671C202.622 67.8713 206.023 68.5633 208.158 67.8861C208.07 68.4014 207.79 69.3142 207.378 69.7854C206.553 70.7276 205.729 71.1104 203.756 70.7865C202.46 70.5804 201.43 70.3154 200.649 69.0639C200.281 68.4455 200.046 67.5327 200.016 66.7671Z" fill="#ED6129"/>
<path d="M202.401 66.7084C203.594 67.0471 204.742 67.2679 205.861 67.2826C206.627 67.2974 207.701 67.9452 207.701 68.2396C207.569 68.4605 207.436 68.6666 207.304 68.8138C206.524 69.712 205.729 70.0506 203.815 69.7414C202.563 69.5353 201.562 69.285 200.811 68.1071C200.634 67.8274 200.472 67.4593 200.369 67.0912C200.266 66.6937 201.635 66.4876 202.401 66.7084Z" fill="#C04D34"/>
<path d="M207.054 67.9894C206.362 69.1084 205.081 68.9317 203.491 68.6814C202.092 68.4605 201.15 68.2986 200.708 67.0029C202.534 67.5182 205.537 68.1366 207.054 67.9894Z" fill="#FBF8DE"/>
<path d="M199.942 66.7379C200.973 65.6925 201.547 66.3992 203.535 66.6495C205.272 66.8704 206.17 66.7968 208.173 67.9305C206.906 68.2249 205.199 67.9894 203.667 67.7391C202.121 67.474 200.796 67.0765 199.942 66.7379Z" fill="#ED6129"/>
<path d="M201.665 64.8973L204.109 65.339C204.875 65.4715 205.508 64.7648 205.361 63.9992C205.361 63.9992 205.022 64.4409 204.301 64.5587C203.314 64.7059 202.622 64.4114 201.915 64.2348C201.15 64.0434 201.003 63.1011 201.003 63.1011C200.635 63.7489 200.708 64.7206 201.665 64.8973Z" fill="#DDA078"/>
<path d="M209.94 59.7293C209.91 59.9354 210.043 60.1415 210.249 60.171C210.455 60.2004 210.646 60.0679 210.691 59.8618C210.72 59.6557 210.587 59.4495 210.381 59.4201C210.175 59.3907 209.969 59.5232 209.94 59.7293Z" fill="white"/>
<path d="M199.471 57.8452C199.427 58.0661 199.574 58.2575 199.78 58.3017C199.987 58.3458 200.193 58.1986 200.222 57.9777C200.266 57.7569 200.119 57.5655 199.913 57.5213C199.707 57.4919 199.515 57.6391 199.471 57.8452Z" fill="white"/>
<g opacity="0.6">
<path opacity="0.6" d="M209.233 65.4126C208.939 67.1352 210.072 68.7695 211.751 69.064C213.444 69.3584 215.049 68.21 215.343 66.5021C215.638 64.7795 214.504 63.1452 212.826 62.8507C211.132 62.5563 209.528 63.7047 209.233 65.4126Z" fill="#F27034"/>
</g>
<g opacity="0.6">
<path opacity="0.6" d="M195.997 65.9132C197.292 65.7218 198.367 64.7059 198.603 63.3367C198.897 61.614 197.764 59.9798 196.085 59.6853C195.879 59.6558 195.673 59.6264 195.481 59.6411C195.172 62.0116 195.702 64.9562 195.997 65.9132Z" fill="#F27034"/>
</g>
<path d="M208.909 269.521L202.799 269.05C202.799 269.05 197.837 242.901 202.033 219.477C207.717 187.881 222.499 151.617 222.499 151.617L243.111 157.58C243.111 157.58 229.374 190.855 222.219 213.499C215.049 236.143 208.909 269.521 208.909 269.521Z" fill="#37499B"/>
<path d="M208.909 269.521L202.799 269.05C202.799 269.05 197.837 242.901 202.033 219.477C207.717 187.881 222.499 151.617 222.499 151.617L243.111 157.58C243.111 157.58 229.374 190.855 222.219 213.499C215.049 236.143 208.909 269.521 208.909 269.521Z" fill="#AA6B18"/>
<path d="M250.384 153.016C250.384 158.596 251.739 155.813 250.384 171.847C249.03 187.895 234.071 200.454 250.384 224.173C264.003 243.961 278.947 261.85 278.947 261.85L274.869 265.339C274.869 265.339 233.291 236.29 225.914 215.104C215.711 185.804 222.175 151.264 222.175 151.264L250.384 153.016Z" fill="#915A17"/>
<path d="M254.64 87.6155C254.64 87.6155 252.092 87.6155 251.076 100.866C250.061 114.117 251.93 124.586 251.93 124.586C251.93 124.586 247.675 112.895 248.191 99.1144C248.397 93.6815 249.383 88.4695 251.754 86.7321C254.124 84.9948 254.64 87.6155 254.64 87.6155Z" fill="#010001"/>
<path d="M233.305 76.2932C223.721 78.9729 220.717 84.7297 222.499 85.775C224.53 86.9676 230.817 77.4711 237.075 77.6625C244.51 77.8833 246.35 81.5642 249.678 85.8928C255.596 93.5783 257.717 91.0606 251.268 83.1543C248.191 79.3704 242.331 73.7756 233.305 76.2932Z" fill="#010001"/>
<path d="M225.723 85.3331C237.928 87.0998 240.52 98.952 245.246 114.573C250.531 132.006 248.308 133.581 249.633 142.577C251.061 152.294 250.163 161.231 251.4 163.145C254.359 167.768 261.368 166.326 265.255 165.545C269.451 164.706 273.352 165.472 274.751 161.967C275.929 159.023 276.003 154.591 274.869 147.333C272.366 131.431 267.758 103.045 260.897 85.4214C269.156 90.0445 263.885 80.7394 257.172 76.2635C249.309 71.0073 238.502 76.4549 231.038 79.1198C225.472 81.0928 225.134 85.2447 225.723 85.3331Z" fill="#FF9004"/>
<path d="M242.787 102.147C242.787 102.147 249.781 101.338 254.639 100.057C260.323 98.5549 265.299 96.4936 265.299 96.4936C265.299 96.4936 266.286 96.0225 266.079 94.8593C265.947 94.1526 265.284 93.7404 264.99 93.8876C258.335 97.2739 242.272 99.7916 242.272 99.7916L242.787 102.147Z" fill="#37474F"/>
<path d="M243.833 107.389C243.833 107.389 250.797 106.432 255.685 105.298C263.989 103.369 267.316 101.588 266.345 101.735C266.345 101.735 267.331 101.264 267.125 100.101C266.992 99.3938 266.33 98.9816 266.035 99.1288C259.38 102.515 243.317 105.033 243.317 105.033L243.833 107.389Z" fill="#37474F"/>
<path d="M245.187 73.1277C235.455 75.2184 231.347 81.8586 230.67 86.04C230.552 86.7467 232.922 86.7026 233.055 86.3934C235.44 80.8133 242.728 75.4246 248.971 74.9976C254.345 74.6442 259.041 77.8686 261.574 82.742C265.49 90.295 268.656 88.5724 263.164 80.0035C260.514 75.8663 255.537 70.8898 245.187 73.1277Z" fill="#37474F"/>
<path d="M250.355 150.233C250.355 150.233 258.349 149.218 263.532 147.848C269.613 146.258 274.928 144.123 274.928 144.123C274.928 144.123 275.988 143.637 275.782 142.474C275.649 141.768 274.957 141.37 274.633 141.517C267.493 145.021 250.222 147.834 250.222 147.834L250.355 150.233Z" fill="#37474F"/>
<path d="M250.031 145.478C250.031 145.478 257.496 144.55 262.678 143.195C268.759 141.605 274.074 139.47 274.074 139.47C274.074 139.47 275.134 138.985 274.928 137.821C274.795 137.115 274.103 136.717 273.779 136.864C266.639 140.369 249.722 143.107 249.722 143.107L250.031 145.478Z" fill="#37474F"/>
<path d="M229.978 85.6866C229.978 85.6866 226.312 85.6866 224.678 91.4139C223.043 97.1265 234.969 109.45 234.969 109.45C234.969 109.45 220.452 104.532 220.452 90.5747C220.452 86.0694 224.972 83.4486 227.711 83.7137C229.566 83.8903 229.978 85.6866 229.978 85.6866Z" fill="#37474F"/>
<path d="M211.78 89.2641C211.78 89.2641 208.555 91.9732 208.217 99.644C207.863 107.668 208.894 112.895 208.894 112.895C208.894 112.895 205.154 108.36 204.816 98.5986C204.624 93.1658 206.582 90.5303 208.835 88.6163C211.088 86.7023 211.78 89.2641 211.78 89.2641Z" fill="#010001"/>
<path d="M196.453 47.0676C201.282 35.2301 216.108 27.7065 229.816 37.3502C248.691 50.6306 238.075 66.1047 239.18 66.885C242.919 69.491 240.681 74.9239 237.545 78.1778C237.045 78.6931 233.408 77.2502 233.408 77.2502C233.408 77.2502 235.19 79.9151 234.836 80.0623C234.483 80.2243 234.1 80.3568 233.717 80.4746C232.009 80.9899 229.992 81.3874 228.093 80.6807C226.68 80.1507 225.252 77.795 225.252 77.795C225.252 77.795 225.973 80.1212 225.531 79.9445C224.692 79.6206 223.838 79.2084 223.014 78.7225C217.272 75.3214 222.086 67.7537 222.852 61.7908C223.367 57.7566 218.788 54.2967 217.478 55.504C216.403 56.5052 215.034 57.0205 213.502 57.1677C213.12 57.2119 210.955 55.342 210.558 55.3273C210.219 55.3273 212.31 57.256 211.956 57.2266C211.058 57.1383 210.307 57.4769 208.511 56.6229C206.038 55.4598 203.446 53.1188 202.372 51.9998C201.93 51.5287 203.947 54.8414 203.387 54.5322C199.029 52.1765 195.717 48.8785 196.453 47.0676Z" fill="#473028"/>
<path d="M254.477 171.891C253.903 169.977 255.331 151.19 249.81 135.628C244.892 121.759 236.75 111.482 227.607 99.983C223.985 95.4188 223.073 89.5737 227.887 86.629C232.142 84.023 236.736 87.9688 239.18 91.1638C242.537 95.5513 247.513 102.088 250.355 106.859C257.952 119.594 261.382 131.667 261.162 143.505C261 152.015 258.467 171.023 258.173 171.935C258.158 171.994 255.096 171.862 254.477 171.891Z" fill="#FFA631"/>
<path d="M254.301 171.169C254.301 171.169 252.49 175.822 252.225 180.519C252.151 181.829 252.269 183.404 252.357 184.553C252.402 185.083 253.329 184.523 253.727 183.508C254.257 182.153 254.286 180.136 254.286 180.136C254.286 180.136 254.801 180.901 255.493 184.17C256.274 187.821 253.609 193.137 257.231 190.398C261.353 187.277 262.045 184.391 261.515 182.315C260.146 176.956 258.099 171.611 258.099 171.611L254.301 171.169Z" fill="#FCC490"/>
<path d="M238.93 153.163C238.93 153.163 226.621 191.193 232.628 209.318C238.635 227.442 276.592 263.44 276.592 263.44L277.387 262.63C277.387 262.63 237.295 223.967 233.762 208.302C230.846 195.375 232.599 186.968 234.586 174.968C236.25 164.956 240.004 153.369 240.004 153.369L238.93 153.163Z" fill="white"/>
<path d="M208.688 269.727L208.084 279.68C208.084 279.68 185.867 278.679 185.661 276.176C185.632 275.808 185.514 275.131 185.882 274.674C189.327 272.333 201.96 271.685 201.96 271.685L203.874 269.521L208.688 269.727Z" fill="#FFB42E"/>
<path d="M203.491 268.932L208.894 269.521L208.143 278.591C208.143 278.591 185.926 277.589 185.72 275.086C185.543 272.907 202.018 270.596 202.018 270.596L203.491 268.932Z" fill="#37474F"/>
<path d="M198.529 274.763L197.778 274.925L197.057 271.376L197.778 271.273L198.529 274.763Z" fill="white"/>
<path d="M200.016 274.527L199.28 274.689L198.544 271.14L199.295 270.979L200.016 274.527Z" fill="white"/>
<path d="M201.548 274.291L200.811 274.453L200.075 270.905L200.826 270.743L201.548 274.291Z" fill="white"/>
<path d="M275.561 265.738L278.947 263.102L286 269.963C286 269.963 270.997 286.792 268.994 285.349C268.7 285.143 268.126 284.789 268.008 284.215C268.464 280.004 276.091 269.654 276.091 269.654L275.561 265.738Z" fill="#FFB42E"/>
<path d="M274.781 264.987L278.167 262.351L285.219 269.212C285.219 269.212 270.217 286.041 268.214 284.598C266.477 283.346 275.311 268.888 275.311 268.888L274.781 264.987Z" fill="#37474F"/>
<path d="M276.179 274.321L275.826 275.013L272.705 273.305L273.102 272.672L276.179 274.321Z" fill="white"/>
<path d="M276.96 272.996L276.607 273.673L273.485 271.98L273.839 271.288L276.96 272.996Z" fill="white"/>
<path d="M277.77 271.641L277.416 272.333L274.295 270.626L274.648 269.934L277.77 271.641Z" fill="white"/>
<path d="M236.726 126.809L217.066 124.205L215.514 135.925L235.173 138.529L236.726 126.809Z" fill="#2D1C1F"/>
<path d="M226.813 126.204C223.956 125.822 221.336 127.839 220.953 130.695C220.57 133.551 222.587 136.172 225.443 136.555C228.3 136.938 230.92 134.92 231.303 132.064C231.671 129.208 229.669 126.587 226.813 126.204ZM225.65 135.024C223.633 134.759 222.219 132.918 222.499 130.901C222.764 128.884 224.604 127.471 226.621 127.75C228.638 128.015 230.052 129.856 229.772 131.873C229.507 133.875 227.652 135.289 225.65 135.024Z" fill="#8B7B6C"/>
<path d="M225.885 129.856C225.841 130.194 225.502 130.415 225.119 130.371C224.736 130.327 224.471 130.003 224.516 129.679C224.56 129.34 224.898 129.12 225.281 129.164C225.664 129.208 225.929 129.517 225.885 129.856Z" fill="white"/>
<path d="M221.333 123.182L219.085 122.885L218.88 124.432L221.128 124.73L221.333 123.182Z" fill="#8B7B6C"/>
<path d="M214.813 87.5273C214.636 87.5862 214.357 86.32 213.532 87.9101C211.088 92.6068 217.007 124.777 217.007 124.777L218.258 124.762C212.722 90.5456 214.813 87.5273 214.813 87.5273Z" fill="#2D1C1F"/>
<path d="M240.181 115.428C237.222 122.392 234.13 129.709 233.718 130.107L235.087 130.917L241.094 116.635C240.8 116.223 240.49 115.825 240.181 115.428Z" fill="#2D1C1F"/>
<path d="M121.209 152.931H84.7987C80.3375 152.931 77.5107 149.25 76.7304 144.863C74.6838 133.54 76.7304 94.2588 76.7304 94.2588C76.7304 89.7976 80.3375 86.1904 84.7987 86.1904H121.209C125.67 86.1904 129.278 89.7976 129.278 94.2588C129.278 94.2588 131.251 131.7 129.278 144.863C128.63 149.279 125.67 152.931 121.209 152.931Z" fill="#FF9004"/>
<path d="M92.4989 69.3027H113.848C116.351 69.3175 120.591 72.5566 121.194 74.9565L125.008 90.0625C125.862 93.4783 123.256 96.7763 119.707 96.7763H85.314C81.6626 96.7763 79.0272 93.2869 80.0872 89.8122L85.1079 73.6461C85.7851 71.364 90.0843 69.3027 92.4989 69.3027Z" fill="#FF9004"/>
<path d="M137.656 146.632L77.1729 146.984L77.3073 170.099L137.79 169.748L137.656 146.632Z" fill="#EF6129"/>
<path d="M149.095 158.113C149.139 164.488 144.06 169.701 137.773 169.73C131.486 169.759 126.348 164.621 126.318 158.246C126.274 151.871 131.354 146.659 137.64 146.629C143.927 146.585 149.051 151.738 149.095 158.113Z" fill="#EF6129"/>
<path d="M86.8011 158.481C86.8452 164.857 81.7657 170.069 75.4789 170.098C69.1921 170.128 64.0537 164.989 64.0242 158.614C63.98 152.239 69.0596 147.027 75.3464 146.997C81.6332 146.953 86.7569 152.092 86.8011 158.481Z" fill="#EF6129"/>
<g opacity="0.4">
<path opacity="0.4" d="M146.931 158.128C146.96 163.222 142.852 167.374 137.758 167.403C132.664 167.433 128.512 163.325 128.483 158.231C128.453 153.137 132.561 148.985 137.655 148.955C142.749 148.926 146.901 153.034 146.931 158.128Z" fill="#000306"/>
</g>
<path d="M144.693 158.143C144.722 162 141.601 165.151 137.744 165.181C133.886 165.21 130.735 162.089 130.706 158.231C130.676 154.374 133.798 151.223 137.655 151.194C141.527 151.164 144.678 154.271 144.693 158.143Z" fill="#EF6129"/>
<g opacity="0.4">
<path opacity="0.4" d="M141.498 158.158C141.512 160.263 139.819 161.971 137.714 161.986C135.608 162 133.901 160.307 133.886 158.202C133.871 156.096 135.564 154.388 137.67 154.374C139.775 154.359 141.498 156.052 141.498 158.158Z" fill="#000306"/>
</g>
<path d="M97.6524 75.4718C97.6524 75.4718 100.288 68.4635 94.693 65.8133C91.0269 64.076 88.0676 60.9988 86.1977 57.7008C83.8862 59.0553 83.6506 54.0789 83.2383 51.149C83.0911 50.1478 83.0322 49.1761 83.0322 48.2338C83.0322 47.851 83.0469 47.4682 83.0617 47.0854C83.7242 36.5435 93.1471 29.5647 103.836 30.0211C115.688 30.5364 121.121 38.2661 121.475 47.5271C121.666 52.5477 121.151 57.8775 119.031 57.3033C116.999 60.1596 114.201 63.8698 110.152 66.1814C106.928 68.0218 107.635 72.4093 107.841 75.0742C107.9 75.8546 108.459 76.4877 109.225 76.6643C109.225 76.6643 115.423 78.5195 115.173 80.0801C114.407 85.1008 112.464 88.5754 103.321 88.8552C93.0882 89.1644 92.19 83.1278 91.3214 80.3599C90.9975 79.344 91.6011 78.2839 92.6318 78.0483C92.617 78.063 97.6524 76.311 97.6524 75.4718Z" fill="#FCC490"/>
<path d="M97.225 58.1274C96.6655 58.628 99.1537 61.234 102.305 61.3077C105.868 61.396 107.767 58.6133 107.34 58.1863C107.016 57.8771 105.544 58.4513 102.614 58.5544C99.3893 58.6575 97.6961 57.7005 97.225 58.1274Z" fill="#CD3045"/>
<path d="M98.8003 58.2012C99.3303 58.7755 100.538 59.5852 102.172 59.7325C104.41 59.9239 105.661 58.9227 106.088 58.1865C103.497 58.5399 101.097 58.5252 98.8003 58.2012Z" fill="#F3E6CF"/>
<path d="M96.651 50.9282C96.651 51.6202 96.0915 52.1797 95.3848 52.1797C94.6781 52.1797 94.1333 51.6202 94.1333 50.9282C94.1333 50.2362 94.6928 49.6768 95.3848 49.6768C96.0768 49.6768 96.651 50.2362 96.651 50.9282Z" fill="black"/>
<path d="M110.535 50.8401C110.535 51.5615 109.961 52.1357 109.239 52.1357C108.518 52.1357 107.944 51.5615 107.944 50.8401C107.944 50.1186 108.518 49.5444 109.239 49.5444C109.961 49.5444 110.535 50.1334 110.535 50.8401Z" fill="black"/>
<path d="M94.8252 51.0752C95.0935 51.0752 95.3111 50.8577 95.3111 50.5894C95.3111 50.321 95.0935 50.1035 94.8252 50.1035C94.5569 50.1035 94.3394 50.321 94.3394 50.5894C94.3394 50.8577 94.5569 51.0752 94.8252 51.0752Z" fill="white"/>
<path d="M109.166 50.5602C109.166 50.8399 108.945 51.0608 108.665 51.0608C108.385 51.0608 108.165 50.8399 108.165 50.5602C108.165 50.2804 108.385 50.0596 108.665 50.0596C108.945 50.0596 109.166 50.2804 109.166 50.5602Z" fill="white"/>
<path d="M101.083 56.6555L103.6 56.3757C104.381 56.2874 104.808 55.4482 104.454 54.7415C104.454 54.7415 104.234 55.2715 103.571 55.566C102.658 55.9782 101.333 56.1549 100.803 55.669C100.332 55.2568 101.127 52.8716 101.863 50.9429C101.377 50.9429 100.656 52.3857 100.523 52.9305L99.8901 55.2568C99.684 56.0371 100.302 56.7438 101.083 56.6555Z" fill="#DDA078"/>
<path d="M97.7702 43.0218C102.202 39.9741 106.928 36.7644 109.549 38.5165C112.052 40.1802 118.442 53.2692 118.442 53.2692C118.442 53.2692 119.207 49.0142 121.342 49.7945C122.461 46.3198 122.005 40.0624 116.13 34.5412C112.096 30.7426 105.78 29.7562 102.025 30.0948C98.2855 30.4334 91.822 30.934 87.7289 35.6896C85.2996 38.5165 82.5758 42.2562 82.9586 49.2056C85.0787 48.6314 86.5658 50.3687 86.3744 53.2545C86.3744 53.2692 91.6011 47.2768 97.7702 43.0218Z" fill="#473028"/>
<path d="M103.144 271.895H98.7271L97.77 264.857H102.761L103.144 271.895Z" fill="#FCC490"/>
<path d="M128.129 271.379L123.815 271.438L123.167 263.944H128.586L128.129 271.379Z" fill="#FCC490"/>
<path d="M85.0048 147.189C84.6661 148.204 81.5007 160.925 80.8234 177.253C80.1461 193.596 92.6314 251.002 97.0484 265.976C102.835 266.314 103.232 266.358 103.232 266.358L105.161 179.05L125.494 146.497L108.474 139.002L85.0048 147.189Z" fill="#915A17"/>
<path d="M105.603 184.556C105.603 184.556 118.176 253.284 122.858 268.464C126.907 267.949 130.191 267.919 130.191 267.919C130.191 267.919 131.118 195.702 128.954 180.846C126.79 165.931 125.626 155.493 125.626 155.493L102.378 143.11L105.603 184.556Z" fill="#915A17"/>
<path d="M125.155 70.3039L130.382 91.8587C130.382 91.8587 128.35 83.5254 121.828 79.8446C119.148 78.3281 111.021 75.516 111.212 75.516C111.786 89.6208 91.8365 88.3252 94.413 75.7074C94.413 75.7074 86.8306 79.5354 85.9767 79.8888C81.2063 81.9353 80.794 91.8587 80.794 91.8587L84.7399 70.7162C84.7399 70.7162 79.3659 70.6131 78.4383 68.4635C55.4259 101.429 53.8653 128.888 68.3971 129.477C77.4519 129.845 84.2246 105.11 84.2246 105.11L81.3388 160.233H126.156L121.519 104.285C121.519 104.285 131.619 139.474 145.208 128.873C158.474 118.537 130.647 66.417 130.647 66.417L125.155 70.3039Z" fill="#FFA631"/>
<path d="M112.479 52.7979H92.6465V64.6206H112.479V52.7979Z" fill="#2D1C1F"/>
<path d="M102.57 53.5049C99.6842 53.5049 97.3579 55.8459 97.3579 58.7169C97.3579 61.6027 99.6989 63.9289 102.57 63.9289C105.456 63.9289 107.782 61.5879 107.782 58.7169C107.782 55.8312 105.441 53.5049 102.57 53.5049ZM102.57 62.383C100.538 62.383 98.9039 60.734 98.9039 58.7169C98.9039 56.6851 100.553 55.0508 102.57 55.0508C104.602 55.0508 106.236 56.6998 106.236 58.7169C106.236 60.7487 104.587 62.383 102.57 62.383Z" fill="#8B7B6C"/>
<path d="M102.128 57.2443C102.128 57.583 101.819 57.848 101.436 57.848C101.053 57.848 100.744 57.5683 100.744 57.2443C100.744 56.9057 101.053 56.6407 101.436 56.6407C101.819 56.626 102.128 56.9057 102.128 57.2443Z" fill="white"/>
<path d="M96.7396 51.2373H94.4722V52.798H96.7396V51.2373Z" fill="#8B7B6C"/>
<path d="M78.4385 68.4781C78.9243 66.9469 83.091 59.7914 86.1829 57.7007C89.2748 55.61 94.4721 52.7979 94.4721 52.7979C94.4721 52.7979 98.1235 54.8002 96.0328 58.2896C93.9568 61.779 91.4833 63.1041 89.5104 66.0046C87.5375 68.9051 86.0651 70.7308 82.9144 71.2461C79.4102 71.835 78.4385 68.4781 78.4385 68.4781Z" fill="#FCC490"/>
<path d="M78.4385 68.4781C78.9243 66.9469 83.091 59.7914 86.1829 57.7007C89.2748 55.61 94.4721 52.7979 94.4721 52.7979C94.4721 52.7979 98.1235 54.8002 96.0328 58.2896C93.9568 61.779 91.4833 63.1041 89.5104 66.0046C87.5375 68.9051 86.0651 70.7308 82.9144 71.2461C79.4102 71.835 78.4385 68.4781 78.4385 68.4781Z" fill="#FCC490"/>
<path d="M130.632 67.4771C130.146 65.9459 125.98 58.7904 122.888 56.6997C119.796 54.609 114.599 51.7969 114.599 51.7969C114.599 51.7969 110.947 53.7992 113.038 57.2886C115.114 60.778 117.587 62.1031 119.56 65.0036C121.533 67.9188 123.005 69.7298 126.156 70.2451C129.66 70.8193 130.632 67.4771 130.632 67.4771Z" fill="#FCC490"/>
<path d="M99.0212 270.967L103.232 270.982L104.528 280.611C104.528 280.611 82.7079 284.513 82.0453 282.157C81.9422 281.818 81.7067 281.185 81.9717 280.67C84.8869 277.681 97.063 274.309 97.063 274.309L99.0212 270.967Z" fill="#FFB42E"/>
<path d="M98.8886 269.906L103.099 269.921L104.395 279.55C104.395 279.55 82.5753 283.452 81.9127 281.096C81.3238 279.064 96.9305 273.248 96.9305 273.248L98.8886 269.906Z" fill="#37474F"/>
<path d="M94.2952 278.005L93.6032 278.314L92.2192 275.09L92.9112 274.839L94.2952 278.005Z" fill="white"/>
<path d="M95.7083 277.445L95.0163 277.754L93.6323 274.53L94.3243 274.221L95.7083 277.445Z" fill="white"/>
<path d="M97.1512 276.9L96.4592 277.209L95.0752 273.985L95.7672 273.661L97.1512 276.9Z" fill="white"/>
<path d="M127.879 272.527L123.668 272.542L122.373 282.171C122.373 282.171 144.192 286.073 144.855 283.717C144.958 283.378 145.194 282.745 144.929 282.23C142.013 279.241 129.837 275.87 129.837 275.87L127.879 272.527Z" fill="#FFB42E"/>
<path d="M128.026 271.453L123.815 271.467L122.52 281.096C122.52 281.096 144.339 284.998 145.002 282.642C145.591 280.61 129.984 274.795 129.984 274.795L128.026 271.453Z" fill="#37474F"/>
<path d="M132.62 279.551L133.312 279.875L134.681 276.65L133.989 276.4L132.62 279.551Z" fill="white"/>
<path d="M131.207 279.006L131.884 279.315L133.268 276.09L132.576 275.781L131.207 279.006Z" fill="white"/>
<path d="M129.749 278.461L130.441 278.77L131.825 275.546L131.133 275.222L129.749 278.461Z" fill="white"/>
<path d="M92.4989 75.8691C92.4989 75.8691 89.5543 73.9257 87.9642 75.8691C86.3741 77.8126 77.9965 108.084 78.4382 111.426C78.8799 114.753 80.794 117.271 80.794 117.271L92.4989 75.8691Z" fill="#37474F"/>
<path d="M114.039 76.5909C114.039 76.5909 116.306 74.2646 118.147 75.2364C120.458 76.4584 128.438 107.097 127.938 111.146C127.437 115.21 125.346 118.552 125.346 118.552L114.039 76.5909Z" fill="#37474F"/>
<path d="M91.395 49.6766C91.395 48.7048 92.6023 47.8362 94.1335 47.3797C95.6647 46.9233 97.1224 47.1589 98.1088 47.792C98.4474 47.9981 99.0953 49.2643 97.3432 49.1612C94.7519 49.014 93.8096 49.3379 93.2207 49.6766C91.7778 50.4863 91.395 49.6766 91.395 49.6766Z" fill="black"/>
<path d="M113.215 49.6766C113.215 48.7048 112.007 47.8362 110.476 47.3797C108.945 46.9233 107.487 47.1589 106.501 47.792C106.162 47.9981 105.514 49.2643 107.267 49.1612C109.858 49.014 110.8 49.3379 111.389 49.6766C112.817 50.4863 113.215 49.6766 113.215 49.6766Z" fill="black"/>
</svg>
