<svg width="24" height="24" viewBox="0 0 24 24" fill="none" xmlns="http://www.w3.org/2000/svg">
<g clip-path="url(#clip0)">
<path d="M18.647 13.663C18.6178 13.5811 18.5831 13.5012 18.543 13.424L18.548 13.435C18.402 13.094 17.228 10.826 17.032 10.517L11.581 -0.000976562L5.99104 10.775C5.80104 11.085 4.75904 13.095 4.61504 13.435L4.55804 13.561C4.18627 14.4671 3.99666 15.4376 4.00004 16.417C4.00004 18.4279 4.79886 20.3564 6.22076 21.7783C7.64266 23.2002 9.57117 23.999 11.582 23.999C13.5929 23.999 15.5214 23.2002 16.9433 21.7783C18.3652 20.3564 19.164 18.4279 19.164 16.417V16.411L19.165 16.31C19.165 15.355 18.975 14.444 18.63 13.614L18.647 13.661V13.663ZM11.585 22.018C10.6151 22.0182 9.66187 21.7658 8.81912 21.2857C7.97638 20.8056 7.2732 20.1142 6.77882 19.2798C6.28443 18.4453 6.01589 17.4965 5.99962 16.5267C5.98336 15.5569 6.21993 14.5996 6.68604 13.749L6.67104 13.778C6.5978 14.1674 6.56097 14.5628 6.56104 14.959V14.96C6.5621 16.7356 7.26791 18.4381 8.52343 19.6936C9.77894 20.9492 11.4815 21.655 13.257 21.656C13.37 21.656 13.491 21.656 13.603 21.65C12.9639 21.8956 12.2847 22.0204 11.6 22.018H11.577H11.578H11.585Z" fill="#DC002D"/>
</g>
<defs>
<clipPath id="clip0">
<rect width="24" height="24" fill="white"/>
</clipPath>
</defs>
</svg>
