<svg width="24" height="24" viewBox="0 0 24 24" fill="none" xmlns="http://www.w3.org/2000/svg">
<path d="M7.85715 5.1992C7.85715 4.14352 8.3463 3.13108 9.21701 2.3846C10.0877 1.63812 11.2686 1.21875 12.5 1.21875C13.7314 1.21875 14.9123 1.63812 15.783 2.3846C16.6537 3.13108 17.1429 4.14352 17.1429 5.1992V13.8766C18.0386 14.6604 18.6445 15.6535 18.8846 16.7313C19.1247 17.8091 18.9883 18.9238 18.4924 19.9354C17.9966 20.947 17.1634 21.8107 16.0974 22.418C15.0314 23.0253 13.7799 23.3492 12.5 23.3492C11.2201 23.3492 9.96863 23.0253 8.9026 22.418C7.83656 21.8107 7.00339 20.947 6.50756 19.9354C6.01172 18.9238 5.87529 17.8091 6.11538 16.7313C6.35547 15.6535 6.96138 14.6604 7.85715 13.8766V5.1992ZM12.5 2.81093C11.7612 2.81093 11.0526 3.06255 10.5302 3.51044C10.0078 3.95833 9.71429 4.56579 9.71429 5.1992V14.5724L9.406 14.8112C8.70507 15.3486 8.21098 16.0558 7.98913 16.8392C7.76729 17.6226 7.82814 18.4453 8.16363 19.1984C8.49912 19.9515 9.09344 20.5996 9.86794 21.0568C10.6424 21.5139 11.5606 21.7587 12.5009 21.7587C13.4413 21.7587 14.3594 21.5139 15.1339 21.0568C15.9084 20.5996 16.5027 19.9515 16.8382 19.1984C17.1737 18.4453 17.2346 17.6226 17.0127 16.8392C16.7909 16.0558 16.2968 15.3486 15.5959 14.8112L15.2857 14.5708V5.1992C15.2857 4.56579 14.9922 3.95833 14.4698 3.51044C13.9474 3.06255 13.2388 2.81093 12.5 2.81093V2.81093ZM13.4286 9.17965C13.4286 8.96851 13.3307 8.76602 13.1566 8.61673C12.9825 8.46743 12.7463 8.38356 12.5 8.38356C12.2537 8.38356 12.0175 8.46743 11.8434 8.61673C11.6693 8.76602 11.5714 8.96851 11.5714 9.17965V15.6837C10.9519 15.8715 10.4297 16.241 10.0972 16.727C9.7647 17.2129 9.64328 17.784 9.75441 18.3392C9.86553 18.8945 10.202 19.3982 10.7045 19.7614C11.2069 20.1245 11.8429 20.3237 12.5 20.3237C13.1571 20.3237 13.7931 20.1245 14.2955 19.7614C14.798 19.3982 15.1345 18.8945 15.2456 18.3392C15.3567 17.784 15.2353 17.2129 14.9028 16.727C14.5703 16.241 14.0481 15.8715 13.4286 15.6837V9.17965Z" fill="#DC002D"/>
</svg>
