<svg width="24" height="24" viewBox="0 0 24 24" fill="none" xmlns="http://www.w3.org/2000/svg">
<path d="M11.9043 21.7344C12.2656 21.7344 12.8125 21.4023 13.3301 21.0508C18.3496 17.7402 21.709 13.7559 21.709 9.78125C21.709 5.99219 19.0527 3.49219 15.9766 3.49219C14.0527 3.49219 12.6953 4.54688 11.9043 6.05078C11.1035 4.55664 9.74609 3.49219 7.82227 3.49219C4.74609 3.49219 2.08984 5.99219 2.08984 9.78125C2.08984 13.7559 5.44922 17.7402 10.4688 21.0508C10.9961 21.4023 11.5332 21.7344 11.9043 21.7344Z" fill="#FFA900"/>
<path d="M8.18359 13.2148H9.82812C10.0703 13.2148 10.2344 13.0938 10.2852 12.8711L10.6641 11.1289L11.4922 16.1602C11.5664 16.6016 12.2305 16.5977 12.3203 16.1641L13.0938 12.4805L13.1602 12.832C13.207 13.082 13.3672 13.2148 13.6211 13.2148H15.0703C15.3086 13.2148 15.5 13.0273 15.5 12.793C15.5 12.5469 15.3125 12.3633 15.0703 12.3633H13.8711L13.4805 10.6055C13.3867 10.1836 12.7539 10.1914 12.6602 10.6172L11.9141 13.9688L11.082 8.86328C11.0156 8.43359 10.3867 8.42188 10.293 8.85547L9.53516 12.3633H8.18359C7.94531 12.3633 7.75391 12.5547 7.75391 12.793C7.75391 13.0273 7.94531 13.2148 8.18359 13.2148Z" fill="#1C1C1E"/>
</svg>
