module github.com/prudnitskiy/pgdiff

go 1.13

require (
	github.com/joncrlsn/misc v0.0.0-20160408024000-193a3fcec166
	github.com/joncrlsn/pgutil v0.0.0-20171213024902-4c8aab9306b4
	github.com/lib/pq v1.10.2 // indirect
	github.com/ogier/pflag v0.0.1
)

require (
	github.com/cockroachdb/apd v1.1.0 // indirect
	github.com/gofrs/uuid v4.3.0+incompatible // indirect
	github.com/jackc/fake v0.0.0-20150926172116-812a484cc733 // indirect
	github.com/jackc/pgx v3.6.2+incompatible
	github.com/joncrlsn/fileutil v0.0.0-20150212043926-71757336e569 // indirect
	github.com/kr/pretty v0.3.0 // indirect
	github.com/pkg/errors v0.9.1 // indirect
	github.com/shopspring/decimal v1.3.1 // indirect
	github.com/stretchr/testify v1.8.0
	github.com/stvp/assert v0.0.0-20170616060220-4bc16443988b // indirect
	golang.org/x/crypto v0.0.0-20220829220503-c86fa9a7ed90 // indirect
	gopkg.in/yaml.v3 v3.0.1
)
