<svg width="15" height="16" viewBox="0 0 15 16" fill="none" xmlns="http://www.w3.org/2000/svg">
<path id="Vector" d="M8.30849 1.38585e-06C8.52898 1.38585e-06 8.72622 0.138955 8.80047 0.347006L9.32995 1.83298C9.5197 1.88081 9.68244 1.92865 9.82044 1.97876C9.97118 2.03343 10.1654 2.1162 10.4054 2.22934L11.6384 1.56874C11.739 1.51475 11.8542 1.49527 11.9667 1.5132C12.0792 1.53114 12.183 1.58553 12.2624 1.66821L13.3468 2.80338C13.4908 2.95448 13.5313 3.17544 13.4503 3.3683L12.8721 4.74038C12.9681 4.91881 13.0446 5.07144 13.1031 5.199C13.1661 5.33795 13.2441 5.5293 13.3371 5.77608L14.6848 6.36074C14.8873 6.44807 15.0125 6.65308 14.999 6.87252L14.9 8.44809C14.8932 8.55045 14.8569 8.64854 14.7956 8.7302C14.7343 8.81187 14.6506 8.87351 14.555 8.90747L13.2786 9.36686C13.2418 9.54529 13.2036 9.69791 13.1631 9.827C13.0978 10.0264 13.0232 10.2225 12.9396 10.4147L13.5808 11.8498C13.6261 11.9506 13.6382 12.0635 13.6156 12.1718C13.5929 12.2802 13.5366 12.3783 13.4548 12.4519L12.2354 13.5545C12.155 13.6268 12.0548 13.6725 11.9481 13.6855C11.8414 13.6985 11.7334 13.6782 11.6384 13.6273L10.3814 12.9531C10.1848 13.0585 9.98189 13.1516 9.77394 13.2317L9.22496 13.4398L8.73747 14.8066C8.70135 14.9066 8.63619 14.9933 8.55053 15.0553C8.46487 15.1172 8.36272 15.1515 8.25749 15.1536L6.83254 15.1862C6.72451 15.1891 6.61827 15.158 6.52842 15.0972C6.43857 15.0364 6.36953 14.9489 6.33081 14.8468L5.75633 13.3077C5.56032 13.2399 5.36625 13.1664 5.17435 13.0875C5.01739 13.0187 4.8628 12.9445 4.71086 12.865L3.28591 13.4816C3.19202 13.5221 3.08851 13.5342 2.98798 13.5162C2.88745 13.4983 2.79423 13.4512 2.71968 13.3806L1.66522 12.379C1.58671 12.3048 1.53325 12.2074 1.51239 12.1008C1.49152 11.9941 1.50432 11.8834 1.54897 11.7845L2.1617 10.4329C2.08021 10.2728 2.00466 10.1097 1.93521 9.94393C1.85414 9.74099 1.77911 9.53563 1.71022 9.32813L0.367763 8.91431C0.258642 8.88091 0.163466 8.81198 0.0970146 8.7182C0.0305634 8.62442 -0.00344336 8.51105 0.000275592 8.3957L0.0527738 6.93706C0.0565106 6.84189 0.0858751 6.74957 0.137692 6.67007C0.189509 6.59057 0.261805 6.52693 0.346764 6.48603L1.75521 5.80113C1.82046 5.55891 1.87746 5.3706 1.92771 5.23317C1.99846 5.0496 2.07703 4.86922 2.1632 4.69254L1.55272 3.38653C1.50639 3.28735 1.49232 3.17585 1.51254 3.06806C1.53275 2.96027 1.58621 2.86176 1.66522 2.78667L2.71818 1.77983C2.792 1.70934 2.88435 1.66195 2.98414 1.64336C3.08393 1.62477 3.1869 1.63577 3.28066 1.67504L4.70411 2.27034C4.86161 2.16404 5.0041 2.07823 5.1331 2.00914C5.28684 1.92637 5.49234 1.83981 5.75108 1.74642L6.24606 0.348525C6.28265 0.246222 6.34954 0.157848 6.4376 0.0954703C6.52565 0.0330928 6.63058 -0.000247726 6.73804 1.38585e-06H8.30849ZM7.51802 5.3296C6.26781 5.3296 5.25459 6.34328 5.25459 7.59462C5.25459 8.84597 6.26781 9.86041 7.51802 9.86041C8.76747 9.86041 9.78069 8.84597 9.78069 7.59462C9.78069 6.34328 8.76822 5.3296 7.51802 5.3296Z" fill="white"/>
</svg>
