<svg width="15" height="15" viewBox="0 0 15 15" fill="none" xmlns="http://www.w3.org/2000/svg">
<g id="Cross">
<path id="Line2" fill-rule="evenodd" clip-rule="evenodd" d="M0.243386 0.243386C0.399427 0.0875378 0.610949 0 0.831488 0C1.05203 0 1.26355 0.0875378 1.41959 0.243386L14.7351 13.5589C14.8169 13.6351 14.8825 13.727 14.928 13.8291C14.9734 13.9312 14.9979 14.0414 14.9999 14.1531C15.0018 14.2648 14.9813 14.3758 14.9394 14.4795C14.8976 14.5831 14.8353 14.6772 14.7562 14.7562C14.6772 14.8353 14.5831 14.8976 14.4795 14.9394C14.3758 14.9813 14.2648 15.0018 14.1531 14.9999C14.0414 14.9979 13.9312 14.9734 13.8291 14.928C13.727 14.8825 13.6351 14.8169 13.5589 14.7351L0.243386 1.41959C0.0875378 1.26355 0 1.05203 0 0.831488C0 0.610949 0.0875378 0.399427 0.243386 0.243386Z" fill="white"/>
<path id="Line1" fill-rule="evenodd" clip-rule="evenodd" d="M14.7351 0.243386C14.891 0.399427 14.9785 0.610949 14.9785 0.831488C14.9785 1.05203 14.891 1.26355 14.7351 1.41959L1.41958 14.7351C1.26182 14.8821 1.05316 14.9622 0.837559 14.9584C0.621957 14.9545 0.416249 14.8672 0.263771 14.7147C0.111294 14.5623 0.0239532 14.3565 0.0201492 14.1409C0.0163451 13.9253 0.0963748 13.7167 0.243378 13.5589L13.5589 0.243386C13.715 0.0875378 13.9265 0 14.147 0C14.3676 0 14.5791 0.0875378 14.7351 0.243386Z" fill="white"/>
</g>
</svg>
