FANN_FLO_2.1
num_layers=3
learning_rate=0.700000
connection_rate=1.000000
network_type=0
learning_momentum=0.000000
training_algorithm=2
train_error_function=1
train_stop_function=0
cascade_output_change_fraction=0.010000
quickprop_decay=-0.000100
quickprop_mu=1.750000
rprop_increase_factor=1.200000
rprop_decrease_factor=0.500000
rprop_delta_min=0.000000
rprop_delta_max=50.000000
rprop_delta_zero=0.100000
cascade_output_stagnation_epochs=12
cascade_candidate_change_fraction=0.010000
cascade_candidate_stagnation_epochs=12
cascade_max_out_epochs=150
cascade_min_out_epochs=50
cascade_max_cand_epochs=150
cascade_min_cand_epochs=50
cascade_num_candidate_groups=2
bit_fail_limit=3.49999994039535520000e-001
cascade_candidate_limit=1.00000000000000000000e+003
cascade_weight_multiplier=4.00000005960464480000e-001
cascade_activation_functions_count=10
cascade_activation_functions=3 5 7 8 10 11 14 15 16 17 
cascade_activation_steepnesses_count=4
cascade_activation_steepnesses=2.50000000000000000000e-001 5.00000000000000000000e-001 7.50000000000000000000e-001 1.00000000000000000000e+000 
layer_sizes=6 8 4 
scale_included=0
neurons (num_inputs, activation_function, activation_steepness)=(0, 0, 0.00000000000000000000e+000) (0, 0, 0.00000000000000000000e+000) (0, 0, 0.00000000000000000000e+000) (0, 0, 0.00000000000000000000e+000) (0, 0, 0.00000000000000000000e+000) (0, 0, 0.00000000000000000000e+000) (6, 5, 5.00000000000000000000e-001) (6, 5, 5.00000000000000000000e-001) (6, 5, 5.00000000000000000000e-001) (6, 5, 5.00000000000000000000e-001) (6, 5, 5.00000000000000000000e-001) (6, 5, 5.00000000000000000000e-001) (6, 5, 5.00000000000000000000e-001) (0, 5, 0.00000000000000000000e+000) (8, 5, 5.00000000000000000000e-001) (8, 5, 5.00000000000000000000e-001) (8, 5, 5.00000000000000000000e-001) (0, 5, 0.00000000000000000000e+000) 
connections (connected_to_neuron, weight)=(0, -2.06734809875488280000e+001) (1, -1.94003963470458980000e+001) (2, 3.44698913395404820000e-002) (3, 1.43673057556152340000e+001) (4, -1.66117019653320310000e+001) (5, 5.60337185859680180000e-001) (0, -4.29007995605468750000e+002) (1, 9.48772370815277100000e-001) (2, 7.30987727642059330000e-001) (3, 8.64601373672485350000e-001) (4, 4.38125759363174440000e-001) (5, 1.31591320037841800000e+000) (0, 1.89212188720703120000e+002) (1, -5.79147577285766600000e+000) (2, -1.70769602060317990000e-001) (3, -4.95762395858764650000e+000) (4, 1.96851122379302980000e+000) (5, -1.00544142723083500000e+000) (0, -4.33996917724609370000e+002) (1, 2.94997525215148930000e+000) (2, -3.17323532104492190000e+001) (3, 2.01051259040832520000e+000) (4, -1.89304141998291020000e+001) (5, 2.51840662956237790000e+000) (0, -1.43973388671875000000e+001) (1, -1.50096940994262700000e+000) (2, 1.76683998107910160000e+001) (3, 7.64345765113830570000e-001) (4, -1.43293943405151370000e+001) (5, 9.31600272655487060000e-001) (0, -6.66641052246093750000e+002) (1, 6.48089528083801270000e-001) (2, 4.82128173112869260000e-001) (3, 8.56953024864196780000e-001) (4, 3.03376585245132450000e-001) (5, 1.18051600456237790000e+000) (0, -5.53394531250000000000e+002) (1, 2.84792709350585940000e+001) (2, 5.74435663223266600000e+000) (3, 3.26785230636596680000e+000) (4, -7.17601680755615230000e+000) (5, 2.59606456756591800000e+000) (6, -1.97054080963134770000e+001) (7, -8.78283500671386720000e-001) (8, 9.20127332210540770000e-001) (9, -6.45701646804809570000e+000) (10, -1.99733361601829530000e-001) (11, -2.25582313537597660000e+000) (12, -3.97336781024932860000e-001) (13, -1.83960556983947750000e+000) (6, 5.97490348815917970000e+001) (7, -1.56589519977569580000e+000) (8, 8.27834224700927730000e+000) (9, -3.91377716064453130000e+001) (10, -1.81290316581726070000e+000) (11, -1.56043255329132080000e+000) (12, -8.82411384582519530000e+000) (13, -4.41669255495071410000e-001) (6, -2.92972135543823240000e+000) (7, 2.10960298776626590000e-001) (8, 3.51254314184188840000e-001) (9, 2.08249015808105470000e+001) (10, -1.21549256145954130000e-001) (11, 5.12113213539123540000e-001) (12, 7.38081783056259160000e-002) (13, 1.71494960784912110000e-001) 
