%YAML 1.1
%TAG !u! tag:unity3d.com,2011:
--- !u!1 &6502203054222474299
GameObject:
  m_ObjectHideFlags: 0
  m_CorrespondingSourceObject: {fileID: 0}
  m_PrefabInstance: {fileID: 0}
  m_PrefabAsset: {fileID: 0}
  serializedVersion: 6
  m_Component:
  - component: {fileID: 6502203054222474298}
  - component: {fileID: 6502203054222474301}
  m_Layer: 0
  m_Name: BallDetection
  m_TagString: Untagged
  m_Icon: {fileID: 0}
  m_NavMeshLayer: 0
  m_StaticEditorFlags: 0
  m_IsActive: 1
--- !u!4 &6502203054222474298
Transform:
  m_ObjectHideFlags: 0
  m_CorrespondingSourceObject: {fileID: 0}
  m_PrefabInstance: {fileID: 0}
  m_PrefabAsset: {fileID: 0}
  m_GameObject: {fileID: 6502203054222474299}
  m_LocalRotation: {x: 0, y: 0, z: 0, w: 1}
  m_LocalPosition: {x: 0, y: 0, z: 0}
  m_LocalScale: {x: 1, y: 1, z: 1}
  m_Children: []
  m_Father: {fileID: 0}
  m_RootOrder: 0
  m_LocalEulerAnglesHint: {x: 0, y: 0, z: 0}
--- !u!114 &6502203054222474301
MonoBehaviour:
  m_ObjectHideFlags: 0
  m_CorrespondingSourceObject: {fileID: 0}
  m_PrefabInstance: {fileID: 0}
  m_PrefabAsset: {fileID: 0}
  m_GameObject: {fileID: 6502203054222474299}
  m_Enabled: 1
  m_EditorHideFlags: 0
  m_Script: {fileID: 11500000, guid: 500484b2f95ac1a4a8f876253f5591c6, type: 3}
  m_Name: 
  m_EditorClassIdentifier: 
  _webcamIdNumber: 0
  _resizeFactor: 1
  _activateMedianBlur: 0
  _medianBlurFactor: 5
  _activateMeanBlur: 0
  _meanBlurFactor: 0
  _activateGaussianBlur: 0
  _gaussianBlurFactor: 1
  _gaussianBlurSigmaFactor: 1
  _hueLowTrigger: 14
  _hueHighTrigger: 51
  _saturationLowTrigger: 59
  _saturationHighTrigger: 255
  _valueLowTrigger: 127
  _valueHighTrigger: 255
  _morphingOperationSize: 2
  _morphingIteration: 3
  _morphingOpening: 1
  _morphingClosing: 0
  _outline: 1
  _difference: 0
