OFF
122 240 0
0.0641359624657819 0.0641359624657819 -0.995878083219615
0.283042236886982 0.283042236886982 -0.150037682365189
0.0359277331971206 0.0359277331971206 0.119770871979404
-0.0762111618128888 -0.0762111618128888 0.345256907001487
-0.199000783142675 -0.199000783142675 0.523776585461291
-0.0426955836897493 -0.0426955836897493 0.178009907584543
0.0522594719904844 0.0729406877156478 -0.99507381307394
0.271064402688801 0.291745618413964 -0.150098519190774
0.0244636097106982 0.0451448254358616 0.118085598543644
-0.0879772841051177 -0.0672960683799543 0.344116495457769
-0.208231433796071 -0.187550218070907 0.525479732916698
-0.0516595529211835 -0.0309783371960201 0.179264679845064
0.0384737699258522 0.0778117798864971 -0.992739730202454
0.256984589685216 0.296322599645861 -0.150275074535166
0.0118746432586907 0.0512126532193355 0.113194744542243
-0.101442685227283 -0.0621046752666384 0.340806892254229
-0.214338609631414 -0.175000599670769 0.530422459343459
-0.0569927891263035 -0.0176547791656586 0.182906170775256
0.0241282968406057 0.0782724225377523 -0.989104310899128
0.242181028072845 0.296325153769991 -0.150550065931123
-0.000606870410092726 0.0535372552870538 0.105577060841444
-0.115289277898582 -0.061145152201435 0.335652064411791
-0.216724497726746 -0.1625803720296 0.538120936240921
-0.0581732379865107 -0.00402911228936417 0.188577925871112
0.0106272875911171 0.0742775247572224 -0.984523415334828
0.228102793604784 0.291753030770889 -0.150896575304829
-0.0117591537739321 0.0518910833921732 0.0959782193974044
-0.128161661153462 -0.0645114239873566 0.32915660239547
-0.215155550731836 -0.151505313565731 0.547821583051919
-0.0550853489426972 0.00856488822340812 0.195724754226409
-0.000707684970210995 0.0662181349737553 -0.979445453484364
0.216127961959595 0.283053781903561 -0.151280683904516
-0.0204905436346476 0.0464352763093187 0.0853378216897269
-0.138799796431769 -0.0718739764878025 0.321956327283969
-0.209785348110041 -0.142859528166075 0.558574832878211
-0.0480313860890595 0.0188944338549069 0.203647074486848
-0.0087670747536781 0.0548831624124272 -0.9743674916339
0.207428713092267 0.271078950258372 -0.151664792504202
-0.0259463507175022 0.0377038864486031 0.0746974239820493
-0.146162348932215 -0.0825121117661094 0.314756052172468
-0.201139562710386 -0.137489325544281 0.569328082704504
-0.0377018404575607 0.0259483967085446 0.211569394747287
-0.012761972534208 0.0413821531629386 -0.9697865960696
0.202856590093165 0.257000715790311 -0.152011301877908
-0.0275925226123828 0.0265516030847638 0.0650985825380093
-0.149528620718136 -0.0953844950209898 0.308260590156147
-0.190064504246517 -0.135920378549371 0.579028729515502
-0.0251078399447884 0.0290362857523581 0.218716223102584
-0.0123013298829528 0.0270366800776921 -0.966151176766273
0.202859144217295 0.242197154177939 -0.152286293273865
-0.0252679205446645 0.0140700894159804 0.0574808988372104
-0.148569097652933 -0.109231087692288 0.303105762313709
-0.177644276605347 -0.138306266644703 0.586727206412964
-0.011482173068494 0.0278558368921509 0.22438797819844
-0.00743023771210347 0.0132509780130599 -0.963817093894787
0.207436125449191 0.228117341174355 -0.152462848618257
-0.0192000927611906 0.00148112296397283 0.0525900448358103
-0.143377704539617 -0.122696488814454 0.299796159110169
-0.165094658205209 -0.144413442480046 0.591669932839725
0.00184138496186746 0.0225226006870309 0.228029469128632
0.00137448753776239 0.0013744875377624 -0.963012823749112
0.216139506976173 0.216139506976173 -0.152523685443842
-0.00998300052244953 -0.00998300052244953 0.0509047714000492
-0.134462611106683 -0.134462611106683 0.298655747566452
-0.153644093133441 -0.153644093133441 0.593373080295132
0.0135586314555967 0.0135586314555968 0.229284241389153
0.0132509780130599 -0.00743023771210345 -0.963817093894787
0.228117341174355 0.207436125449191 -0.152462848618257
0.00148112296397281 -0.0192000927611906 0.0525900448358103
-0.122696488814454 -0.143377704539617 0.299796159110169
-0.144413442480046 -0.165094658205209 0.591669932839725
0.0225226006870308 0.00184138496186749 0.228029469128632
0.0270366800776921 -0.0123013298829528 -0.966151176766273
0.242197154177939 0.202859144217295 -0.152286293273865
0.0140700894159804 -0.0252679205446645 0.0574808988372104
-0.109231087692288 -0.148569097652933 0.303105762313709
-0.138306266644703 -0.177644276605347 0.586727206412964
0.0278558368921509 -0.011482173068494 0.22438797819844
0.0413821531629386 -0.0127619725342079 -0.9697865960696
0.257000715790311 0.202856590093165 -0.152011301877908
0.0265516030847638 -0.0275925226123828 0.0650985825380093
-0.0953844950209898 -0.149528620718136 0.308260590156147
-0.13592037854937 -0.190064504246517 0.579028729515502
0.0290362857523581 -0.0251078399447884 0.218716223102584
0.0548831624124272 -0.0087670747536781 -0.9743674916339
0.271078950258372 0.207428713092267 -0.151664792504202
0.0377038864486031 -0.0259463507175022 0.0746974239820493
-0.0825121117661094 -0.146162348932215 0.314756052172468
-0.137489325544281 -0.201139562710386 0.569328082704504
0.0259483967085446 -0.0377018404575607 0.211569394747287
0.0662181349737553 -0.000707684970210995 -0.979445453484364
0.283053781903561 0.216127961959595 -0.151280683904516
0.0464352763093187 -0.0204905436346477 0.0853378216897269
-0.0718739764878025 -0.138799796431769 0.321956327283969
-0.142859528166075 -0.209785348110042 0.558574832878211
0.0188944338549069 -0.0480313860890594 0.203647074486848
0.0742775247572224 0.0106272875911171 -0.984523415334828
0.291753030770889 0.228102793604784 -0.150896575304829
0.0518910833921732 -0.0117591537739321 0.0959782193974044
-0.0645114239873566 -0.128161661153462 0.32915660239547
-0.151505313565731 -0.215155550731836 0.547821583051919
0.00856488822340812 -0.0550853489426972 0.195724754226409
0.0782724225377523 0.0241282968406057 -0.989104310899127
0.296325153769991 0.242181028072845 -0.150550065931123
0.0535372552870538 -0.000606870410092747 0.105577060841444
-0.061145152201435 -0.115289277898582 0.335652064411791
-0.1625803720296 -0.216724497726746 0.538120936240921
-0.00402911228936417 -0.0581732379865107 0.188577925871112
0.0778117798864971 0.0384737699258522 -0.992739730202454
0.296322599645861 0.256984589685216 -0.150275074535166
0.0512126532193355 0.0118746432586906 0.113194744542243
-0.0621046752666384 -0.101442685227283 0.340806892254229
-0.175000599670769 -0.214338609631414 0.530422459343459
-0.0176547791656586 -0.0569927891263035 0.182906170775256
0.0729406877156478 0.0522594719904844 -0.99507381307394
0.291745618413964 0.271064402688801 -0.150098519190774
0.0451448254358616 0.0244636097106982 0.118085598543644
-0.0672960683799543 -0.0879772841051177 0.344116495457769
-0.187550218070907 -0.208231433796071 0.525479732916698
-0.0309783371960201 -0.0516595529211835 0.179264679845064
0.0327552250017722 0.0327552250017722 -0.979445453484364
-0.0145684761170763 -0.0145684761170763 0.203647074486848
3 0 6 1
3 6 7 1
3 1 7 2
3 7 8 2
3 2 8 3
3 8 9 3
3 3 9 4
3 9 10 4
3 4 10 5
3 10 11 5
3 120 6 0
3 121 5 11
3 6 12 7
3 12 13 7
3 7 13 8
3 13 14 8
3 8 14 9
3 14 15 9
3 9 15 10
3 15 16 10
3 10 16 11
3 16 17 11
3 120 12 6
3 121 11 17
3 12 18 13
3 18 19 13
3 13 19 14
3 19 20 14
3 14 20 15
3 20 21 15
3 15 21 16
3 21 22 16
3 16 22 17
3 22 23 17
3 120 18 12
3 121 17 23
3 18 24 19
3 24 25 19
3 19 25 20
3 25 26 20
3 20 26 21
3 26 27 21
3 21 27 22
3 27 28 22
3 22 28 23
3 28 29 23
3 120 24 18
3 121 23 29
3 24 30 25
3 30 31 25
3 25 31 26
3 31 32 26
3 26 32 27
3 32 33 27
3 27 33 28
3 33 34 28
3 28 34 29
3 34 35 29
3 120 30 24
3 121 29 35
3 30 36 31
3 36 37 31
3 31 37 32
3 37 38 32
3 32 38 33
3 38 39 33
3 33 39 34
3 39 40 34
3 34 40 35
3 40 41 35
3 120 36 30
3 121 35 41
3 36 42 37
3 42 43 37
3 37 43 38
3 43 44 38
3 38 44 39
3 44 45 39
3 39 45 40
3 45 46 40
3 40 46 41
3 46 47 41
3 120 42 36
3 121 41 47
3 42 48 43
3 48 49 43
3 43 49 44
3 49 50 44
3 44 50 45
3 50 51 45
3 45 51 46
3 51 52 46
3 46 52 47
3 52 53 47
3 120 48 42
3 121 47 53
3 48 54 49
3 54 55 49
3 49 55 50
3 55 56 50
3 50 56 51
3 56 57 51
3 51 57 52
3 57 58 52
3 52 58 53
3 58 59 53
3 120 54 48
3 121 53 59
3 54 60 55
3 60 61 55
3 55 61 56
3 61 62 56
3 56 62 57
3 62 63 57
3 57 63 58
3 63 64 58
3 58 64 59
3 64 65 59
3 120 60 54
3 121 59 65
3 60 66 61
3 66 67 61
3 61 67 62
3 67 68 62
3 62 68 63
3 68 69 63
3 63 69 64
3 69 70 64
3 64 70 65
3 70 71 65
3 120 66 60
3 121 65 71
3 66 72 67
3 72 73 67
3 67 73 68
3 73 74 68
3 68 74 69
3 74 75 69
3 69 75 70
3 75 76 70
3 70 76 71
3 76 77 71
3 120 72 66
3 121 71 77
3 72 78 73
3 78 79 73
3 73 79 74
3 79 80 74
3 74 80 75
3 80 81 75
3 75 81 76
3 81 82 76
3 76 82 77
3 82 83 77
3 120 78 72
3 121 77 83
3 78 84 79
3 84 85 79
3 79 85 80
3 85 86 80
3 80 86 81
3 86 87 81
3 81 87 82
3 87 88 82
3 82 88 83
3 88 89 83
3 120 84 78
3 121 83 89
3 84 90 85
3 90 91 85
3 85 91 86
3 91 92 86
3 86 92 87
3 92 93 87
3 87 93 88
3 93 94 88
3 88 94 89
3 94 95 89
3 120 90 84
3 121 89 95
3 90 96 91
3 96 97 91
3 91 97 92
3 97 98 92
3 92 98 93
3 98 99 93
3 93 99 94
3 99 100 94
3 94 100 95
3 100 101 95
3 120 96 90
3 121 95 101
3 96 102 97
3 102 103 97
3 97 103 98
3 103 104 98
3 98 104 99
3 104 105 99
3 99 105 100
3 105 106 100
3 100 106 101
3 106 107 101
3 120 102 96
3 121 101 107
3 102 108 103
3 108 109 103
3 103 109 104
3 109 110 104
3 104 110 105
3 110 111 105
3 105 111 106
3 111 112 106
3 106 112 107
3 112 113 107
3 120 108 102
3 121 107 113
3 108 114 109
3 114 115 109
3 109 115 110
3 115 116 110
3 110 116 111
3 116 117 111
3 111 117 112
3 117 118 112
3 112 118 113
3 118 119 113
3 120 114 108
3 121 113 119
3 114 0 115
3 0 1 115
3 115 1 116
3 1 2 116
3 116 2 117
3 2 3 117
3 117 3 118
3 3 4 118
3 118 4 119
3 4 5 119
3 120 0 114
3 121 119 5
