OFF
122 240 0
0.165256215469822 0.165256215469822 -2.66329931618554
1.22502791361436 1.22502791361436 -1.5
0.180620807391582 0.180620807391582 -0.3544786249782
-0.293301951643618 -0.293301951643618 0.598473192783467
-0.578050549849736 -0.578050549849736 1.45849713216804
-0.00856066941951245 -0.00856066941951236 2.37060067215587
0.11755839431457 0.204961599204334 -2.6553068787648
1.17440465732496 1.26180786221472 -1.5
0.132170989581976 0.21957419447174 -0.361600948025286
-0.343028080471453 -0.255624875581688 0.593653571677105
-0.628523135412745 -0.541119930522981 1.46052842710347
-0.0575399834425255 0.0298632214472389 2.37693392604963
0.0665371308035154 0.232787905914497 -2.63211192196391
1.1148934503851 1.28114422549608 -1.5
0.0789673467798558 0.245218121890837 -0.382270734562554
-0.399935722113211 -0.233684947002229 0.579666486452185
-0.68759707887392 -0.521346303762938 1.46642347460864
-0.11228028410628 0.053970491004701 2.39531374471341
0.0171867416951668 0.246011302822241 -2.59598492976331
1.052319664369 1.28114422549608 -1.5
0.0262178222342697 0.255042383361344 -0.414464681868863
-0.458454360106144 -0.22962979897907 0.557881090464275
-0.749489811054913 -0.520665249927839 1.47560522636053
-0.167423209383708 0.0614013517433662 2.42394098343666
-0.0256620130801717 0.243337391705411 -2.55046226387114
0.99280845742914 1.26180786221472 -1.5
-0.0209140930647116 0.248085311720871 -0.455031422073453
-0.512855782440178 -0.243856377654595 0.530429890060452
-0.808142840097828 -0.539143435312245 1.48717490852463
-0.2175709855453 0.0514284192402826 2.46001340863547
-0.0578147988602604 0.225027913614359 -2.5
0.94218520113974 1.22502791361436 -1.5
-0.0578147988602604 0.225027913614359 -0.5
-0.55781479886026 -0.274972086385641 0.5
-0.85781479886026 -0.574972086385641 1.5
-0.25781479886026 0.0250279136143587 2.5
-0.076124276951313 0.19287512783427 -2.44953773612886
0.905405252539376 1.17440465732496 -1.5
-0.0808721969667731 0.18812720781881 -0.544968577926546
-0.588930507591307 -0.319931102805724 0.469570109939549
-0.893643449933657 -0.624644045148074 1.51282509147537
-0.284215304486184 -0.0152158997006012 2.53998659136453
-0.0787981880681423 0.150026373058932 -2.40401507023669
0.886068889258022 1.1148934503851 -1.5
-0.0878292686072452 0.140995292519829 -0.585535318131136
-0.603157086266832 -0.374332525139758 0.442118909535726
-0.912121635318063 -0.683297074190989 1.52439477363947
-0.294188236989268 -0.065363675862194 2.57605901656334
-0.0655747911603985 0.100675983950583 -2.36788807803609
0.886068889258022 1.052319664369 -1.5
-0.0780050071367389 0.0882457679742426 -0.617729265437446
-0.599101938243672 -0.432851163132691 0.420333513547816
-0.911440581482964 -0.745189806371982 1.53357652539136
-0.286757376250603 -0.120506601139621 2.60468625528659
-0.0377484844502357 0.0496547204395286 -2.34469312123519
0.905405252539376 0.99280845742914 -1.5
-0.052361079717642 0.0350421251721224 -0.638399051974713
-0.577162009664213 -0.489758804774449 0.406346428322896
-0.891666954722921 -0.804263749833157 1.53947157289653
-0.262650106693141 -0.175246901803376 2.62306607395037
0.00195689928427652 0.00195689928427663 -2.33670068381445
0.94218520113974 0.94218520113974 -1.5
-0.0134076926374841 -0.013407692637484 -0.645521375021799
-0.539484933602284 -0.539484933602283 0.401526807216534
-0.854736335396166 -0.854736335396166 1.54150286783197
-0.224226215826389 -0.224226215826389 2.62939932784413
0.0496547204395285 -0.0377484844502355 -2.34469312123519
0.99280845742914 0.905405252539376 -1.5
0.0350421251721222 -0.0523610797176418 -0.638399051974713
-0.489758804774449 -0.577162009664213 0.406346428322896
-0.804263749833157 -0.891666954722921 1.53947157289653
-0.175246901803376 -0.26265010669314 2.62306607395037
0.100675983950583 -0.0655747911603985 -2.36788807803609
1.052319664369 0.886068889258022 -1.5
0.0882457679742425 -0.0780050071367388 -0.617729265437446
-0.432851163132691 -0.599101938243672 0.420333513547816
-0.745189806371982 -0.911440581482963 1.53357652539136
-0.120506601139621 -0.286757376250603 2.60468625528659
0.150026373058931 -0.0787981880681422 -2.40401507023669
1.1148934503851 0.886068889258022 -1.5
0.140995292519829 -0.0878292686072451 -0.585535318131136
-0.374332525139758 -0.603157086266831 0.442118909535725
-0.683297074190989 -0.912121635318062 1.52439477363947
-0.0653636758621941 -0.294188236989268 2.57605901656334
0.19287512783427 -0.076124276951313 -2.44953773612886
1.17440465732496 0.905405252539376 -1.5
0.18812720781881 -0.080872196966773 -0.544968577926546
-0.319931102805724 -0.588930507591307 0.469570109939549
-0.624644045148074 -0.893643449933657 1.51282509147537
-0.0152158997006013 -0.284215304486184 2.53998659136453
0.225027913614359 -0.0578147988602603 -2.5
1.22502791361436 0.94218520113974 -1.5
0.225027913614359 -0.0578147988602603 -0.5
-0.274972086385641 -0.55781479886026 0.5
-0.574972086385641 -0.85781479886026 1.5
0.0250279136143586 -0.25781479886026 2.5
0.243337391705411 -0.0256620130801716 -2.55046226387114
1.26180786221472 0.99280845742914 -1.5
0.248085311720871 -0.0209140930647115 -0.455031422073453
-0.243856377654595 -0.512855782440178 0.530429890060452
-0.539143435312245 -0.808142840097828 1.48717490852463
0.0514284192402825 -0.2175709855453 2.46001340863547
0.246011302822241 0.0171867416951668 -2.59598492976331
1.28114422549608 1.052319664369 -1.5
0.255042383361343 0.0262178222342698 -0.414464681868863
-0.22962979897907 -0.458454360106144 0.557881090464275
-0.520665249927839 -0.749489811054913 1.47560522636053
0.0614013517433661 -0.167423209383708 2.42394098343666
0.232787905914497 0.0665371308035155 -2.63211192196391
1.28114422549608 1.1148934503851 -1.5
0.245218121890837 0.0789673467798558 -0.382270734562554
-0.233684947002229 -0.399935722113211 0.579666486452185
-0.521346303762938 -0.68759707887392 1.46642347460864
0.053970491004701 -0.11228028410628 2.39531374471341
0.204961599204334 0.11755839431457 -2.6553068787648
1.26180786221472 1.17440465732496 -1.5
0.21957419447174 0.132170989581976 -0.361600948025286
-0.255624875581688 -0.343028080471452 0.593653571677105
-0.541119930522981 -0.628523135412745 1.46052842710347
0.0298632214472388 -0.0575399834425254 2.37693392604963
0.0836065573770491 0.0836065573770492 -2.5
-0.116393442622951 -0.116393442622951 2.5
3 0 6 1
3 6 7 1
3 1 7 2
3 7 8 2
3 2 8 3
3 8 9 3
3 3 9 4
3 9 10 4
3 4 10 5
3 10 11 5
3 120 6 0
3 121 5 11
3 6 12 7
3 12 13 7
3 7 13 8
3 13 14 8
3 8 14 9
3 14 15 9
3 9 15 10
3 15 16 10
3 10 16 11
3 16 17 11
3 120 12 6
3 121 11 17
3 12 18 13
3 18 19 13
3 13 19 14
3 19 20 14
3 14 20 15
3 20 21 15
3 15 21 16
3 21 22 16
3 16 22 17
3 22 23 17
3 120 18 12
3 121 17 23
3 18 24 19
3 24 25 19
3 19 25 20
3 25 26 20
3 20 26 21
3 26 27 21
3 21 27 22
3 27 28 22
3 22 28 23
3 28 29 23
3 120 24 18
3 121 23 29
3 24 30 25
3 30 31 25
3 25 31 26
3 31 32 26
3 26 32 27
3 32 33 27
3 27 33 28
3 33 34 28
3 28 34 29
3 34 35 29
3 120 30 24
3 121 29 35
3 30 36 31
3 36 37 31
3 31 37 32
3 37 38 32
3 32 38 33
3 38 39 33
3 33 39 34
3 39 40 34
3 34 40 35
3 40 41 35
3 120 36 30
3 121 35 41
3 36 42 37
3 42 43 37
3 37 43 38
3 43 44 38
3 38 44 39
3 44 45 39
3 39 45 40
3 45 46 40
3 40 46 41
3 46 47 41
3 120 42 36
3 121 41 47
3 42 48 43
3 48 49 43
3 43 49 44
3 49 50 44
3 44 50 45
3 50 51 45
3 45 51 46
3 51 52 46
3 46 52 47
3 52 53 47
3 120 48 42
3 121 47 53
3 48 54 49
3 54 55 49
3 49 55 50
3 55 56 50
3 50 56 51
3 56 57 51
3 51 57 52
3 57 58 52
3 52 58 53
3 58 59 53
3 120 54 48
3 121 53 59
3 54 60 55
3 60 61 55
3 55 61 56
3 61 62 56
3 56 62 57
3 62 63 57
3 57 63 58
3 63 64 58
3 58 64 59
3 64 65 59
3 120 60 54
3 121 59 65
3 60 66 61
3 66 67 61
3 61 67 62
3 67 68 62
3 62 68 63
3 68 69 63
3 63 69 64
3 69 70 64
3 64 70 65
3 70 71 65
3 120 66 60
3 121 65 71
3 66 72 67
3 72 73 67
3 67 73 68
3 73 74 68
3 68 74 69
3 74 75 69
3 69 75 70
3 75 76 70
3 70 76 71
3 76 77 71
3 120 72 66
3 121 71 77
3 72 78 73
3 78 79 73
3 73 79 74
3 79 80 74
3 74 80 75
3 80 81 75
3 75 81 76
3 81 82 76
3 76 82 77
3 82 83 77
3 120 78 72
3 121 77 83
3 78 84 79
3 84 85 79
3 79 85 80
3 85 86 80
3 80 86 81
3 86 87 81
3 81 87 82
3 87 88 82
3 82 88 83
3 88 89 83
3 120 84 78
3 121 83 89
3 84 90 85
3 90 91 85
3 85 91 86
3 91 92 86
3 86 92 87
3 92 93 87
3 87 93 88
3 93 94 88
3 88 94 89
3 94 95 89
3 120 90 84
3 121 89 95
3 90 96 91
3 96 97 91
3 91 97 92
3 97 98 92
3 92 98 93
3 98 99 93
3 93 99 94
3 99 100 94
3 94 100 95
3 100 101 95
3 120 96 90
3 121 95 101
3 96 102 97
3 102 103 97
3 97 103 98
3 103 104 98
3 98 104 99
3 104 105 99
3 99 105 100
3 105 106 100
3 100 106 101
3 106 107 101
3 120 102 96
3 121 101 107
3 102 108 103
3 108 109 103
3 103 109 104
3 109 110 104
3 104 110 105
3 110 111 105
3 105 111 106
3 111 112 106
3 106 112 107
3 112 113 107
3 120 108 102
3 121 107 113
3 108 114 109
3 114 115 109
3 109 115 110
3 115 116 110
3 110 116 111
3 116 117 111
3 111 117 112
3 117 118 112
3 112 118 113
3 118 119 113
3 120 114 108
3 121 113 119
3 114 0 115
3 0 1 115
3 115 1 116
3 1 2 116
3 116 2 117
3 2 3 117
3 117 3 118
3 3 4 118
3 118 4 119
3 4 5 119
3 120 0 114
3 121 119 5
