OFF
1000 1996 0
4.39442205429077 -0.331508010625839 0.134477004408836
4.54863786697388 -0.090769000351429 0.446359992027283
4.085364818573 -0.0666389986872673 0.445181995630264
4.04564189910889 -0.239915996789932 0.134477004408836
3.66982197761536 -0.291909992694855 0.185870006680489
4.07666683197021 0.13858200609684 0.68513697385788
5.12203693389893 -0.483752995729446 0.097071997821331
4.04564189910889 -0.239915996789932 -0.103053003549576
4.75930595397949 -0.438434988260269 -0.0656469985842705
5.96482181549072 -0.925824999809265 -0.020847000181675
5.74149322509766 -0.632484972476959 0.282573997974396
5.19827699661255 -0.464367002248764 0.258156001567841
5.19827699661255 -0.464367002248764 -0.22673200070858
6.30463790893555 -0.952485024929047 0.23233300447464
6.09378385543823 -0.505834996700287 0.383949011564255
5.3654580116272 -0.384968012571335 0.416521996259689
4.98977613449097 -0.231428995728493 0.534811973571777
4.8607349395752 0.0706430003046989 0.80877298116684
4.66535091400146 0.145232006907463 0.848650991916656
4.29380083084106 0.301602989435196 0.816073000431061
5.28987216949463 0.0992259979248047 0.589179992675781
5.10667085647583 0.500006973743439 1.04956495761871
5.29086923599243 0.292863994836807 0.8210089802742
4.44081211090088 0.824163973331451 1.11706495285034
5.4819450378418 0.593598008155823 0.834249973297119
5.13025808334351 0.877397000789642 1.06240403652191
5.04316377639771 0.765170991420746 1.14420402050018
5.96628379821777 -0.0511780008673668 0.572335004806519
6.18393278121948 0.119805999100208 0.576722979545593
6.02008390426636 0.464262008666992 0.632950007915497
5.70517015457153 0.209965005517006 0.674154996871948
6.01270914077759 -0.363830000162125 0.478852987289429
5.38469791412354 0.206420004367828 0.702556014060974
6.46709299087524 -0.483922988176346 0.49898299574852
6.55919504165649 -0.430853992700577 0.533425986766815
6.41048192977905 -0.946574985980988 0.323596000671387
6.51306486129761 -0.942883014678955 0.311700999736786
5.45135021209717 1.06767404079437 0.912496984004974
6.32680892944336 -1.14760601520538 0.116645000874996
6.70609617233276 -0.982971012592316 -0.0426919981837273
6.87716484069824 -0.314006000757217 0.098241001367569
6.73905420303345 -0.269012987613678 0.376688003540039
6.77534294128418 -0.784030973911285 0.128759995102882
6.70419788360596 0.123902998864651 0.380073994398117
6.58667087554932 -0.067111000418663 0.461955994367599
6.25270795822144 0.496470004320145 0.570362985134125
6.45281887054443 -1.15430402755737 -0.0426919981837273
6.79315614700317 -0.541840016841888 -0.0973350033164024
6.1456618309021 -0.976683974266052 0.0792530030012131
6.30860710144043 -1.15973794460297 -0.0228499993681908
6.93760108947754 -0.0978749990463257 0.280173003673554
7.2520170211792 0.25059500336647 -0.00848800037056208
7.22582101821899 0.302612990140915 0.074193999171257
6.87627220153809 -0.269048005342484 -0.217767998576164
6.68949890136719 0.198691993951798 0.280957013368607
6.0225419998169 1.26628398895264 0.121486999094486
6.0858907699585 0.889174997806549 0.51324200630188
6.46313095092773 0.432819008827209 0.32539901137352
6.45073699951172 0.464325994253159 -0.108989998698235
6.08483600616455 1.09932804107666 -0.167991995811462
6.28643608093262 -0.964617013931274 -0.138538002967835
5.1551079750061 1.13189899921417 1.02340304851532
5.09121894836426 1.78726899623871 1.03358495235443
4.9315619468689 1.31698405742645 1.18294298648834
6.61948394775391 0.243399992585182 -0.259317994117737
5.6640157699585 1.55501997470856 0.874998986721039
5.9568247795105 1.26660203933716 0.801276028156281
5.97323894500732 1.68315303325653 0.410861998796463
5.96646308898926 1.63178098201752 0.679965972900391
6.04891920089722 1.27639997005463 0.563440024852753
5.81053590774536 1.57426500320435 0.0665600001811981
5.79439210891724 1.71732902526855 0.281634986400604
5.8969349861145 1.45327997207642 -0.168723002076149
4.80751609802246 0.864476025104523 1.1415890455246
4.06016778945923 0.981593012809753 1.07462596893311
3.94429802894592 0.853266000747681 0.9845370054245
4.47080612182617 0.917909026145935 1.20793795585632
4.08077478408813 1.15278005599976 1.33097100257873
3.71948194503784 0.346536010503769 0.864342987537384
5.68757677078247 2.10785293579102 0.787293970584869
5.27650499343872 2.13223600387573 0.809778988361359
5.68997097015381 2.02863192558289 0.874607980251312
4.95892906188965 2.16997289657593 0.891871988773346
5.0176100730896 2.03772401809692 1.02582502365112
5.23421382904053 2.18378305435181 0.278726994991302
4.76180601119995 2.36845803260803 0.119695000350475
5.35828018188477 2.05113101005554 0.0866520032286644
5.35828018188477 2.05113101005554 -0.0552279986441135
4.69095993041992 2.12450289726257 1.20872604846954
4.75653076171875 1.10400402545929 1.36623799800873
4.78361511230469 1.31788301467896 1.38839101791382
4.65664577484131 1.64662802219391 1.4313839673996
4.39380407333374 1.94183897972107 1.64038503170013
4.67754316329956 0.941513001918793 1.22848999500275
4.60393381118774 1.11472499370575 1.86191296577454
5.73106908798218 1.1888610124588 0.874100983142853
4.59162902832031 1.41777801513672 1.78480398654938
4.19332885742188 1.91516494750977 1.98041605949402
3.95277905464172 2.32832598686218 1.99264299869537
4.06960201263428 2.05596494674683 2.11520791053772
4.15662622451782 2.52312707901001 1.59563899040222
3.81746006011963 2.94836497306824 1.90746402740478
3.83567810058594 2.62323999404907 2.08527803421021
5.74510288238525 2.09970688819885 0.631852984428406
3.76773500442505 3.3347179889679 1.65036797523498
4.39040613174438 2.31861090660095 1.41054904460907
5.58758878707886 2.02123808860779 0.336683005094528
4.22176790237427 2.86872291564941 1.00738298892975
4.00162696838379 3.17171502113342 1.12095999717712
3.71597599983215 3.67807388305664 1.26965296268463
3.64910006523132 3.97075295448303 -0.0500679984688759
3.89615702629089 3.35354089736939 -0.698983013629913
3.64838409423828 4.0611891746521 -0.301272004842758
3.89615702629089 3.35354089736939 0.730408012866974
4.07367277145386 3.06576991081238 0.497790008783341
4.43254899978638 2.62443590164185 -0.442667990922928
4.07367277145386 3.06576991081238 -0.46636500954628
4.43254899978638 2.62443590164185 0.474092990159988
4.59333610534668 2.39582991600037 1.06593203544617
5.84011316299438 1.75802397727966 0.84264600276947
6.76369714736938 2.43733501434326 0.802924990653992
6.30325889587402 1.86200797557831 0.527459979057312
6.75974798202515 2.26779294013977 0.755226016044617
7.21811008453369 2.48063993453979 0.612645983695984
7.12019014358521 2.62806391716003 0.726445972919464
6.76368522644043 2.2662410736084 0.570962011814117
6.13508176803589 2.03805708885193 0.466699987649918
5.84468221664429 1.96945297718048 0.417263001203537
3.7349169254303 3.84112691879273 0.871073007583618
7.37168979644775 2.74449491500854 0.594447016716003
3.7344560623169 1.57733798027039 1.58579802513123
4.10685920715332 1.83545696735382 2.02155590057373
3.63331604003906 1.79025495052338 1.63676404953003
4.09537410736084 1.45472395420075 1.77853405475616
4.33553314208984 1.63512301445007 2.07932496070862
3.25106191635132 2.01354098320007 1.43899405002594
3.29714894294739 1.57461595535278 1.51106202602386
3.50976991653442 2.18295502662659 1.54850697517395
3.93030691146851 2.20814204216003 2.00497698783875
3.48494505882263 2.27526593208313 1.44589495658874
3.66057801246643 2.96892309188843 1.9224259853363
3.71295499801636 2.68993592262268 1.98752200603485
3.44340491294861 2.45785307884216 1.36474204063416
3.5662829875946 2.99816489219665 1.62222099304199
3.4065260887146 2.69841909408569 1.11973094940186
3.68905901908875 3.27631306648254 1.77359700202942
3.51778101921082 3.33791089057922 1.28539299964905
3.38587307929993 2.89964699745178 0.628802001476288
3.5985860824585 3.76863098144531 1.20687401294708
3.51419901847839 3.53063607215881 0.793595016002655
3.63128590583801 3.89209699630737 0.809078991413116
3.08267998695373 2.71362400054932 0.174301996827125
3.17857909202576 2.59632992744446 0.561679005622864
3.32945489883423 3.01304602622986 0.16007399559021
3.55837392807007 3.97894501686096 0.0814919993281364
4.54597997665405 1.29374396800995 2.01238298416138
4.4429988861084 1.509516954422 1.94940805435181
3.13837695121765 2.22655701637268 1.21241497993469
2.20263004302979 2.74574398994446 0.667667984962463
0.928902983665466 3.35904288291931 0.223643004894257
-0.00398000003769994 3.39334106445313 0.587700009346008
1.68020296096802 3.13623905181885 0.2396370023489
2.30311703681946 2.88750505447388 -0.208212003111839
1.68020296096802 3.13623905181885 -0.208212003111839
2.30311703681946 2.88750505447388 0.2396370023489
2.74800491333008 2.54060411453247 0.881066977977753
0.873403012752533 2.76057410240173 1.10607695579529
2.13031792640686 2.42683410644531 1.07741296291351
-0.797178983688354 3.75038194656372 0.180353999137878
-0.803086996078491 3.56698894500732 0.54441100358963
0.928902983665466 3.35904288291931 -0.192218005657196
-0.797178983688354 3.75038194656372 -0.148928999900818
0.00255899992771447 3.04671907424927 1.00246798992157
-2.07455396652222 3.67348909378052 0.449117004871368
-1.50882697105408 3.84974503517151 0.180353999137878
-2.09333896636963 3.86484909057617 0.154607996344566
-1.50882697105408 3.84974408149719 -0.148928999900818
-1.39237904548645 3.31820011138916 0.88154000043869
-0.705424010753632 3.22680497169495 0.951088011264801
-2.57848191261292 3.78492093086243 0.154607996344566
-3.11933493614197 3.61118888854981 0.129359006881714
-3.06970691680908 3.44934701919556 0.390432000160217
-2.09333896636963 3.86484909057617 -0.123182997107506
-2.57848191261292 3.78492093086243 -0.123182997107506
-2.36949300765991 3.38286995887756 0.731194019317627
-1.91519200801849 3.4332799911499 0.764630973339081
-3.79830598831177 3.2841899394989 0.129359006881714
-3.11933493614197 3.61118888854981 -0.0979340001940727
-3.79830598831177 3.2841899394989 -0.0979340001940727
-3.2983090877533 2.93278098106384 0.749481976032257
-2.75331401824951 3.17037105560303 0.817041993141174
-5.01703500747681 2.27415704727173 0.158920004963875
-5.85246276855469 2.17070007324219 0.0520180016756058
-5.7317681312561 1.92289996147156 0.12788200378418
-5.13773107528687 2.52195692062378 0.0830560028553009
-4.45925998687744 2.90678596496582 -0.0516319982707501
-5.85246276855469 2.17070007324219 -0.0205930005759001
-4.27565717697144 2.83435392379761 0.276569008827209
-4.93574094772339 2.07745409011841 0.342460006475449
-3.82109808921814 2.6740128993988 0.734418988227844
-6.55856895446777 1.93301904201508 0.0520180016756058
-7.27801513671875 1.76694703102112 -0.0321630015969276
-6.36288690567017 1.286985039711 0.337253987789154
-5.66577386856079 1.70126295089722 0.235939994454384
-7.18418884277344 1.53450894355774 0.132945999503136
-7.98014307022095 1.61667501926422 0.0635880008339882
-7.98014307022095 1.61667501926422 -0.0321630015969276
-7.86962795257568 1.30478799343109 0.26715898513794
-7.09719181060791 1.16684603691101 0.322194010019302
-7.92076301574707 1.48049199581146 0.185730993747711
-9.45693302154541 1.46772003173828 0.0654719993472099
-9.954345703125 1.35915398597717 0.0413429997861385
-9.8477725982666 1.15214598178864 0.14648100733757
-10.2997779846191 1.06324398517609 -0.00991899985820055
2.08764100074768 1.99099695682526 1.4483540058136
0.789361000061035 2.31438088417053 1.47842001914978
0.1807049959898 2.54166507720947 1.45747494697571
-0.527276992797852 2.72175002098084 1.40609502792358
-1.19275200366974 2.83726906776428 1.3946750164032
-1.71556496620178 2.95234894752502 1.27776598930359
-2.09938597679138 2.73985004425049 1.36361300945282
-2.91989302635193 2.48167204856873 1.45476603507996
-3.44268107414246 2.22290301322937 1.43970394134522
-4.54939317703247 2.00761604309082 0.749870002269745
-4.79198789596558 1.74943196773529 0.770385026931763
-5.16474485397339 1.60491704940796 0.542167007923126
-5.65218305587769 1.4869099855423 0.415132999420166
-9.45693302154541 1.46772003173828 -0.0340470001101494
-8.5873556137085 1.12322199344635 0.272321999073029
2.60055994987488 1.50068402290344 1.56245398521423
2.86955189704895 1.14353001117706 1.55444204807281
3.14932608604431 0.964217007160187 1.36690104007721
1.97207403182983 1.51225101947784 1.71449100971222
1.34624302387238 1.64054298400879 1.75552701950073
1.36744797229767 1.12142503261566 1.88870704174042
-10.2575092315674 0.854331016540527 0.0404240004718304
1.1132709980011 1.10979104042053 1.89272201061249
1.09206604957581 1.62890899181366 1.75954294204712
0.995414018630981 1.14596903324127 1.81780505180359
2.74353289604187 1.7503490447998 1.57204902172089
1.42185997962952 0.487145006656647 1.92129504680634
0.735503017902374 -0.436798989772797 1.60877597332001
0.872922003269196 -0.306832998991013 1.72713899612427
0.712080001831055 0.18894399702549 1.68680894374847
1.01353704929352 0.671015977859497 1.86301505565643
0.401446014642716 0.257560014724731 1.68628597259522
0.585047006607056 0.77581000328064 1.78757500648498
0.0719280019402504 0.932982981204987 1.87008798122406
-0.621569991111755 0.310083985328674 1.72906494140625
-1.74475800991058 1.4642219543457 1.90377295017242
-0.441033005714417 1.61201298236847 1.88988900184631
-0.439918011426926 2.16506290435791 1.72816896438599
-1.10539305210114 2.28058195114136 1.7167489528656
0.179790005087853 2.04485607147217 1.71930801868439
0.1786749958992 1.49180495738983 1.88102698326111
0.691793978214264 1.33463203907013 1.79851400852203
-0.232877001166344 -0.124246999621391 1.58740198612213
-1.07348394393921 0.00746299978345633 1.58991503715515
-0.684211015701294 -0.47902500629425 1.24062895774841
0.465241998434067 -0.392805010080338 1.38642704486847
0.472059011459351 -0.173847004771233 1.54078805446625
-0.749965012073517 -0.609604001045227 1.0136890411377
-1.20281505584717 -0.152575999498367 1.41075503826141
-1.74665701389313 -0.489199995994568 1.18410694599152
3.09140396118164 0.394122004508972 1.36260998249054
2.99226307868958 0.866890013217926 1.50448095798492
2.44294190406799 0.189219996333122 1.8201630115509
2.65823602676392 -0.16261799633503 1.65377795696259
3.04249811172485 -0.373001992702484 0.981245994567871
2.9967930316925 -0.181597992777824 1.26040995121002
2.75126004219055 -0.458445012569427 1.43562602996826
2.44944405555725 -0.863951027393341 1.2881840467453
2.43748998641968 -0.696653008460999 1.5733699798584
1.71718204021454 -1.11718595027924 1.73791003227234
1.76175796985626 -1.29688894748688 1.51190900802612
1.59215104579925 -0.229808002710342 1.96530795097351
1.90494704246521 0.119001999497414 1.96903705596924
1.64088594913483 0.360092997550964 1.96540498733521
1.36763095855713 -0.0832069963216782 1.86418294906616
1.96700894832611 0.786024987697601 1.89468896389008
2.23107004165649 0.544933021068573 1.89832103252411
2.50999307632446 -1.11745297908783 0.318489998579025
2.76752996444702 -0.793169021606445 0.782091021537781
2.13501596450806 -1.21635699272156 0.990485012531281
1.91893100738525 -1.43344604969025 0.262625992298126
1.86404800415039 -1.36105394363403 0.934620022773743
1.68885099887848 -1.51433801651001 0.5782870054245
1.39014995098114 -1.49045896530151 0.15684999525547
1.35318100452423 -1.59744203090668 0.663340985774994
1.02196502685547 -1.43420195579529 0.405739009380341
0.698198020458221 -1.35123205184937 0.195752993226051
0.176862001419067 -0.702316999435425 1.03110194206238
0.0245040003210306 -1.10888302326202 0.237984001636505
-0.320376992225647 -0.870355010032654 0.655798971652985
-0.333806991577148 -1.05056297779083 0.237984001636505
-1.8874340057373 -0.772979974746704 0.782321989536285
-2.10216903686523 -0.975215971469879 0.339121997356415
-2.04707908630371 -0.735850989818573 0.952229976654053
-2.7026948928833 -0.973276972770691 0.332154005765915
-2.53804302215576 1.89375495910645 1.83649003505707
-1.71753597259522 2.15193390846252 1.74533796310425
-4.09099817276001 -0.441857010126114 0.504302978515625
-4.16193103790283 -0.421007990837097 0.876196980476379
-4.41112899780273 -0.120021998882294 0.444207012653351
-4.15723419189453 -0.395527005195618 0.110715001821518
-3.866544008255 -0.594045996665955 -0.0792910009622574
-4.54250478744507 -0.216809004545212 0.0614329986274242
-4.71521282196045 -0.0181770008057356 0.221391007304192
-5.08268880844116 0.0242849998176098 0.0843589976429939
-5.68446922302246 0.0821209996938705 0.074414998292923
-4.81243085861206 0.523069024085999 0.656376004219055
-5.07571697235107 0.520220994949341 0.478727012872696
-4.54110717773438 0.401524990797043 0.867307007312775
-4.33046197891235 -0.0546699985861778 0.866667985916138
-4.15887689590454 1.54837298393249 1.29239904880524
-3.4254310131073 1.72729802131653 1.70792198181152
-4.5764479637146 0.85835599899292 0.987141013145447
-4.25173091888428 0.575703978538513 1.35575294494629
-4.73405599594116 1.46224904060364 0.852276027202606
-3.47695398330689 -0.790260016918182 0.130059003829956
-3.06647992134094 -0.881339013576508 0.367390006780624
-3.62021994590759 -0.714945018291473 0.350111991167068
-1.63157904148102 -0.0636710003018379 1.55578804016113
-2.14384794235229 0.166710004210472 1.99859797954559
-1.67496800422669 0.206165999174118 1.78388500213623
-1.5643960237503 0.968272984027863 1.9139130115509
-5.10681200027466 1.31773400306702 0.62405800819397
-3.00536108016968 0.784381985664368 2.08355498313904
-2.36024808883667 0.717688977718353 2.03344202041626
-2.88252592086792 1.50001001358032 1.91683602333069
-3.98263001441956 1.00234496593475 1.5351870059967
-3.54826593399048 1.01166903972626 1.87463998794556
-3.5375189781189 0.513054013252258 1.97918605804443
-3.97188401222229 0.503729999065399 1.6397340297699
-3.91926789283752 0.188477993011475 1.60330605506897
-3.61619091033936 -0.239188000559807 2.0855278968811
-6.34112501144409 1.01254105567932 0.416173994541168
-5.63042020797729 1.21246600151062 0.49405300617218
-2.17215394973755 -0.562542974948883 1.52270102500916
-2.36631107330322 -0.213598996400833 1.93918597698212
-2.58000707626343 -0.881883978843689 1.84502303600311
-2.91488909721375 -0.540835976600647 2.2432599067688
-2.66015696525574 0.0457050018012524 2.12362408638
-3.14168906211853 0.360781997442245 2.15954494476318
-8.44253730773926 0.839873015880585 0.302064001560211
-1.16753101348877 0.97198897600174 1.87681198120117
-9.80127906799316 0.856191992759705 0.142802000045776
-5.06952619552612 0.908930003643036 0.617588996887207
-5.59313297271729 0.803663015365601 0.487583994865417
-7.08195877075195 0.688417017459869 0.401643991470337
-5.60176420211792 0.52157998085022 0.415302991867065
-6.34944677352905 0.447800010442734 0.379029005765915
3.38035106658936 1.25766098499298 1.31920397281647
-8.6640796661377 0.385598003864288 0.0643040016293526
-7.94751977920532 0.309385001659393 0.196051001548767
-7.20883703231812 0.0650660023093224 0.0758169963955879
-6.41021203994751 0.121726997196674 0.171673998236656
-5.70707511901855 -0.00691600004211068 0.0514900013804436
-3.26796388626099 -1.26028800010681 2.35658001899719
-3.38668990135193 -0.351363986730576 2.26297497749329
-3.69825410842896 -2.0398850440979 2.4864399433136
-3.45698809623718 -2.06250190734863 2.43976998329163
-3.94786500930786 -1.98733603954315 2.38933706283569
-3.96647596359253 -0.479146003723144 1.85397696495056
-4.16287088394165 -1.93831098079681 2.21703791618347
-4.30510711669922 -1.93868899345398 1.98960101604462
-4.17163181304932 -0.53474098443985 1.31476998329163
-4.31292676925659 -1.9816859960556 1.76921200752258
-4.23793601989746 -2.05048608779907 1.56901502609253
-4.14334487915039 -1.17897295951843 1.33037400245667
-3.99454498291016 -1.2645959854126 1.14349901676178
-4.04784202575684 -2.87247490882873 1.61149895191193
-3.86371803283691 -2.90700793266296 1.55759298801422
-3.74110293388367 -1.35522902011871 1.09754598140717
-3.30521893501282 -1.49400401115418 1.18938994407654
-3.55541205406189 -2.27925205230713 1.43428099155426
-3.09931898117065 -1.56177699565887 1.40980899333954
-3.07612204551697 -1.69889295101166 1.82200801372528
-3.23874306678772 -2.31006002426148 1.96627795696259
-3.34951305389404 -2.34702396392822 1.65470099449158
-2.96883702278137 -1.03154599666596 2.17118406295776
-2.91948008537292 -1.29511594772339 1.98688304424286
-2.74460196495056 -1.18899297714233 1.97078001499176
-2.64973092079163 -1.14151501655579 1.72785604000092
-2.91075897216797 -1.33726799488068 1.78805005550384
-2.93395709991455 -1.20015203952789 1.3758510351181
-2.50217700004578 -0.88975602388382 1.39626002311706
-2.73098397254944 -0.719051003456116 2.12728500366211
-3.93819403648377 -3.33410596847534 2.64408493041992
-3.79172992706299 -2.75470900535584 2.6317720413208
-4.19740295410156 -2.68777298927307 2.34921407699585
-4.14144802093506 -3.33259892463684 2.21932101249695
-4.28012323379517 -2.68626594543457 2.14779901504517
-4.28794288635254 -2.72926306724548 1.92741000652313
-4.06420707702637 -3.3698410987854 1.86862301826477
-4.22317886352539 -2.76650500297546 1.76633703708649
-3.80101490020752 -3.40437388420105 1.73528099060059
-3.60997200012207 -2.93917107582092 1.62365198135376
-3.41232895851135 -3.42347097396851 1.71289694309235
-3.44963502883911 -2.95826697349548 1.64867103099823
-3.21687388420105 -3.37910509109497 1.79209399223328
-3.31766295433044 -3.578537940979 1.76314103603363
-2.96054911613464 -3.5752010345459 1.85301601886749
-3.11806106567383 -3.64501595497131 2.19970607757568
-3.16780400276184 -3.64501595497131 2.50174498558044
-3.43238711357117 -3.64501595497131 2.65774297714233
-3.61825203895569 -3.64501595497131 2.56568908691406
-3.72630906105042 -3.64501595497131 2.15271401405335
-3.41889190673828 -3.64501595497131 2.02587509155273
-3.14907002449036 -3.31386494636536 2.80238795280457
-3.36795806884766 -3.58120799064636 2.94422793388367
-3.10425209999085 -3.57874798774719 2.90331292152405
-3.97065901756287 -0.734788000583649 0.904109001159668
-4.11945915222168 -0.649164974689484 1.09098398685455
-4.123703956604 -0.161199003458023 1.36401998996735
-3.20850706100464 -1.01778197288513 0.925127983093262
-3.64439105987549 -0.879006028175354 0.833284974098206
-3.93489789962769 -0.146210998296738 1.66454100608826
-3.63670706748962 -0.512210011482239 2.13235092163086
-3.2365300655365 -2.25107407569885 2.22410202026367
-3.07390999794006 -1.63990795612335 2.07983303070068
-3.31229090690613 -2.17855191230774 2.34732389450073
-3.10645294189453 -3.37576699256897 1.79546105861664
-3.22175097465515 -2.81972599029541 2.28658199310303
-2.99342203140259 -3.34900307655335 1.9614429473877
-2.7838249206543 -1.02152800559998 1.11633396148682
-2.69059705734253 -0.92144501209259 0.808311998844147
-2.2631459236145 -0.763032972812653 1.18408799171448
-3.29751205444336 -2.74720406532288 2.40980291366577
-2.95256996154785 -3.34117794036865 2.31980609893799
-2.99605488777161 -3.38254904747009 2.6878399848938
-3.34097909927368 -2.74999094009399 2.54963803291321
-3.42022609710693 -3.38964509963989 2.87109589576721
-3.55046391487122 -2.77732706069946 2.58510208129883
1.54481303691864 -1.53075695037842 1.56819498538971
1.20896196365356 -1.13363599777222 1.99045598506927
0.861415982246399 -1.19523298740387 2.07270789146423
0.863370001316071 -0.591048002243042 1.83548104763031
0.812775015830994 -0.874468982219696 1.92509400844574
0.389329999685287 -0.791208982467651 1.07600700855255
0.421802997589111 -1.15749597549438 1.49454998970032
0.457524001598358 -1.21878099441528 1.76624500751495
0.562709987163544 -0.970229029655457 1.74418604373932
0.807761013507843 -1.64076495170593 2.03978395462036
0.56317800283432 -1.24953103065491 1.91309404373169
2.11757802963257 -0.117992997169495 1.93138897418976
2.33287191390991 -0.469830989837646 1.76500499248505
1.17207598686218 -1.61434495449066 1.86704897880554
1.07606101036072 -2.09225702285767 2.0623369216919
1.30128395557404 -2.31898498535156 1.8444139957428
1.34811401367188 -2.34477996826172 1.63962304592133
1.40796196460724 -1.82459104061127 1.59679305553436
1.3476550579071 -2.35902190208435 1.39914894104004
1.32548999786377 -1.94283699989319 1.01347494125366
1.54487502574921 -1.6785900592804 1.27421700954437
3.25551700592041 -0.012431999668479 1.10803997516632
2.98026394844055 -0.7325119972229 0.242972999811173
1.43985795974731 -1.72668898105621 0.950896978378296
0.975318014621735 -1.49667394161224 0.596569001674652
1.20641803741455 -1.72612500190735 0.752641022205353
0.874485015869141 -1.78707003593445 0.827314019203186
0.652354001998901 -1.67374205589294 0.944938004016876
0.471190005540848 -1.44144105911255 1.23974394798279
0.465591013431549 -1.00783896446228 0.91991001367569
0.706430017948151 -1.31171894073486 0.697525024414063
1.1120400428772 -2.1151340007782 0.967124998569489
3.28328895568848 -0.516726016998291 0.185870006680489
3.66092705726623 0.00217300001531839 0.769656002521515
0.873322010040283 -2.20595908164978 1.07908999919891
1.03765797615051 -2.59503388404846 1.08433794975281
0.808750987052917 -2.82200002670288 0.936924993991852
0.458236008882523 -1.88366794586182 1.30703198909759
2.50999307632446 -1.11745297908783 -0.287066012620926
0.417668998241425 -2.40581393241882 1.31533694267273
0.6407830119133 -2.13613295555115 1.16970098018646
0.609458029270172 -2.43491506576538 1.05931103229523
0.384876012802124 -2.17093706130981 1.57874298095703
0.621712982654572 -1.93934595584869 1.99863696098328
1.6791729927063 -1.46982705593109 -0.231200993061066
1.91893100738525 -1.43344604969025 -0.231200993061066
0.407638013362885 -2.8019449710846 1.56879794597626
0.536939978599548 -3.36215400695801 1.63042294979096
0.496414005756378 -2.79091310501099 1.83475494384766
0.575525999069214 -3.37218689918518 1.36559700965881
0.446224987506867 -2.81197690963745 1.30397200584412
0.638014018535614 -2.84107804298401 1.04794597625732
0.678758978843689 -3.37218689918518 1.07460403442383
0.586875975131989 -2.82447290420532 2.00776100158691
0.679300010204315 -3.39571404457092 2.0497579574585
0.910894989967346 -3.38904094696045 2.210205078125
0.706606984138489 -2.55202007293701 1.98203802108765
1.00158500671387 -3.23196911811829 2.21170806884766
1.04452097415924 -2.73135304450989 2.03809690475464
1.21182799339294 -2.9753270149231 2.02953791618347
1.15185499191284 -3.26806998252869 2.18627190589905
1.5314439535141 -3.36945104598999 1.96126997470856
0.885655999183655 -3.56570792198181 2.17653107643127
1.40988504886627 -3.56552696228027 2.05348992347717
1.02687799930573 -1.48408901691437 -0.12542499601841
0.365449011325836 -1.23082602024078 -0.164327993988991
-0.333806991577148 -1.05056297779083 -0.206560000777245
-2.10216903686523 -0.975215971469879 -0.307696998119354
1.33025300502777 -3.00940990447998 1.80561804771423
1.68070304393768 -3.48281598091125 1.72227799892425
1.63510596752167 -3.47526597976685 1.49023997783661
1.2389999628067 -2.95787906646729 1.29915904998779
1.00441205501556 -2.91229391098023 1.05256104469299
0.849494993686676 -3.35310888290405 0.963582992553711
-2.33033394813538 -1.05422902107239 -0.063398003578186
-2.7026948928833 -0.973276972770691 -0.300729990005493
1.45981001853943 -3.64501595497131 1.71433901786804
0.750432014465332 -3.64501595497131 1.67083394527435
0.853663980960846 -3.64501595497131 1.37984001636505
1.28047597408295 -3.38529205322266 0.92483001947403
1.41731905937195 -3.58099794387817 0.961131989955902
0.946677029132843 -3.57978105545044 0.9548100233078
1.55962800979614 -3.64501595497131 1.45058298110962
1.11051201820373 -3.64501595497131 1.1796760559082
1.43962001800537 -3.64501595497131 1.20327496528626
-5.10529518127441 -0.064751997590065 -0.0300079993903637
-4.19911479949951 0.26045298576355 1.31932604312897
-1.53010499477386 0.406556993722916 1.76271402835846
3.8014440536499 3.12471795082092 1.93603897094727
3.77140188217163 3.58463311195373 1.55758500099182
3.69742488861084 3.8809130191803 1.12442004680634
-7.10177278518677 0.495516002178192 0.380320996046066
3.62110996246338 4.0636510848999 0.332697004079819
-7.91352415084839 0.446673989295959 0.288240998983383
-10.2480335235596 0.903670012950897 -0.0372430011630058
-8.6640796661377 0.385598003864288 -0.032880000770092
-7.20883703231812 0.0650660023093224 -0.0443920008838177
1.79038405418396 -3.65581703186035 1.27977097034454
1.58378505706787 -3.4697949886322 1.22505903244019
-6.45818901062012 -0.00969399977475405 -0.0200650002807379
1.84344601631165 -3.6488881111145 1.54881501197815
1.73041200637817 -3.61370205879211 1.80650401115418
1.70884394645691 -3.66895508766174 2.04453992843628
-2.94604706764221 -3.61952090263367 2.93464088439941
-2.91228890419006 -3.66266798973084 2.85488510131836
-2.90751791000366 -3.57847809791565 2.65484094619751
-2.74252796173096 -3.62517094612122 2.51069307327271
-2.93643498420715 -3.4046630859375 2.41774988174439
-2.70392489433289 -3.62279796600342 2.20821809768677
-2.84000897407532 -3.58845090866089 2.02462792396545
-2.7890989780426 -3.62027406692505 1.86393404006958
1.62576901912689 -3.6419939994812 0.984457015991211
1.28047597408295 -3.38529205322266 -0.893405020236969
1.51133394241333 -3.54263710975647 -0.877780973911285
1.57344901561737 -3.4208550453186 -1.24229896068573
-2.96054911613464 -3.5752010345459 -1.82159101963043
-2.8906569480896 -3.51902508735657 -1.75895702838898
-3.31153988838196 -3.22403693199158 -1.71042501926422
-2.91802191734314 -3.42417311668396 -1.98462605476379
-2.70392489433289 -3.62279796600342 -2.17679309844971
-2.93253898620606 -3.40309810638428 -2.34853601455689
-2.96795511245727 -3.38358592987061 -2.59892892837524
-2.74252796173096 -3.62517094612122 -2.47926807403565
-2.87536311149597 -3.65193700790405 -2.57572388648987
-2.82784700393677 -3.65037298202515 -2.27307105064392
-2.92769694328308 -3.52057695388794 -2.83285903930664
-3.05448603630066 -3.31039810180664 -2.681067943573
-3.16269397735596 -3.38732409477234 -2.82319903373718
1.5067709684372 -3.41632509231567 -1.98207604885101
1.70884394645691 -3.66895508766174 -2.01311492919922
1.40988504886627 -3.56552696228027 -2.02206492424011
1.25738704204559 -2.46469807624817 1.17149996757507
1.19336795806885 -2.77063894271851 1.97259604930878
1.2294340133667 -2.75773191452026 1.58887302875519
1.1540299654007 -2.71818399429321 1.26571905612946
3.61576390266419 3.92251801490784 -0.654229998588562
3.70757389068604 3.8865430355072 -0.752124011516571
3.69742488861084 3.8809130191803 -1.09299504756927
3.62592792510986 3.72321510314941 -1.26297295093536
3.72661709785461 3.61848306655884 -1.3303279876709
0.449153989553451 -2.39446091651917 1.82134294509888
3.77140188217163 3.58463311195373 -1.52616000175476
3.68776392936707 3.35091090202332 -1.68059396743774
3.76903009414673 3.26011896133423 -1.68052101135254
3.8014440536499 3.12471795082092 -1.90461397171021
3.6986129283905 2.90598607063294 -1.9111750125885
3.84407091140747 3.01981592178345 -1.82439398765564
3.71295499801636 2.68993592262268 -1.95609700679779
3.89008188247681 2.54120707511902 -2.05501508712769
3.8936231136322 2.29512000083923 -1.96946597099304
4.05309915542603 2.18598389625549 -1.95705103874206
4.06960201263428 2.05596494674683 -2.08378291130066
4.06808519363403 1.91150498390198 -1.99404501914978
4.33553314208984 1.63512301445007 -2.04790091514587
4.09537410736084 1.45472395420075 -1.74711000919342
1.1654440164566 -2.94691801071167 1.10997402667999
4.37340307235718 1.3147759437561 -1.89710402488708
4.54597997665405 1.29374396800995 -1.98095905780792
4.60393381118774 1.11472499370575 -1.83048796653748
4.64795780181885 1.1750260591507 -1.82206702232361
3.08267998695373 2.71362400054932 -0.142876997590065
3.66982197761536 -0.291909992694855 -0.154445007443428
3.19339489936829 2.45894598960877 0.952418029308319
2.68687391281128 2.63776707649231 -0.570908010005951
3.69480609893799 1.2445809841156 1.20435702800751
3.29714894294739 1.57461595535278 -1.47963798046112
2.74353289604187 1.7503490447998 -1.54062402248383
3.25106191635132 2.01354098320007 -1.4075700044632
3.66092705726623 0.00217300001531839 -0.738231003284454
3.34983897209167 -0.324642986059189 -0.52436900138855
3.25551700592041 -0.012431999668479 -1.07661604881287
3.686448097229 0.888945996761322 -1.06074595451355
3.71948194503784 0.346536010503769 -0.832917988300323
3.31407189369202 0.331930011510849 -1.17130303382873
3.37199306488037 0.902024984359741 -1.1755930185318
3.69480609893799 1.2445809841156 -1.17293202877045
3.38035106658936 1.25766098499298 -1.28777897357941
3.19339489936829 2.45894598960877 -0.920992970466614
2.74800491333008 2.54060411453247 -0.849641978740692
3.70954489707947 -0.11863300204277 -0.465148985385895
0.946677029132843 -3.57978105545044 -0.92338502407074
0.791227996349335 -3.56570792198181 -2.06497406959534
0.910894989967346 -3.38904094696045 -2.17878103256226
0.985494017601013 -3.59816098213196 -2.14876890182495
1.1654440164566 -2.94691801071167 -1.07854902744293
1.33025300502777 -3.00940990447998 -1.77419304847717
1.62215495109558 -3.42839193344116 -1.50600004196167
1.73041200637817 -3.61370205879211 -1.77507901191711
1.62283301353455 -3.67426109313965 -0.995274007320404
1.43962001800537 -3.64501595497131 -1.17184996604919
-2.81605100631714 -3.66108107566834 -1.83027899265289
-2.96132206916809 -3.66266798973084 -2.88138604164123
1.70212197303772 -3.57889699935913 -2.00500702857971
1.693971991539 -3.60510897636414 -1.46509003639221
1.85941100120544 -3.6488881111145 -1.58612298965454
1.80634796619415 -3.65581703186035 -1.31708002090454
1.04452097415924 -2.73135304450989 -2.00667309761047
1.23627495765686 -3.22666788101196 -2.07242107391357
1.00158500671387 -3.23196911811829 -2.1802830696106
0.586875975131989 -2.82447290420532 -1.97633695602417
0.446224987506867 -2.81197810173035 -1.27254700660706
0.575525999069214 -3.37218689918518 -1.33417201042175
0.678758978843689 -3.37218689918518 -1.04317903518677
-3.41889309883118 -3.64501595497131 -1.99444997310638
-3.12072992324829 -3.14796805381775 -1.95281600952148
0.897305011749268 -1.12202000617981 -2.03812098503113
0.939319014549255 -2.12826991081238 -2.00516390800476
0.604885995388031 -2.19916892051697 -1.96741902828217
0.56317800283432 -1.24953103065491 -1.88166904449463
0.360377997159958 -2.40549206733704 -1.52396094799042
0.421802997589111 -1.15749597549438 -1.46312499046326
0.457524001598358 -1.21878099441528 -1.73482096195221
0.457341998815537 -2.17465591430664 -1.81653702259064
0.442167013883591 -2.1712589263916 -1.30726897716522
0.609458029270172 -2.43491506576538 -1.02788698673248
0.6407830119133 -2.13613295555115 -1.1382759809494
0.656853020191193 -1.84854197502136 -1.10661494731903
0.652354001998901 -1.67374205589294 -0.913513004779816
0.471190005540848 -1.44144105911255 -1.20831894874573
1.10362601280212 -2.46845102310181 -1.00834703445435
0.841996014118195 -2.50473999977112 -0.937276005744934
1.15017199516296 -1.88994002342224 -0.842487990856171
0.874485015869141 -1.78707003593445 -0.795889973640442
0.878983974456787 -1.96186995506287 -0.988991022109985
0.706430017948151 -1.31171894073486 -0.666100025177002
0.465591013431549 -1.00783896446228 -0.888485014438629
1.35318100452423 -1.59744203090668 -0.631915986537933
0.975318014621735 -1.49667394161224 -0.565145015716553
1.54487502574921 -1.6785900592804 -1.24279296398163
1.5866219997406 -1.59800505638123 -0.830172002315521
1.43985795974731 -1.72668898105621 -0.919471979141235
1.2294340133667 -2.75773191452026 -1.55744898319244
1.25738704204559 -2.46469807624817 -1.14007496833801
1.1540299654007 -2.71818399429321 -1.2342940568924
2.67160296440125 2.40422606468201 -0.996936023235321
3.13837695121765 2.22655701637268 -1.18098998069763
1.21899700164795 -2.41573190689087 -1.89603197574616
1.3357470035553 -2.4832661151886 -1.69285905361175
1.19336795806885 -2.77063894271851 -1.94117200374603
0.750432014465332 -3.64501595497131 -1.63940894603729
0.80233097076416 -3.64501595497131 -1.88573801517487
1.43050694465637 -1.89473795890808 -1.30537104606628
1.35232996940613 -2.10143709182739 -1.57688200473785
1.30550003051758 -2.07564091682434 -1.78167295455933
1.17207598686218 -1.61434495449066 -1.83562397956848
1.54481303691864 -1.53075695037842 -1.53676998615265
1.09620499610901 -1.66446602344513 -1.97307503223419
1.14734196662903 -2.22251009941101 -2.00216603279114
0.808750987052917 -2.82200002670288 -0.905499994754791
0.695050001144409 -0.877283990383148 -1.75015103816986
0.562709987163544 -0.970229029655457 -1.71276104450226
0.81504499912262 -1.03140902519226 -1.99271297454834
0.735503017902374 -0.436798989772797 -1.57735204696655
0.404417008161545 -0.989368975162506 -1.22647702693939
0.389329999685287 -0.791208982467651 -1.04458200931549
1.34974694252014 -0.565181970596313 -1.92887103557587
0.680435001850128 -0.967414021492004 -1.85627901554108
1.01257300376892 -0.30433601140976 -1.75352895259857
1.76175796985626 -1.29688894748688 -1.48048400878906
1.3089280128479 -1.3205109834671 -1.80702602863312
-3.74752688407898 -3.35201692581177 -2.72291803359985
-3.55046391487122 -2.77732706069946 -2.55367708206177
-3.42022609710693 -3.38964509963989 -2.83967089653015
-3.34097909927368 -2.74999094009399 -2.51821398735046
-3.22175097465515 -2.81972599029541 -2.25515699386597
-3.29751205444336 -2.74720406532288 -2.37837791442871
-2.69059705734253 -0.92144501209259 -0.776886999607086
-2.50217700004578 -0.88975602388382 -1.36483502388001
-2.2631459236145 -0.763032972812653 -1.15266299247742
-3.38085389137268 -2.84704208374023 -1.72333598136902
-2.91948008537292 -1.29511594772339 -1.9554580450058
-3.2365300655365 -2.25107407569885 -2.19267797470093
-3.31229090690613 -2.17855191230774 -2.31589889526367
-2.96883702278137 -1.03154599666596 -2.1397590637207
-3.96647596359253 -0.479146003723144 -1.8225519657135
-4.123703956604 -0.161199003458023 -1.33259499073029
-3.61619091033936 -0.239188000559807 -2.05410289764404
0.536939978599548 -3.36215400695801 -1.59899795055389
0.58883798122406 -3.36215400695801 -1.84532701969147
-3.64439105987549 -0.879006028175354 -0.801859974861145
-3.20850706100464 -1.01778197288513 -0.893702983856201
-3.66901898384094 -0.751304984092712 -0.568403005599976
-4.21410512924194 -0.306584000587463 -1.06855797767639
-4.15528202056885 -0.49413400888443 -1.52203094959259
-4.17163181304932 -0.53474098443985 -1.28334498405456
-3.97065901756287 -0.734788000583649 -0.872685015201569
-4.16193103790283 -0.421007990837097 -0.84477299451828
-4.11945915222168 -0.649164974689484 -1.05955898761749
-3.36795806884766 -3.58120799064636 -2.91280293464661
-3.72630906105042 -3.64501595497131 -2.1212899684906
-3.73878502845764 -3.64501595497131 -2.31091499328613
-3.61825203895569 -3.64501595497131 -2.534264087677
-3.43238711357117 -3.64501595497131 -2.62631797790527
-3.31766295433044 -3.578537940979 -1.73171699047089
-3.44963502883911 -2.95826697349548 -1.61724603176117
-3.86371803283691 -2.90700793266296 -1.52616894245148
-3.57266592979431 -3.40437388420105 -1.6564530134201
-4.22317790985107 -2.76650500297546 -1.73491203784943
-4.06420707702637 -3.3698410987854 -1.83719801902771
-4.04784202575684 -2.87247490882873 -1.58007395267487
-4.28012323379517 -2.68626594543457 -2.11637401580811
-4.14144802093506 -3.33259892463684 -2.18789601325989
-4.28794288635254 -2.72926306724548 -1.89598500728607
-3.98239707946777 -2.73679804801941 -2.49008893966675
-3.93819403648377 -3.33410596847534 -2.61265993118286
-4.05872678756714 -3.33410596847534 -2.38931202888489
-4.19740295410156 -2.68777298927307 -2.31778907775879
-2.41118502616882 -0.68926602602005 -1.70344805717468
-2.74460196495056 -1.18899297714233 -1.9393550157547
-2.73098397254944 -0.719051003456116 -2.09586095809936
-2.93395709991455 -1.20015203952789 -1.34442603588104
-2.73588109016419 -1.23114395141602 -1.74052202701569
-2.91075897216797 -1.33726799488068 -1.75662505626678
-3.07612204551697 -1.69889295101166 -1.79058301448822
-3.34951305389404 -2.34702396392822 -1.62327599525452
-3.23874306678772 -2.31006002426148 -1.93485295772552
-3.74110293388367 -1.35522902011871 -1.06612205505371
-3.55541205406189 -2.27925205230713 -1.4028559923172
-3.30521893501282 -1.49400401115418 -1.15796494483948
-4.14334487915039 -1.17897295951843 -1.29894995689392
-4.23793601989746 -2.05048608779907 -1.53759002685547
-4.06259918212891 -2.15645599365234 -1.38275098800659
-3.99454498291016 -1.2645959854126 -1.11207497119904
-4.30510711669922 -1.93868899345398 -1.95817601680756
-4.31292676925659 -1.9816859960556 -1.73778700828552
-3.72998094558716 -1.10225200653076 -2.24364399909973
-4.16287088394165 -1.93831098079681 -2.18561291694641
-3.48037004470825 -1.15480005741119 -2.34074592590332
-3.19479990005493 -0.729874014854431 -2.2627809047699
-3.45698809623718 -2.06250190734863 -2.40834498405457
-3.69825410842896 -2.0398850440979 -2.45501494407654
-6.41021203994751 0.121726997196674 -0.140248998999596
-5.68446922302246 0.0821209996938705 -0.0429899990558624
-8.6636905670166 0.480605006217956 -0.153114005923271
-8.44253730773926 0.839873015880585 -0.270639985799789
-7.91352415084839 0.446673989295959 -0.256817013025284
-7.10177278518677 0.495516002178192 -0.348895996809006
-5.60176420211792 0.52157998085022 -0.383877992630005
-7.09719181060791 1.16684603691101 -0.290769010782242
-6.34081602096558 0.729882001876831 -0.419885009527206
-8.45059013366699 1.00609600543976 -0.262726992368698
-5.63042020797729 1.21246600151062 -0.46262800693512
-5.59313297271729 0.803663015365601 -0.456158995628357
1.33528804779053 -2.49750804901123 -1.45238494873047
-5.06952619552612 0.908930003643036 -0.586163997650146
-5.10681200027466 1.31773400306702 -0.592633008956909
-4.73405599594116 1.46224904060364 -0.820851027965546
-1.16753101348877 0.97198897600174 -1.84538698196411
-0.621569991111755 0.310083985328674 -1.69763994216919
-1.13324105739594 0.410272002220154 -1.69418704509735
-1.74475800991058 1.4642219543457 -1.87234902381897
-2.53804302215576 1.89375495910645 -1.80506598949432
-1.10539305210114 2.28058195114136 -1.68532502651215
-2.66015696525574 0.0457050018012524 -2.09219908714294
-3.26360988616943 -0.330476999282837 -2.21491599082947
-3.14168906211853 0.360781997442245 -2.12812089920044
-2.36631107330322 -0.213598996400833 -1.90776205062866
-2.17215394973755 -0.562542974948883 -1.49127602577209
-3.97188401222229 0.503729999065399 -1.60830903053284
-3.54826593399048 1.01166903972626 -1.8432149887085
-3.60056090354919 0.095501996576786 -1.99286901950836
-3.91926789283752 0.188477993011475 -1.57188200950623
-4.15887689590454 1.54837298393249 -1.26097404956818
-3.4254310131073 1.72729802131653 -1.67649698257446
-2.5238299369812 0.469305008649826 -2.0162079334259
-2.88252592086792 1.50001001358032 -1.88541197776794
-2.36024808883667 0.717688977718353 -2.00201797485352
-2.14384794235229 0.166710004210472 -1.96717298030853
-1.5643960237503 0.968272984027863 -1.88248896598816
-1.53010499477386 0.406556993722916 -1.7312890291214
-1.74665701389313 -0.489199995994568 -1.15268194675446
-2.10045909881592 -0.103127002716064 -1.73907601833344
-1.63157904148102 -0.0636710003018379 -1.52436304092407
-3.06647992134094 -0.881339013576508 -0.335965007543564
-3.62021994590759 -0.714945018291473 -0.318688005208969
-4.48394823074341 0.0810870006680489 -0.569603025913239
-4.54110717773438 0.401524990797043 -0.835882008075714
-4.19911479949951 0.26045298576355 -1.28790104389191
-4.71521282196045 -0.0181770008057356 -0.18996599316597
-5.08268880844116 0.0242849998176098 -0.0529339984059334
-5.07571697235107 0.520220994949341 -0.447302013635635
-4.81243085861206 0.523069024085999 -0.624952018260956
-4.32994222640991 -0.196895003318787 -0.239247992634773
-4.09099817276001 -0.441857010126114 -0.472878009080887
-1.8874340057373 -0.772979974746704 -0.750896990299225
-2.04707908630371 -0.735850989818573 -0.920804977416992
-0.852213978767395 -0.84424102306366 -0.617354989051819
0.11150100082159 -0.875522017478943 -0.677833020687103
0.693283975124359 -1.3013459444046 -0.413217008113861
0.45244500041008 -0.997465014457703 -0.635601997375488
1.39982795715332 -1.53496897220612 -0.441085994243622
1.86404800415039 -1.36105394363403 -0.903195023536682
3.04249811172485 -0.373001992702484 -0.949820995330811
2.79368710517883 -0.912091970443726 -0.211548000574112
2.76752996444702 -0.793169021606445 -0.750666975975037
2.23107004165649 0.544933021068573 -1.86689698696136
2.32376408576965 1.29986298084259 -1.67517900466919
2.86955189704895 1.14353001117706 -1.52301704883575
1.90494704246521 0.119001999497414 -1.93761301040649
0.872922003269196 -0.306832998991013 -1.69571495056152
2.43748998641968 -0.696653008460999 -1.54194605350494
2.76321411132813 -0.625742018222809 -1.11901497840881
2.9967930316925 -0.181597992777824 -1.22898602485657
2.75126004219055 -0.458445012569427 -1.40420198440552
2.44294190406799 0.189219996333122 -1.78873801231384
2.99226307868958 0.866890013217926 -1.47305595874786
3.09140396118164 0.394122004508972 -1.33118605613708
2.65823602676392 -0.16261799633503 -1.62235295772552
0.00385400000959635 -0.405732989311218 -1.35713696479797
0.472059011459351 -0.173847004771233 -1.5093640089035
0.608482003211975 -0.260585010051727 -1.540403008461
1.23620796203613 -0.9845370054245 -1.9818309545517
2.33287191390991 -0.469830989837646 -1.73357999324799
-0.684211015701294 -0.47902500629425 -1.20920503139496
-1.31789302825928 -0.578104972839355 -1.00764894485474
-1.20281505584717 -0.152575999498367 -1.37933003902435
-0.561812996864319 -0.0927259996533394 -1.56194400787353
-1.07348394393921 0.00746299978345633 -1.55849099159241
0.1786749958992 1.49180495738983 -1.84960198402405
0.788444995880127 1.81757199764252 -1.70882797241211
0.691793978214264 1.33463203907013 -1.76708996295929
0.585047006607056 0.77581000328064 -1.75615000724793
0.401446014642716 0.257560014724731 -1.65486097335815
0.0719280019402504 0.932982981204987 -1.838662981987
1.01353704929352 0.671015977859497 -1.83159101009369
1.14860498905182 0.0438450016081333 -1.78864800930023
0.895681023597717 0.707193970680237 -1.75667297840118
1.97207403182983 1.51225101947784 -1.68306601047516
1.6153199672699 0.998412013053894 -1.87115097045898
1.1132709980011 1.10979104042053 -1.86129796504974
2.60055994987488 1.50068402290344 -1.53103005886078
3.02661490440369 1.24085795879364 -1.38543701171875
-8.60282802581787 1.26545894145966 -0.21450699865818
-9.8477725982666 1.15214598178864 -0.115056000649929
-7.18418884277344 1.53450894355774 -0.101521000266075
-7.85415601730347 1.16255104541779 -0.262124985456467
-5.66577386856079 1.70126295089722 -0.204514995217323
-5.65218305587769 1.4869099855423 -0.383708000183106
-6.36288690567017 1.286985039711 -0.305830001831055
-4.79198789596558 1.74943196773529 -0.738960027694702
-5.16474485397339 1.60491704940796 -0.510742008686066
-5.17833709716797 1.81927001476288 -0.331550002098084
-4.54939317703247 2.00761604309082 -0.718446016311646
-4.19436311721802 2.63765001296997 -0.428683996200562
-3.44268107414246 2.22290301322937 -1.40827894210815
-3.82109808921814 2.6740128993988 -0.702995002269745
-2.75331401824951 3.17037105560303 -0.785616993904114
-1.71556496620178 2.95234894752502 -1.24634099006653
-2.91989302635193 2.48167204856873 -1.4233410358429
-1.91519200801849 3.4332799911499 -0.73320597410202
-0.705424010753632 3.22680497169495 -0.91966301202774
0.1807049959898 2.54166507720947 -1.42604994773865
-1.19275200366974 2.83726906776428 -1.36325001716614
0.873403012752533 2.76057410240173 -1.07465302944183
1.46180999279022 2.1192889213562 -1.45796597003937
2.13031792640686 2.42683410644531 -1.04598796367645
2.08764100074768 1.99099695682526 -1.41692900657654
-7.92076301574707 1.48049199581146 -0.154305994510651
-5.7317681312561 1.92289996147156 -0.0964569970965385
-5.01703500747681 2.27415704727173 -0.127496004104614
-3.06970691680908 3.44934701919556 -0.359007000923157
-2.52885508537292 3.62307906150818 -0.38425600528717
-0.803086996078491 3.56698894500732 -0.51298600435257
1.61816394329071 2.88439106941223 -0.67587798833847
-0.00398000003769994 3.39334106445313 -0.556275010108948
2.20263004302979 2.74574398994446 -0.636242985725403
7.21349000930786 2.51319909095764 -0.562622010707855
7.18877410888672 2.63923001289368 -0.685075998306274
7.37168979644775 2.74449491500854 -0.563022017478943
6.30325889587402 1.86200797557831 -0.496035009622574
5.96646308898926 1.63178098201752 -0.64854097366333
6.86683511734009 2.23743104934692 -0.588697016239166
4.42092514038086 1.05462503433227 -1.47527301311493
3.50976991653442 2.18295502662659 -1.51708197593689
3.32945489883423 3.01304602622986 -0.128649994730949
3.49625205993652 3.58955693244934 -0.499769985675812
3.38587307929993 2.89964699745178 -0.597378015518188
3.50824093818665 3.43610191345215 -1.05609405040741
3.4065260887146 2.69841909408569 -1.08830595016479
3.55078792572021 3.14271998405457 -1.45848798751831
3.96751189231873 1.69370603561401 -1.7944769859314
3.88527607917786 1.33827102184296 -1.33448100090027
3.7344560623169 1.57733798027039 -1.55437397956848
5.90026712417603 1.53573799133301 -0.33840599656105
5.87114286422729 1.76024401187897 -0.322768002748489
6.13508176803589 2.03805708885193 -0.435274988412857
6.685142993927 2.32378101348877 -0.558003008365631
5.74510288238525 2.09970688819885 -0.600427985191345
5.68757677078247 2.10785293579102 -0.755868971347809
5.73690795898438 1.71692395210266 -0.802927017211914
6.76369714736938 2.43733501434326 -0.771499991416931
5.90532684326172 1.69161999225616 -0.753857970237732
5.51446485519409 2.0934579372406 -0.416965007781982
4.87128877639771 2.27188992500305 -0.588878989219666
4.29278087615967 2.58993792533875 -1.23632895946503
4.23817300796509 2.79357099533081 -1.12922704219818
4.50569581985474 2.49774694442749 -0.762938022613525
4.95892906188965 2.16997289657593 -0.860446989536285
3.97110605239868 3.28318405151367 -0.888306975364685
3.89451098442078 3.09743309020996 -1.56544995307922
4.39040613174438 2.31861090660095 -1.37912404537201
4.50484323501587 1.75178802013397 -1.59592497348785
-2.91488909721375 -0.540835976600647 -2.21183490753174
4.78361511230469 1.31788301467896 -1.35696601867676
-3.38668990135193 -0.351363986730576 -2.23154997825623
4.75653076171875 1.10400402545929 -1.33481395244598
5.0176100730896 2.03772401809692 -0.994400978088379
5.22469997406006 1.62635803222656 -0.973079979419708
5.4915452003479 2.08999991416931 -0.70430600643158
-1.67496800422669 0.206165999174118 -1.75246000289917
3.94429802894592 0.853266000747681 -0.953112006187439
4.66387891769409 0.700511991977692 -1.08768904209137
4.07666683197021 0.13858200609684 -0.65371298789978
5.04316377639771 0.765170991420746 -1.11277997493744
4.66535091400146 0.145232006907463 -0.817225992679596
5.1551079750061 1.13189899921417 -0.991979002952576
5.30372619628906 0.72961300611496 -0.937862992286682
5.59933519363403 1.26291501522064 -0.89121401309967
5.9568247795105 1.26660203933716 -0.769851982593536
6.02034997940063 0.893752992153168 -0.665237009525299
-4.50426483154297 1.40882503986359 -1.01275300979614
-4.5764479637146 0.85835599899292 -0.955716013908386
-4.50016117095947 0.571262001991272 -1.02450299263001
6.0402021408081 1.28937900066376 -0.327349007129669
6.0858907699585 0.889174997806549 -0.481817007064819
6.09244012832642 1.13269901275635 -0.53355598449707
5.70089483261108 0.664582014083862 -0.703767001628876
6.25270795822144 0.496470004320145 -0.538937985897064
6.70419788360596 0.123902998864651 -0.348650008440018
6.83247804641724 -0.199018999934197 -0.317050009965897
2.13501596450806 -1.21635699272156 -0.95906001329422
2.11757802963257 -0.117992997169495 -1.8999650478363
5.28987216949463 0.0992259979248047 -0.557756006717682
5.49994421005249 0.0129420002922416 -0.51323801279068
5.13371515274048 -0.21900799870491 -0.531978011131287
6.21650505065918 -0.81732702255249 -0.244011998176575
5.56280708312988 -0.529375016689301 -0.30255401134491
0.176862001419067 -0.702316999435425 -0.999677002429962
-0.189262002706528 -0.56657201051712 -1.17315804958344
6.51306486129761 -0.942883014678955 -0.280276000499725
-0.441033005714417 1.61201298236847 -1.85846400260925
6.41655683517456 0.152013003826141 -0.482712000608444
5.96628379821777 -0.0511780008673668 -0.540910005569458
5.40083122253418 0.410245001316071 -0.791108012199402
5.10667085647583 0.500006973743439 -1.01814103126526
4.58142518997192 0.0418689996004105 -0.611277997493744
4.85851192474365 -0.304825007915497 -0.230002999305725
4.47004079818726 0.315477997064591 -0.842311024665833
5.22151899337769 -0.397388011217117 -0.356507003307342
0.995414018630981 1.14596903324127 -1.78638005256653
4.085364818573 -0.0666389986872673 -0.413756996393204
4.8607349395752 0.0706430003046989 -0.77734899520874
5.38469791412354 0.206420004367828 -0.671131014823914
6.23157978057861 -0.629258990287781 -0.384611994028091
6.55919504165649 -0.430853992700577 -0.502000987529755
6.65621614456177 -0.753042995929718 -0.272549003362656
6.51576805114746 -0.771854996681213 -0.366690993309021
3.44340491294861 2.45785307884216 -1.33331704139709
3.63331604003906 1.79025495052338 -1.60533905029297
4.88080406188965 1.56334805488586 -1.17447304725647
4.76457023620605 1.87404704093933 -1.1850620508194
5.68997097015381 2.02863192558289 -0.843183994293213
5.98725700378418 1.61437594890595 -0.487230002880096
5.84468221664429 1.96945297718048 -0.385838985443115
4.67754316329956 0.941513001918793 -1.19706499576569
4.47080612182617 0.917909026145935 -1.17651295661926
3 0 1 2
3 0 2 3
3 3 2 4
3 2 1 5
3 1 0 6
3 0 7 8
3 9 10 11
3 0 3 7
3 6 8 12
3 6 0 8
3 11 12 9
3 10 13 14
3 15 16 11
3 15 17 16
3 18 19 11
3 18 11 16
3 15 10 20
3 17 18 16
3 17 21 18
3 21 17 22
3 11 19 1
3 19 18 23
3 24 25 26
3 24 26 22
3 5 19 23
3 27 28 29
3 27 29 30
3 19 5 1
3 20 14 31
3 20 31 32
3 33 34 31
3 21 22 26
3 35 36 33
3 22 17 32
3 25 24 37
3 38 36 35
3 39 36 38
3 40 41 34
3 40 34 42
3 24 22 30
3 43 44 34
3 29 44 45
3 29 28 44
3 28 27 34
3 27 31 34
3 27 32 31
3 27 30 32
3 33 31 35
3 33 42 34
3 33 36 42
3 36 39 42
3 39 38 46
3 40 42 47
3 43 34 41
3 44 28 34
3 10 48 13
3 10 9 48
3 20 10 14
3 17 20 32
3 31 14 35
3 35 14 13
3 13 49 38
3 50 51 52
3 51 40 53
3 50 43 41
3 43 52 54
3 45 55 56
3 45 57 55
3 57 58 59
3 45 44 43
3 60 13 48
3 13 60 49
3 35 13 38
3 30 29 37
3 40 50 41
3 37 61 25
3 51 50 40
3 61 62 63
3 52 43 50
3 64 54 52
3 62 61 65
3 65 61 66
3 66 67 68
3 66 69 67
3 69 70 71
3 70 55 72
3 66 37 29
3 26 23 21
3 26 73 23
3 23 74 75
3 37 24 30
3 74 76 77
3 74 23 76
3 5 75 78
3 79 80 81
3 80 82 83
3 82 84 85
3 82 80 84
3 56 69 66
3 55 69 56
3 86 70 87
3 62 83 88
3 70 69 55
3 83 65 81
3 63 89 73
3 63 90 89
3 91 88 92
3 91 63 88
3 93 89 94
3 95 61 37
3 94 89 90
3 96 90 92
3 96 92 97
3 95 66 61
3 73 26 25
3 73 25 61
3 92 98 99
3 18 21 23
3 98 92 100
3 75 5 23
3 100 101 102
3 103 80 79
3 101 100 104
3 100 92 105
3 106 70 86
3 104 105 107
3 108 109 104
3 110 111 112
3 110 113 111
3 114 115 116
3 66 95 37
3 114 117 115
3 117 107 118
3 83 62 65
3 117 113 107
3 91 90 63
3 118 105 88
3 70 106 71
3 89 93 73
3 119 65 68
3 81 119 120
3 106 84 103
3 68 67 121
3 122 68 123
3 122 119 68
3 119 122 120
3 81 124 79
3 81 120 124
3 120 123 124
3 103 125 126
3 103 124 125
3 126 67 127
3 126 121 67
3 113 128 109
3 121 125 123
3 113 110 128
3 125 129 123
3 130 131 132
3 131 133 134
3 117 114 113
3 133 77 94
3 107 105 118
3 133 130 77
3 132 135 136
3 88 105 92
3 132 137 135
3 137 138 139
3 138 132 99
3 140 139 141
3 140 142 139
3 142 143 144
3 143 140 145
3 144 146 147
3 81 65 119
3 146 145 148
3 146 143 145
3 149 148 150
3 149 146 148
3 147 151 152
3 147 153 151
3 153 150 154
3 153 149 150
3 155 156 134
3 124 103 79
3 141 101 140
3 125 121 126
3 102 141 139
3 137 157 135
3 129 124 123
3 137 139 157
3 158 159 160
3 84 80 103
3 158 161 159
3 127 67 71
3 161 162 163
3 161 164 162
3 164 165 151
3 164 158 165
3 158 166 167
3 133 131 130
3 160 168 169
3 138 137 132
3 160 159 168
3 159 170 171
3 143 142 140
3 160 172 166
3 146 144 143
3 173 174 175
3 149 147 146
3 174 171 176
3 153 147 149
3 174 168 171
3 169 177 178
3 169 173 177
3 179 180 181
3 179 182 183
3 179 175 182
3 173 184 185
3 173 179 184
3 186 187 188
3 186 180 187
3 181 189 190
3 181 186 189
3 191 192 193
3 191 194 192
3 194 195 196
3 194 186 195
3 197 198 199
3 197 191 198
3 77 76 94
3 200 196 201
3 68 121 123
3 200 192 196
3 193 202 203
3 158 164 161
3 193 204 202
3 205 201 206
3 205 200 201
3 169 168 174
3 169 174 173
3 173 175 179
3 204 207 208
3 181 180 186
3 204 209 207
3 197 186 194
3 197 194 191
3 193 192 200
3 193 200 204
3 204 200 205
3 204 205 209
3 209 205 210
3 210 211 212
3 212 211 213
3 214 167 166
3 214 166 215
3 215 166 172
3 215 172 216
3 217 178 177
3 217 177 218
3 219 185 184
3 220 190 189
3 220 189 221
3 222 199 223
3 223 199 198
3 224 198 225
3 226 203 202
3 210 206 227
3 210 205 206
3 208 207 228
3 228 207 212
3 209 212 207
3 209 210 212
3 229 230 231
3 232 233 234
3 212 213 235
3 236 237 238
3 167 239 165
3 240 241 242
3 243 244 238
3 167 214 239
3 245 246 247
3 245 247 248
3 249 250 251
3 249 251 252
3 253 254 255
3 253 255 237
3 256 257 258
3 259 260 256
3 261 258 262
3 261 262 263
3 214 233 232
3 214 215 233
3 216 178 217
3 216 172 178
3 264 231 265
3 265 266 267
3 215 253 237
3 268 269 270
3 215 216 253
3 271 272 273
3 271 273 274
3 218 185 219
3 218 177 185
3 275 276 277
3 275 277 278
3 217 252 251
3 279 280 229
3 217 218 252
3 219 190 220
3 281 282 283
3 281 283 284
3 284 285 286
3 219 184 190
3 287 288 289
3 221 199 222
3 221 189 199
3 290 291 292
3 292 291 293
3 292 293 294
3 294 293 295
3 294 295 296
3 296 295 297
3 296 297 298
3 220 299 300
3 301 302 303
3 220 221 299
3 301 304 305
3 306 307 308
3 306 308 309
3 308 307 310
3 308 310 311
3 312 303 313
3 222 314 315
3 222 223 314
3 316 317 318
3 319 320 321
3 223 198 224
3 225 203 226
3 263 322 323
3 323 324 325
3 225 198 203
3 224 326 318
3 327 328 329
3 330 331 315
3 330 315 314
3 332 333 334
3 332 334 335
3 224 225 326
3 226 336 337
3 226 202 336
3 338 339 340
3 341 342 343
3 208 228 336
3 328 249 300
3 328 300 299
3 228 212 344
3 247 345 248
3 212 235 346
3 347 318 326
3 348 337 336
3 348 336 349
3 349 336 228
3 349 228 344
3 309 350 351
3 231 230 265
3 230 229 280
3 229 352 239
3 229 231 352
3 234 237 236
3 234 233 237
3 232 279 229
3 232 234 279
3 346 353 354
3 354 353 355
3 238 237 255
3 236 238 244
3 356 357 309
3 241 244 243
3 358 359 360
3 358 360 361
3 241 240 244
3 362 363 364
3 240 278 277
3 365 366 367
3 368 369 370
3 368 370 371
3 372 373 374
3 372 374 375
3 376 377 378
3 376 378 379
3 380 381 382
3 383 384 385
3 385 386 383
3 382 340 387
3 382 387 380
3 388 389 390
3 388 390 391
3 391 392 393
3 391 393 394
3 394 395 371
3 394 371 396
3 396 372 397
3 396 397 398
3 398 399 400
3 401 400 402
3 240 242 278
3 243 246 245
3 243 238 246
3 403 404 405
3 403 405 406
3 247 255 254
3 403 406 407
3 247 246 255
3 403 407 408
3 409 410 411
3 245 256 260
3 245 248 256
3 251 254 253
3 251 250 254
3 250 345 247
3 250 249 345
3 249 252 300
3 412 413 302
3 414 313 366
3 258 257 262
3 257 248 345
3 415 416 320
3 417 363 418
3 417 418 335
3 419 420 380
3 419 380 421
3 422 399 423
3 422 423 424
3 425 426 427
3 425 427 386
3 428 429 423
3 257 256 248
3 256 258 259
3 409 430 431
3 432 409 431
3 389 388 432
3 389 432 433
3 434 274 273
3 434 273 435
3 263 262 322
3 258 261 291
3 261 295 293
3 436 275 242
3 436 242 437
3 261 263 295
3 438 241 439
3 260 259 241
3 440 441 442
3 443 436 444
3 231 264 78
3 264 265 267
3 267 270 269
3 267 445 446
3 267 266 445
3 266 265 280
3 447 448 449
3 449 450 451
3 449 451 447
3 270 272 271
3 452 453 454
3 269 268 455
3 268 282 456
3 268 270 282
3 273 272 446
3 271 283 282
3 271 274 283
3 445 276 275
3 446 445 435
3 277 280 279
3 457 285 454
3 277 276 280
3 458 288 459
3 458 459 460
3 461 462 463
3 461 463 464
3 460 459 465
3 275 278 242
3 456 282 281
3 456 466 467
3 468 469 470
3 284 283 285
3 461 471 462
3 281 284 472
3 473 474 475
3 284 288 287
3 284 286 288
3 440 476 441
3 286 285 457
3 448 443 444
3 448 444 477
3 284 478 479
3 480 481 482
3 483 484 485
3 483 485 486
3 487 488 489
3 490 491 492
3 493 491 494
3 493 494 495
3 289 288 458
3 496 497 494
3 287 498 478
3 287 289 498
3 291 464 463
3 291 290 464
3 290 499 498
3 290 292 499
3 292 500 499
3 292 294 500
3 477 490 492
3 294 501 500
3 502 495 503
3 504 505 502
3 504 502 503
3 294 296 501
3 298 427 426
3 298 297 427
3 506 507 470
3 489 488 496
3 297 295 263
3 296 298 508
3 298 320 319
3 508 298 509
3 510 511 512
3 513 514 515
3 303 302 313
3 516 510 517
3 516 517 518
3 302 301 412
3 301 303 304
3 466 4 467
3 304 307 306
3 301 319 321
3 157 165 239
3 136 239 352
3 301 305 319
3 306 309 519
3 311 310 347
3 310 303 312
3 136 135 239
3 135 157 239
3 310 307 303
3 308 350 309
3 152 151 165
3 308 311 350
3 155 90 96
3 312 520 317
3 312 313 520
3 317 334 333
3 317 520 334
3 318 330 314
3 318 317 330
3 131 134 97
3 316 318 347
3 97 134 96
3 321 320 416
3 323 322 324
3 263 339 338
3 263 323 339
3 325 324 521
3 138 99 98
3 323 328 327
3 323 325 328
3 325 521 345
3 97 99 131
3 325 249 328
3 329 328 299
3 327 343 342
3 327 315 331
3 327 329 315
3 141 102 101
3 331 333 332
3 331 330 333
3 335 334 417
3 98 102 138
3 332 335 343
3 145 522 104
3 341 359 358
3 359 335 418
3 341 380 387
3 101 522 140
3 359 341 343
3 140 522 145
3 340 339 387
3 109 523 104
3 339 342 341
3 104 523 145
3 338 386 427
3 145 523 148
3 338 340 386
3 148 523 109
3 347 337 348
3 128 524 109
3 347 326 337
3 109 524 148
3 348 351 350
3 148 524 150
3 348 349 351
3 150 524 128
3 349 344 525
3 150 526 154
3 351 525 527
3 154 526 110
3 309 351 356
3 527 354 355
3 346 527 344
3 128 526 150
3 527 346 354
3 346 235 353
3 353 528 529
3 355 357 356
3 355 353 530
3 504 531 532
3 357 533 519
3 361 389 433
3 361 360 389
3 360 359 362
3 531 516 518
3 516 531 504
3 358 421 380
3 503 534 504
3 358 361 421
3 504 534 516
3 364 363 365
3 363 362 418
3 362 390 389
3 535 534 503
3 362 364 390
3 367 369 368
3 367 366 369
3 366 365 414
3 365 393 392
3 365 367 393
3 371 373 372
3 497 536 495
3 371 370 373
3 409 537 430
3 370 413 412
3 430 538 539
3 370 369 413
3 368 371 395
3 375 376 379
3 411 537 409
3 375 374 376
3 430 540 541
3 374 416 415
3 374 373 416
3 372 375 397
3 379 423 399
3 379 378 423
3 539 540 430
3 378 420 419
3 378 377 420
3 377 385 384
3 377 376 385
3 382 384 383
3 429 542 424
3 382 381 384
3 424 542 543
3 381 380 420
3 424 544 422
3 383 340 382
3 422 544 402
3 383 386 340
3 386 385 425
3 391 390 392
3 543 544 424
3 388 391 406
3 532 545 513
3 394 393 395
3 513 545 514
3 391 407 406
3 391 394 407
3 396 371 372
3 394 396 407
3 398 397 399
3 396 408 407
3 396 398 408
3 400 399 422
3 398 400 401
3 402 400 422
3 401 403 408
3 546 547 548
3 401 402 403
3 406 432 388
3 406 405 432
3 405 411 410
3 405 404 411
3 549 550 551
3 404 538 537
3 551 550 552
3 403 544 543
3 410 409 432
3 430 541 428
3 552 553 554
3 302 366 313
3 302 413 366
3 414 363 417
3 415 426 425
3 415 320 426
3 555 556 557
3 419 428 423
3 557 556 558
3 419 421 428
3 424 423 429
3 428 431 430
3 554 556 555
3 432 431 433
3 435 273 446
3 274 454 285
3 274 434 454
3 434 447 451
3 555 559 560
3 434 435 447
3 560 559 561
3 435 275 436
3 562 563 564
3 437 241 438
3 437 242 241
3 436 437 438
3 438 440 442
3 438 439 440
3 439 463 462
3 442 441 444
3 444 436 438
3 448 447 436
3 451 452 454
3 451 450 452
3 454 453 457
3 453 465 459
3 453 452 565
3 450 449 566
3 450 566 567
3 565 567 568
3 565 452 567
3 568 502 505
3 568 567 502
3 457 459 288
3 458 461 464
3 458 460 461
3 465 469 468
3 460 471 461
3 460 465 471
3 470 469 506
3 569 112 570
3 468 475 474
3 468 470 475
3 462 476 440
3 110 112 154
3 462 471 476
3 154 112 569
3 471 474 473
3 570 571 569
3 473 485 484
3 569 571 572
3 473 475 485
3 572 571 573
3 574 490 477
3 573 571 570
3 574 480 482
3 573 575 572
3 574 476 480
3 572 575 576
3 476 574 441
3 576 575 577
3 441 477 444
3 577 575 573
3 448 477 492
3 576 578 579
3 482 488 487
3 579 578 580
3 482 481 488
3 580 578 577
3 481 484 483
3 577 578 576
3 481 480 484
3 486 470 507
3 486 485 470
3 483 512 511
3 483 486 512
3 487 491 490
3 487 489 491
3 581 582 583
3 492 491 493
3 494 491 489
3 493 495 502
3 495 494 497
3 497 511 510
3 497 496 511
3 496 494 489
3 584 585 583
3 535 510 516
3 586 587 588
3 535 536 510
3 532 513 589
3 505 532 589
3 505 504 532
3 507 513 515
3 507 506 513
3 496 488 511
3 510 512 517
3 515 518 517
3 590 591 592
3 515 514 518
3 592 591 593
3 594 162 151
3 595 4 466
3 152 165 596
3 165 157 596
3 594 597 162
3 136 352 598
3 598 78 75
3 599 600 601
3 602 603 604
3 605 606 607
3 605 607 608
3 609 610 599
3 599 610 600
3 598 352 78
3 78 455 467
3 611 612 594
3 78 264 455
3 595 603 613
3 155 96 156
3 94 90 155
3 155 133 94
3 156 96 134
3 546 614 547
3 526 128 110
3 404 403 542
3 534 535 516
3 531 518 532
3 535 503 495
3 615 616 617
3 536 535 495
3 537 538 430
3 546 548 618
3 619 618 548
3 539 404 540
3 619 548 620
3 619 621 562
3 429 541 542
3 622 548 547
3 547 623 622
3 624 552 550
3 550 549 624
3 558 554 553
3 554 558 556
3 625 561 559
3 555 625 559
3 563 562 626
3 621 563 626
3 620 627 628
3 627 548 629
3 630 631 632
3 633 630 632
3 633 616 615
3 634 635 636
3 558 553 637
3 555 552 554
3 555 638 552
3 639 640 641
3 639 641 642
3 643 644 645
3 643 645 646
3 579 580 582
3 581 579 582
3 590 588 587
3 647 648 649
3 650 651 652
3 650 652 647
3 602 607 606
3 653 649 654
3 602 604 607
3 655 656 657
3 605 610 609
3 652 651 658
3 652 658 659
3 660 661 656
3 660 656 655
3 662 663 664
3 605 608 610
3 665 666 667
3 601 668 669
3 601 600 668
3 612 669 668
3 670 671 672
3 612 611 669
3 597 594 612
3 603 602 613
3 623 547 614
3 623 673 674
3 666 675 664
3 676 677 678
3 676 678 679
3 680 677 681
3 674 615 617
3 614 546 682
3 683 684 644
3 618 682 546
3 619 620 621
3 685 639 642
3 548 622 629
3 644 684 645
3 562 621 626
3 686 683 687
3 686 687 688
3 631 617 616
3 689 690 691
3 631 564 617
3 564 631 562
3 619 562 631
3 692 679 693
3 616 632 631
3 633 632 616
3 694 695 696
3 696 695 561
3 561 697 560
3 698 638 555
3 673 636 635
3 698 555 699
3 614 682 636
3 700 701 702
3 703 551 638
3 703 638 698
3 704 705 706
3 704 706 707
3 708 709 710
3 635 634 711
3 674 711 712
3 713 714 715
3 716 709 717
3 716 717 718
3 674 673 711
3 719 720 721
3 633 615 712
3 630 641 640
3 639 681 640
3 642 646 645
3 642 641 646
3 712 643 646
3 561 625 722
3 723 724 725
3 723 725 726
3 712 711 643
3 634 648 647
3 723 726 637
3 634 636 648
3 647 649 650
3 644 647 652
3 644 643 647
3 727 549 551
3 727 551 728
3 649 648 654
3 729 730 728
3 682 618 654
3 731 732 733
3 651 657 656
3 734 735 736
3 737 738 739
3 737 739 740
3 741 742 707
3 741 707 743
3 744 745 701
3 745 744 746
3 707 742 704
3 747 744 748
3 747 748 749
3 651 650 657
3 750 751 752
3 753 754 755
3 753 755 756
3 717 757 758
3 649 655 657
3 759 737 760
3 649 653 655
3 761 762 763
3 761 763 764
3 658 656 661
3 533 765 766
3 533 766 519
3 658 651 656
3 660 664 663
3 660 655 664
3 528 767 529
3 653 667 666
3 653 654 667
3 768 769 528
3 618 665 667
3 618 619 665
3 770 769 768
3 771 766 765
3 771 765 770
3 772 773 768
3 772 768 774
3 775 776 773
3 666 665 777
3 665 672 671
3 778 779 780
3 670 672 630
3 781 782 783
3 641 630 633
3 784 785 786
3 666 777 675
3 787 788 789
3 790 791 741
3 790 741 743
3 655 666 664
3 662 664 675
3 792 793 794
3 792 794 795
3 793 792 796
3 793 796 797
3 798 789 799
3 798 799 800
3 801 802 803
3 671 677 676
3 675 676 679
3 804 805 806
3 807 509 319
3 807 319 808
3 678 677 680
3 681 639 680
3 809 810 811
3 809 811 716
3 812 813 814
3 812 814 815
3 812 306 519
3 812 519 813
3 816 817 305
3 671 681 677
3 817 816 720
3 671 670 681
3 818 501 509
3 818 509 819
3 820 500 501
3 820 501 818
3 821 499 500
3 690 684 683
3 822 498 499
3 822 499 823
3 824 478 498
3 824 498 822
3 825 479 478
3 825 478 663
3 690 685 642
3 642 645 684
3 652 688 687
3 826 827 828
3 652 659 688
3 829 830 831
3 832 689 691
3 683 644 687
3 685 690 689
3 691 690 833
3 834 835 692
3 683 686 833
3 836 826 835
3 836 835 837
3 838 839 840
3 838 840 841
3 679 678 693
3 842 843 844
3 662 679 692
3 845 846 693
3 561 695 697
3 560 699 555
3 847 848 849
3 842 850 843
3 850 847 851
3 560 697 699
3 852 853 854
3 698 706 705
3 698 699 706
3 709 708 717
3 855 856 857
3 858 859 844
3 858 844 860
3 713 715 719
3 716 721 720
3 716 718 721
3 853 861 862
3 853 862 863
3 864 865 831
3 638 551 552
3 866 774 768
3 866 768 867
3 868 772 869
3 552 624 553
3 870 871 872
3 696 561 722
3 873 874 875
3 876 875 877
3 878 876 879
3 880 881 882
3 557 637 726
3 881 880 883
3 884 885 886
3 884 886 883
3 887 888 885
3 887 885 884
3 889 890 888
3 889 888 887
3 867 213 211
3 206 891 227
3 557 558 637
3 201 868 891
3 201 891 206
3 722 625 726
3 196 892 201
3 694 726 725
3 195 893 196
3 187 894 188
3 694 696 726
3 637 549 727
3 182 895 183
3 551 703 728
3 171 896 176
3 170 897 898
3 170 898 171
3 162 899 897
3 162 897 163
3 900 901 902
3 903 904 905
3 723 637 730
3 727 728 730
3 906 590 592
3 730 733 732
3 730 729 733
3 724 723 735
3 732 736 735
3 732 731 736
3 725 739 738
3 725 724 739
3 694 738 737
3 581 583 907
3 735 740 739
3 735 734 740
3 701 700 744
3 742 701 745
3 742 741 701
3 745 704 742
3 745 746 704
3 746 744 747
3 705 747 749
3 705 704 747
3 908 909 910
3 910 909 911
3 703 749 748
3 912 911 913
3 703 698 749
3 729 751 750
3 729 728 751
3 714 750 752
3 714 713 750
3 914 588 915
3 914 915 916
3 748 752 751
3 748 744 752
3 731 755 754
3 72 917 918
3 731 733 755
3 719 753 756
3 719 721 753
3 750 756 755
3 734 758 757
3 734 736 758
3 718 717 758
3 919 903 905
3 919 905 920
3 754 753 758
3 921 920 901
3 921 901 922
3 737 740 760
3 708 759 760
3 923 924 925
3 708 710 759
3 757 717 760
3 707 763 762
3 707 706 763
3 737 761 764
3 737 759 761
3 695 764 763
3 695 694 764
3 765 533 530
3 767 530 529
3 72 918 87
3 72 87 70
3 85 926 927
3 767 528 769
3 528 867 768
3 530 769 770
3 530 767 769
3 770 768 773
3 928 929 930
3 928 930 931
3 771 773 776
3 771 770 773
3 776 779 778
3 776 775 779
3 112 111 570
3 570 111 932
3 570 932 573
3 573 932 929
3 573 929 933
3 702 741 791
3 702 701 741
3 580 933 934
3 787 790 743
3 584 934 935
3 788 787 936
3 743 707 936
3 935 591 587
3 593 591 937
3 788 762 938
3 592 593 939
3 788 936 762
3 762 761 938
3 789 794 793
3 789 788 794
3 710 795 794
3 710 709 795
3 793 799 789
3 940 923 941
3 793 797 799
3 787 789 798
3 785 800 799
3 785 784 800
3 784 802 801
3 781 803 802
3 781 783 803
3 798 800 801
3 931 927 926
3 931 926 942
3 801 803 943
3 791 805 804
3 944 945 946
3 791 790 805
3 947 948 945
3 801 806 805
3 947 945 949
3 947 949 950
3 801 943 806
3 951 925 952
3 715 807 808
3 715 714 807
3 949 951 953
3 778 954 955
3 778 780 954
3 796 792 954
3 792 811 956
3 792 795 811
3 955 954 956
3 956 811 810
3 957 72 55
3 709 716 811
3 59 958 959
3 958 952 959
3 766 814 813
3 766 771 814
3 810 812 815
3 810 809 812
3 778 815 814
3 519 766 813
3 808 305 817
3 950 949 960
3 808 319 305
3 306 816 305
3 306 812 816
3 720 719 817
3 809 720 816
3 809 716 720
3 961 59 58
3 961 58 64
3 508 509 501
3 804 818 819
3 64 52 962
3 51 963 962
3 700 819 509
3 700 702 819
3 500 820 821
3 659 822 823
3 659 658 822
3 499 821 823
3 661 824 822
3 661 660 824
3 663 662 825
3 478 824 663
3 479 964 472
3 479 825 964
3 603 827 826
3 603 595 827
3 472 828 827
3 472 964 828
3 846 845 965
3 689 832 965
3 966 967 968
3 964 692 835
3 692 693 834
3 826 828 835
3 969 9 970
3 604 826 836
3 604 603 826
3 835 834 837
3 829 839 838
3 829 831 839
3 846 838 841
3 846 965 838
3 836 841 840
3 836 837 841
3 608 840 839
3 608 607 840
3 686 688 844
3 842 971 972
3 842 844 971
3 821 972 971
3 820 848 847
3 820 818 848
3 804 849 848
3 39 46 973
3 804 806 849
3 850 842 847
3 783 850 851
3 783 782 850
3 847 849 851
3 784 786 974
3 853 974 786
3 853 852 974
3 953 975 976
3 843 850 856
3 852 855 857
3 852 854 855
3 782 857 856
3 950 977 978
3 782 781 857
3 856 860 844
3 946 979 980
3 979 946 981
3 856 855 860
3 981 948 979
3 979 948 982
3 979 982 980
3 832 859 858
3 832 691 859
3 691 833 859
3 858 983 863
3 858 860 983
3 854 853 983
3 830 862 861
3 830 829 862
3 863 983 853
3 858 863 862
3 600 865 864
3 12 8 980
3 980 8 7
3 980 7 984
3 600 610 865
3 831 830 864
3 606 946 984
3 606 984 613
3 606 613 602
3 839 831 865
3 772 774 869
3 774 866 869
3 982 970 12
3 775 872 871
3 775 773 872
3 772 868 872
3 780 874 873
3 780 779 874
3 871 875 874
3 967 970 968
3 871 870 875
3 873 875 876
3 797 876 878
3 797 796 876
3 968 985 966
3 876 877 879
3 978 985 948
3 786 882 881
3 966 985 978
3 786 785 882
3 878 880 882
3 878 879 880
3 945 948 981
3 786 886 885
3 881 883 886
3 853 885 888
3 861 888 890
3 861 853 888
3 986 977 976
3 668 890 889
3 867 528 213
3 866 227 891
3 960 976 977
3 866 867 227
3 867 211 227
3 953 958 961
3 868 869 891
3 870 872 892
3 868 201 892
3 877 893 195
3 877 875 893
3 892 196 893
3 880 188 894
3 883 895 182
3 987 986 976
3 883 880 895
3 894 183 895
3 894 187 183
3 884 883 896
3 182 176 896
3 887 898 897
3 887 884 898
3 988 987 976
3 896 171 898
3 988 989 990
3 889 897 899
3 889 887 897
3 973 990 989
3 987 990 973
3 162 597 899
3 47 989 988
3 47 988 963
3 897 170 163
3 901 900 905
3 583 582 584
3 586 585 587
3 590 587 591
3 154 909 908
3 154 569 909
3 976 975 988
3 594 908 910
3 569 911 909
3 969 967 987
3 569 572 911
3 611 594 910
3 60 969 987
3 60 987 49
3 572 913 911
3 572 576 913
3 910 911 912
3 576 991 913
3 576 579 991
3 912 913 991
3 581 907 991
3 583 992 907
3 961 64 962
3 583 585 992
3 599 907 992
3 599 601 907
3 590 915 588
3 590 906 915
3 586 588 914
3 992 914 916
3 993 949 939
3 609 916 915
3 994 941 949
3 994 949 993
3 609 599 916
3 900 920 905
3 900 902 920
3 917 903 919
3 902 901 920
3 919 920 921
3 904 952 925
3 922 924 995
3 922 901 924
3 917 957 996
3 905 925 924
3 905 904 925
3 904 903 996
3 918 917 997
3 995 924 923
3 934 928 931
3 930 116 115
3 930 929 116
3 116 932 111
3 577 573 933
3 929 928 933
3 580 577 933
3 582 580 934
3 994 935 934
3 998 945 999
3 609 915 906
3 609 906 999
3 609 999 944
3 585 584 935
3 609 944 605
3 591 935 937
3 593 937 939
3 592 939 998
3 940 942 922
3 940 922 995
3 999 906 998
3 997 921 926
3 994 993 937
3 921 997 919
3 939 937 993
3 995 923 940
3 926 87 997
3 994 940 941
3 931 940 934
3 994 934 940
3 115 927 930
3 918 997 87
3 926 85 87
3 931 930 927
3 940 931 942
3 942 921 922
3 994 937 935
3 942 926 921
3 906 592 998
3 606 944 946
3 606 605 944
3 999 945 944
3 998 949 945
3 998 939 949
3 951 952 953
3 917 72 957
3 957 59 959
3 957 55 59
3 585 935 587
3 953 952 958
3 959 952 957
3 904 957 952
3 582 934 584
3 904 996 957
3 941 923 925
3 925 951 949
3 941 925 949
3 949 953 960
3 962 975 961
3 962 963 975
3 958 59 961
3 962 52 51
3 934 933 928
3 963 51 53
3 963 53 47
3 973 49 987
3 60 9 969
3 60 48 9
3 975 963 988
3 989 39 973
3 989 47 39
3 49 973 46
3 988 990 987
3 929 932 116
3 966 986 967
3 987 967 986
3 961 975 953
3 960 953 976
3 950 960 977
3 947 950 978
3 986 966 978
3 978 977 986
3 948 947 978
3 946 945 981
3 982 985 968
3 919 997 917
3 903 917 996
3 982 948 985
3 967 969 970
3 905 924 901
3 982 968 970
3 970 9 12
3 980 982 12
3 946 980 984
3 595 984 7
3 595 613 984
3 4 7 3
3 4 595 7
3 2 467 4
3 2 78 467
3 599 992 916
3 2 5 78
3 1 6 11
3 11 10 15
3 586 914 992
3 586 992 585
3 6 12 11
3 15 20 17
3 22 32 30
3 29 56 66
3 29 45 56
3 38 49 46
3 39 47 42
3 40 47 53
3 54 45 43
3 54 57 45
3 54 58 57
3 54 64 58
3 579 581 991
3 57 59 55
3 669 991 907
3 669 907 601
3 611 912 991
3 611 991 669
3 61 63 73
3 62 88 63
3 65 66 68
3 69 71 67
3 611 910 912
3 73 76 23
3 73 93 76
3 74 598 75
3 74 130 598
3 74 77 130
3 80 83 81
3 103 127 106
3 103 126 127
3 84 106 86
3 82 88 83
3 82 118 88
3 668 889 899
3 668 899 597
3 668 597 612
3 82 117 118
3 82 85 117
3 86 85 84
3 884 896 898
3 86 87 85
3 883 182 896
3 91 92 90
3 880 894 895
3 93 94 76
3 877 195 188
3 877 188 880
3 877 880 879
3 870 892 893
3 870 893 875
3 92 99 97
3 98 100 102
3 868 892 872
3 101 104 522
3 866 891 869
3 100 105 104
3 104 107 108
3 108 113 109
3 600 864 830
3 600 830 861
3 600 861 890
3 600 890 668
3 108 107 113
3 113 116 111
3 113 114 116
3 117 927 115
3 117 85 927
3 786 885 853
3 127 71 106
3 786 881 886
3 123 120 122
3 797 878 882
3 797 882 785
3 797 785 799
3 780 873 876
3 124 129 125
3 780 876 796
3 780 796 954
3 775 871 874
3 775 874 779
3 130 136 598
3 772 872 773
3 130 132 136
3 131 99 132
3 133 155 134
3 138 102 139
3 142 157 139
3 608 839 865
3 608 865 610
3 142 596 157
3 142 144 596
3 144 152 596
3 144 147 152
3 153 594 151
3 832 858 862
3 832 862 829
3 854 983 860
3 854 860 855
3 686 844 859
3 153 908 594
3 686 859 833
3 153 154 908
3 164 151 162
3 843 856 844
3 158 167 165
3 974 852 857
3 974 857 781
3 850 782 856
3 161 170 159
3 784 974 781
3 784 781 802
3 783 851 849
3 783 849 806
3 783 806 943
3 783 943 803
3 161 163 170
3 972 847 842
3 160 166 158
3 820 847 972
3 820 972 821
3 804 848 818
3 159 171 168
3 659 823 821
3 659 821 971
3 659 971 688
3 688 971 844
3 169 172 160
3 604 836 840
3 169 178 172
3 604 840 607
3 829 838 965
3 829 965 832
3 846 841 837
3 846 837 834
3 174 182 175
3 174 176 182
3 173 185 177
3 964 835 828
3 179 187 180
3 846 834 693
3 179 183 187
3 692 964 825
3 692 825 662
3 181 184 179
3 689 965 845
3 181 190 184
3 663 824 660
3 186 188 195
3 661 822 658
3 791 804 819
3 791 819 702
3 197 189 186
3 700 509 807
3 700 807 714
3 715 808 817
3 197 199 189
3 715 817 719
3 194 196 192
3 193 198 191
3 193 203 198
3 809 816 812
3 204 208 202
3 210 227 211
3 213 528 235
3 955 956 810
3 955 810 815
3 955 815 778
3 776 778 814
3 776 814 771
3 214 229 239
3 709 811 795
3 214 232 229
3 792 956 954
3 215 237 233
3 787 798 801
3 787 801 805
3 787 805 790
3 217 253 216
3 784 801 800
3 217 251 253
3 219 252 218
3 788 938 710
3 788 710 794
3 219 300 252
3 710 938 761
3 710 761 759
3 219 220 300
3 222 299 221
3 707 762 936
3 222 329 299
3 222 315 329
3 743 936 787
3 223 318 314
3 223 224 318
3 226 326 225
3 226 337 326
3 208 336 202
3 212 346 344
3 530 770 765
3 231 78 352
3 230 280 265
3 234 244 240
3 234 236 244
3 240 279 234
3 240 277 279
3 737 764 694
3 695 763 706
3 695 706 699
3 695 699 697
3 255 246 238
3 708 760 717
3 241 243 260
3 734 757 760
3 734 760 740
3 718 758 753
3 718 753 721
3 731 754 758
3 731 758 736
3 719 756 750
3 719 750 713
3 729 750 755
3 729 755 733
3 714 752 744
3 245 260 243
3 247 254 250
3 714 744 700
3 703 748 751
3 703 751 728
3 249 325 345
3 704 746 747
3 257 322 262
3 698 705 749
3 257 324 322
3 257 521 324
3 257 345 521
3 725 738 694
3 735 739 724
3 732 735 723
3 730 732 723
3 258 291 259
3 727 730 637
3 261 293 291
3 291 463 439
3 439 259 291
3 439 241 259
3 549 637 624
3 624 637 553
3 264 269 455
3 264 267 269
3 557 726 625
3 557 625 555
3 266 276 445
3 266 280 276
3 267 272 270
3 696 722 726
3 267 446 272
3 268 467 455
3 268 456 467
3 271 282 270
3 274 285 283
3 275 435 445
3 456 595 466
3 456 827 595
3 281 827 456
3 281 472 827
3 284 479 472
3 286 457 288
3 287 478 284
3 675 679 662
3 289 464 290
3 289 458 464
3 680 639 845
3 680 845 693
3 680 693 678
3 685 689 845
3 685 845 639
3 290 498 289
3 683 833 690
3 296 508 501
3 297 338 427
3 297 263 338
3 652 687 644
3 426 320 298
3 319 509 298
3 301 416 412
3 649 657 650
3 690 642 684
3 301 321 416
3 303 307 304
3 304 306 305
3 357 519 309
3 310 316 347
3 310 317 316
3 310 312 317
3 347 350 311
3 640 681 670
3 347 348 350
3 640 670 630
3 414 520 313
3 414 334 520
3 671 676 675
3 671 675 777
3 414 417 334
3 653 666 655
3 317 333 330
3 323 342 339
3 633 712 646
3 633 646 641
3 323 327 342
3 327 332 343
3 327 331 332
3 335 359 343
3 630 672 631
3 359 418 362
3 665 671 777
3 619 631 672
3 619 672 665
3 358 380 341
3 387 339 341
3 349 525 351
3 618 667 654
3 344 527 525
3 527 356 351
3 527 355 356
3 682 654 648
3 682 648 636
3 235 528 353
3 353 529 530
3 634 647 643
3 634 643 711
3 355 533 357
3 355 530 533
3 635 711 673
3 674 712 615
3 360 362 389
3 433 421 361
3 614 636 673
3 614 673 623
3 433 428 421
3 433 431 428
3 363 414 365
3 365 390 364
3 365 392 390
3 366 413 369
3 368 393 367
3 368 395 393
3 370 416 373
3 674 617 564
3 563 623 674
3 563 674 564
3 370 412 416
3 374 385 376
3 621 628 623
3 621 623 563
3 374 425 385
3 621 620 628
3 374 415 425
3 379 397 375
3 622 623 629
3 379 399 397
3 377 381 420
3 377 384 381
3 378 419 423
3 398 401 408
3 402 544 403
3 403 543 542
3 404 539 538
3 404 537 411
3 405 410 432
3 434 451 454
3 435 436 447
3 439 462 440
3 468 471 465
3 468 474 471
3 444 438 442
3 443 448 436
3 448 566 449
3 448 492 566
3 453 469 465
3 453 565 469
3 453 459 457
3 490 482 487
3 490 574 482
3 492 493 566
3 450 567 452
3 493 567 566
3 493 502 567
3 565 568 469
3 505 469 568
3 505 506 469
3 505 589 506
3 470 485 475
3 471 473 476
3 473 480 476
3 473 484 480
3 477 441 574
3 481 483 511
3 481 511 488
3 507 512 486
3 507 517 512
3 507 515 517
3 497 510 536
3 532 518 545
3 514 545 518
3 513 506 589
3 428 541 429
3 542 540 404
3 542 541 540
3 627 623 628
3 620 548 627
3 627 629 623
