address,p,amount
0x6c092e3012b8995bda35c8ce0e36dfda22ec159b,2.1212352%,148486.46
0x654ad5d5d51496c801766f7171b8f9de87471e57,1.5706862%,109948.03
0x65f902fba324aedc801229b0593401cc0644d631,1.2668774%,127203.68
0xe6fe1582dd3da9f0328702aeeb688b66b4f6212a,1.0673021%,74711.15
0x9d643c47a6bdbcdf7b2414ed839df8746780e397,0.8030998%,56216.98
0xaba7616b43f7ec88a603b0e2e46c4639206cf297,0.6951140%,48657.98
0xfc515ce35ee5f33f12922be0ef885e33a4374ffc,0.6650378%,46552.65
0xc3d2c3e71bd9beccd11c6401e1491c40629fbc4d,0.5502091%,38514.64
0x5d4d3fae4d0282fd8a558b5f42ba700974cbfd1a,0.5248260%,36737.82
0x4365d60a4389ba9c35558383107a180cddccab6e,0.5083827%,35586.79
0x266fc13bf0325df40c4e99a555728d6756edb151,0.4216856%,29517.99
0xf3d6ab48cdb4dcbfa4932d9ea69543c22695a15d,0.4159251%,29114.76
0xfac137e6753b1c7b210cd1167f221b61d6eb4638,0.4079951%,28559.65
0x239b74c2e5505634b7c38c8eeb1de385a16e24e2,0.3857608%,44560.25
0xd4259dbf8fdb78967e22cf369514ce80df5aec7e,0.3601800%,25212.60
0xfc117cb4c186586f415cebaaa0644aa0ad530b8a,0.3229560%,87594.21
0x3cd499eaffd887935aae9298d1163e9bc5cc81e2,0.3202845%,22419.91
0xd2086532379dac81e4fcb2fdec9fe06380c26a9d,0.3001375%,21009.62
0xc0cbdcd0591a729ad46534a01c48a57604dac3ac,0.2948694%,20640.86
0x975421d06eb75eed183c14712ead426bb11f9853,0.2655418%,57130.43
0x6f5d97e21d588e1c546d015b892069982d5eb4dc,0.2516053%,32505.7
0x069e85d4f1010dd961897dc8c095fbb5ff297434,0.2428237%,16997.66
0x48e81c9ebf4f19b36c248d16b0ffddd284399ccb,0.1998169%,44933.28
0x8eb718bbbb0a35512544fea7578fa4e2a8976cf4,0.1871802%,13102.62
0xe9a96b6a35dd75f2660e1e27c976710b4781aa19,0.1507390%,10551.73
0x6e9222e61962edfc8393d751a8cb068388bbfa9f,0.1472911%,10310.38
0x53d1c6a6514c198ba12a4388572cd200662e4406,0.1328946%,9302.62
0x6e08762bee2b54198836ebde660de7c2a6b2646c,0.1180599%,8264.20
0x58e28e474a0833c85c6217826267a51632250d44,0.1176835%,8237.85
0xbc2b71b2b87bf601325e14f82fe8f9f50eaeb40e,0.1153996%,8077.97
0x31923e1811cb6d5c26870439d457705505dcf402,0.1147807%,8034.65
0x8c256300ed850185a10a6fd0b0c69d2ef87fdf11,0.1132085%,7924.59
0x89bf49a6de447c08f22f1eb05ab98e27ea779ff0,0.1104700%,7732.90
0x962e5477a66be128847e37f0af0f1011492b36fc,0.1101162%,7708.13
0xee86a3c13c129fbe15468470c09b2655d5f2c302,0.1085798%,7600.59
0x144447a659074d202b19e7ef59d5274d7c6251c9,0.0986775%,6907.42
0xff924e659b920261522e3c5a5ce6076a8e102f0c,0.0965638%,6759.47
0x1d0adcc97f7bb8af13e2c9cfa9d6595d44832a11,0.0917969%,6425.78
0x586e572fd9f29627706fc55a1f0168aaaa4d8ffd,0.0884767%,48423.83
0x896258d81b27cfaaf9fbab2ee26777ee81c07713,0.0865743%,6060.20
0x692d47ada6ebb8754f5365c22b3384307c886aaa,0.0848299%,11517.4
0x5de2f45bb23180f49762dbafee319a4987651f50,0.0812780%,18933.07
0x95859ed507ed13535de6fe0551f7363d4cb878c3,0.0770878%,5396.14
0xe4cf728cbc45fb9b0e332f0ff659cf9a957aeb58,0.0765901%,5361.31
0x2a144c341355f765113590b7e5e3643b0f959462,0.0720933%,5046.53
0x5671fd45912a2f93ea4d1706a4440898bbdb7335,0.0707411%,4951.88
0x4a8ca9e717115a3154f04a825b5441333683836c,0.0686771%,4807.40
0xa5ef3b687f3402554b565e8300a97d4cbfcd9482,0.0682462%,4777.24
0xcc4c36cfd105ab027de4acd40e0c5ec7057d1e89,0.0680648%,4764.54
0x0eefda40c2b1b836a1e6fb85eeef69f2abc2acaa,0.0679024%,4753.16
0xfdf38da449b5ab5744e37f1539341f529780851a,0.0638531%,4469.72
0x86a8d5d0f363de5afb73573d386511b18d87d992,0.0614806%,4303.64
0x40b3e336dc1a19c169172d59152bdb1d62f8e690,0.0596893%,4178.25
0xd186214e1b12414a2bdd499960a3e39fb8626714,0.0593153%,16595.3
0x9cc13ec2c1b98002a375dcaa48658540d97811db,0.0589840%,4128.88
0xef352a5c0bec77ec357d6032e9e94ee5bcb3a560,0.0544504%,3811.53
0x0e54edd4cf6568de41fc67eaa71aeb52885999c7,0.0536307%,3754.15
0x23e44614d00fa86b1642df1d1c1a624bf4743a23,0.0497951%,3485.66
0x82a9028c28b80c9c8d31784e13ec78ec4961dc7d,0.0478102%,3346.72
0xdab6d4afe2f1ed1eecdce28be92fe0a73c077284,0.0475836%,3330.85
0x2a14bf63d2924a9a57ecb8ce4fe5c5f61857c210,0.0473686%,3315.80
0x36855bfb283b16747212c4b45e5893bcddacf5b5,0.0473408%,3313.86
0xb5173937e7598db8f6e94b3a28fe21d9e8aec8d9,0.0470379%,3292.65
0xb3ac4be3a88e3960b13159daff9e7129cb429e39,0.0458851%,3877.52
0x5f5f3a8b65dd4deaf237868c4d6bff4ab5583424,0.0452852%,3169.97
0xb1267a52a927015fb14a7450ddbe9d80794e4798,0.0441051%,3087.36
0xd43cb2dd6264f5989b6b31ea1b0514b2bed6ffc3,0.0415823%,2910.76
0x850c9b17b11159182dd627ada5239dfee514446e,0.0415014%,2905.10
0x154d85ae7691bda2261e6564692a853e15465d6e,0.0409986%,2869.90
0xe23818c910d21af60bb08801062c940818c59b3c,0.0404274%,2829.92
0x4254686469141af5ddef8e90fc9bda70c89a896a,0.0402100%,2814.70
0x1ebb73f5f47bcc3d7dc1dabf7284875e3ae40e07,0.0366636%,2566.45
0x48323030dfadd7a9c6282777bc897e88d42849e5,0.0362808%,2539.66
0xaaaadb91b3ecced699ddc7d93a62640148ba0136,0.0347650%,2433.55
0xebde145d290d1053940eb11ea543e34a952ecf0f,0.0342051%,2394.36
0xfd8138be1673a533e3964e2618e589cf23f13d50,0.0331160%,2318.12
0x7f7eafa5f4d75bfa16ce56fc3f6eff06e2566420,0.0326371%,4942.22
0xa877184a3d42bf121c8182c3363427337ec49a3b,0.0316325%,16246.47
0xddf8da887a1d5c07d05a948856b79dab091efc78,0.0294931%,2064.51
0xaeb5f126b9927d0dce47817336e0666ea4a2a878,0.0294370%,7605.91
0xc37a19fa4ae70639d217b9604c03cbc8a5f0383d,0.0261758%,1832.31
0x89cd44bf370e6889f3e1400002455d5916fd459e,0.0260202%,1821.41
0x57b7713c0e013cfbec0e4c6c8b264daf7598eba9,0.0243424%,1703.97
0xbd313d514ecd15a0224da4de050c79e2cd8382ab,0.0233732%,1636.12
0x7d3c9009905fcbe281c98a449fcc5e8677aba707,0.0232877%,1630.14
0x8ea852244b3f3cc6af96e06d9f12fdc6f7d00792,0.0218826%,1531.78
0x9c88d91e467d1d4aaa714d0cb2c306a14256a8b6,0.0218727%,1531.09
0xc5209f1cc35e1600b26a0a36fafe51888f322894,0.0218324%,1528.27
0x5c29a94c6104028aa2a931e045f7a5185e0b735b,0.0213428%,1494.00
0x954cb370d4b53fa2948e90a202cc213d5b803cad,0.0197438%,1382.07
0x626e4c4bf9b150403d41f0841457d3bdf961b32f,0.0195395%,1367.77
0x53899e437bde0ad0caa31dfd62cfb69ac4920199,0.0178553%,1249.87
0x80c17147571d340b0538139f4221335103f83171,0.0173903%,2137.13
0x7281e1bfe4191927a5ce090f4b35a4e57e8ff5b6,0.0171604%,1201.22
0xb91b5301109368bca5586e3e368bbb27094a12b2,0.0168124%,1916.87
0x7fc31fb619670e305b3643f8382d7d1367c9d5e6,0.0158774%,1111.41
0x68fef70c0b2e336492149184353ec5e2d17dfd62,0.0146737%,1027.16
0xc3c345a20c34927851bcf7f54c9b960de33a0309,0.0143655%,1781.94
0x5a4ddb0856fee6b33f11cc264f369e77b0f0339c,0.0141398%,989.78
0x599ed10fdea23e5c968ea1de7832011dbc7c9b22,0.0140410%,982.87
0x3855dd4fe27fb24efb11d4b725cc1d8a76cb6c9f,0.0139381%,975.67
0x71c9535a7e8ef39a7c118235f81d9d0c2739e958,0.0112460%,787.22
0xeb079ee381fc821b809f6110ccf7a8439c7a6870,0.0111086%,777.60
0x9572001a64ad0a42fb908429dfa0214a3c18079d,0.0109113%,763.79
0x265294a3abcd8aacc36daf3d15b9044b1f6b17ac,0.0105228%,736.59
0xae69116e4aa49645f78c1fc9f28f677aede0d153,0.0103580%,1635.44
0xc149d68d58b83cb2c612f882bbc0eb3b2b473a9a,0.0102265%,1081.85
0xc897925222be6c25a1569e18d2ff0558ae616db0,0.0102167%,715.17
0x4ba1419e0cae0e4ebfe421eff15efbfc7c676cd8,0.0101495%,710.46
0x86cb28fed7d11359bbb251f7abbaa412c11c900b,0.0098679%,690.75
0xdfaaec16aa49ae413dca692b504b08c70765d1ec,0.0098380%,2670.93
0x17b1d9a1a8f0363e04bccdf2839cb107b2297774,0.0094225%,659.58
0xd959fa2459e7bddade564188f87d88159c4a7875,0.0086603%,606.22
0xa5ff40131467eeaab53e32b5ac6c3b36e1b4603e,0.0083418%,583.93
0x4f668e8d4e7fac8ed9151263964453482a30d33a,0.0081785%,572.50
0x37ac1fbf5c0f0b717a760bcb789c032bbe1cdedb,0.0081479%,570.35
0xabd4c34cc6bb50f49b633ed82ea9a3bb44cbbcec,0.0081186%,568.30
0x104de2b12a7c2cf9715fc103ddc312314fd7f8b7,0.0080045%,560.32
0x4f285bdd5809d768b79f2ab549921122cea2f12e,0.0075886%,531.20
0xc692ca93838dbb3d85c0726869de56b9101b8c3f,0.0070678%,494.75
0x05e5ab383f3c2d423cfd118b83420261ab0990bc,0.0070543%,1441.52
0x014930c2d8878759763f3ac2a492ff94073fd80f,0.0070207%,491.45
0x64b24e3c3225026c120b9c543acebf615126adff,0.0065377%,457.64
0xfda42e50180b17a3c45a6de342b409347be8db5a,0.0062019%,434.13
0x2ef1f3d3038042e7930f0b24255e747c488c095a,0.0060692%,424.84
0x3fa2382a43c7661a32ce214a7a10afe3fda53149,0.0057694%,493.1
0xc45e413e33a913af3f9d7111200d0f17a60e12f1,0.0056561%,395.93
0x3e3672b23eb22946a31263d2d178bf0fb1f4bbfd,0.0053371%,373.60
0xc65e253fcca8332b889eed23809ae4b87ffca808,0.0050054%,549.1
0xdd2e04c90be8eec920343528e07344250f7a33c7,0.0049030%,343.21
0xb862166fa999242680cf0eb7940860075686552e,0.0045570%,318.99
0xfa8f9d9a9821362561c36a6a4866ca396a452bbf,0.0045175%,316.22
0x0cab19b2e52dc6c175b7c4d6280e98a892b30764,0.0044517%,311.62
0xce25edf3ebda068fdee20bb44eb295cfd05c9fa1,0.0042166%,295.16
0xbf06c5b920442c0c861766cfce0ea4217cd207a3,0.0039656%,277.59
0x7385f8b5ab1303c8e476d371973db768f1a43bb4,0.0034862%,244.04
0x8330c4070960533fe976faf3bf8f218ce02fc781,0.0033398%,233.79
0x397038985bae9ae4a8d2ab38682963e4a351a4b1,0.0032197%,225.38
0xa01dc3f66a94e95c5f60549ef5b6a90e79c4349c,0.0031352%,219.46
0x90f6c5f2ec7c712aa6c947c30e697f8608ac9fd3,0.0030923%,216.46
0x91ae502aa58e177593656f45cd59cf076352c11a,0.0029566%,206.96
0xd124bf5e9c1104ed4f97ac88f9b319a3775dcf0d,0.0029484%,15123.83
0x643700b0703c013a66d20f85538006fe3d497669,0.0027512%,192.58
0x6ece4ba51109834965196535d9ab7e541ef6a4f5,0.0027344%,191.41
0x52cec4602afdfa316a815128c4f4041244601e48,0.0025794%,180.56
0xb8cba3127b416b8a217502185c2b71a2487a38f3,0.0025751%,409.6
0x73e9c88d26343eca36bb1297cfd0f8d6f02ff8ea,0.0025707%,179.95
0x647237ab3e01dd1c57bef64b7070c324f9d241f1,0.0024086%,168.60
0xc7fea0ce6a2ad72e955434a406c093662cfabea5,0.0024051%,617.28
0xa31978a297a8e78e7c8aef86eec055786d65804d,0.0022963%,365.25
0x49a52661bb3f77c0cc2d2b0f6acc83e041920620,0.0021650%,151.55
0x2caa243aa311c525e652557423839c23aecebe36,0.0019133%,133.93
0xa0eeed7ad4e74912069fe16a3c3d94d2d9425c25,0.0018835%,131.84
0xf194e89f9890ae474e0b9d11f2bf605afb83d998,0.0016429%,998.12
0x829f0811319625975292ee7d9d22a3a0b408eed9,0.0016233%,113.63
0x320f7c668c565859582bc1660f74ac3617b0b72d,0.0014060%,434.91
0xdbdf70689cb64b096c5291843936c56731e8240b,0.0013638%,95.46
0xb63645e7d96ed194c6379f2d1e856a8100e4178b,0.0012190%,85.33
0x18fc0099cc649f53825f60fdda5f10f68965ed0f,0.0011963%,83.74
0x9776a3bee757a150e26d0f22c7463a4193c8e47e,0.0011422%,79.96
0xafc03d4516a2a977f4bf0d1a01b7aa796f287f4a,0.0011393%,79.75
0x7eb54141f61800a2cdafa6f1f7ba3cd0a5d495dc,0.0011256%,78.79
0xc5a0bf774dd62315e87ad213342b21de8d12ba17,0.0011089%,77.62
0x277951b5856d085eacc32251b4b3cdf1be353633,0.0010422%,72.96
0x493f662b1bd55582921eca8306233d54e48e1989,0.0009825%,68.78
0x43b34da57716a660a746abc7916b2373f4efbaf4,0.0009740%,68.18
0x7f2436d628137a1a4f07631b1e09e37455f4adae,0.0009528%,66.70
0x7edcd277f0918e0b56fa9174b98708d7177c253d,0.0009318%,65.23
0xdab9daef2143b47a1628a86365c3a46a63086d07,0.0009288%,65.02
0xdec7f7a004373d5bdaeb2f8a14f6c05cadedf0ad,0.0008408%,58.85
0x1002d9e169d5389574c381a2cf0f7e0d798e920f,0.0008254%,120.6
0xd657d64eaf9387ad3829163e93b0caa98d29f826,0.0007989%,55.92
0x74c70ae43d8475d2f15dd9d828ad609f493babe2,0.0007224%,50.57
0xde39de484c3ad59176937d806e604f72657000ad,0.0007189%,50.32
0xe0471a50da1e7c81ffe3912253f30b9db1eae0c8,0.0006935%,48.54
0xd85043d1188c6dab63f04eba9689843826b0cbed,0.0006935%,48.54
0xe0e02b794860188f6dfed887f0bf6bd9382a5ebb,0.0005989%,41.92
0x1bc6ffc45985ab5baee5a5f20125281ed5903d8d,0.0005898%,41.28
0x90036c2f2c4cf5958eb0a9a841aaeb734e786516,0.0005516%,133.81
0x658827c1aa0a639ba71f0d6f33a9aa7f5d088756,0.0005304%,37.13
0xd1fc7621ba601a4032fdc2e9c961b6028632bb86,0.0005000%,35.00
0x1c85d6ae1336d0e4e3f165bbfa9641bfa04cedb1,0.0004764%,33.35
0x96dafc16a42db1206d550159387f73886d7d6600,0.0004737%,68.77
0xd6272a954194e9ff4b8834e5ead2ecf736fb610f,0.0004330%,30.31
0x92d495ad4e02c3429cf2c115bac9179e0a0a8f85,0.0004323%,30.26
0xbcf9808e95f17b771dead7dea0e8b6bbe022d4c6,0.0003442%,24.09
0x8c0e880465982010e3cd610c962ac9c879bad987,0.0003047%,21.33
0x26602a5f7eff57fa32d9cfb08cac447aaa93ed38,0.0002058%,14.41
0x91e9a526369667a4ffbdef5ba4a5233d8a6ff751,0.0001887%,13.21
0xbb54be8bc5213bb5b1651eb175be839cdc72f5fe,2.8992334%,202946.34
0x81bd6192ebe68c664b07ce53cafc9d8135512348,1.5934479%,157703.06
0xc788abc07a15f120748338a538af72f5fb1f0af0,1.5269329%,106885.31
0xdc13b815c055b6c620cbe16bcb9f684db69246ea,1.2745332%,89217.33
0xe69a7233dbe675601c026647bd3e4d56c5890037,1.1652750%,81569.25
0x05434766aa193349a3528b393725332985c95bc2,1.1376202%,79633.41
0xf9b26398731b85665c9dcafbe860097adaf1239c,0.9924091%,69468.64
0x22302d6e072ffe967e512ea7ea7171aab221da76,0.8907204%,62350.43
0xc59eee0de4e7f60514681f27fac75d96fac6a489,0.8496244%,59473.71
0x2085e510fe72beb47035a45936b8aa1bbb172e89,0.8488640%,59420.48
0x767bc4c48ddd4dfe1d841ed0013a16d6c21fc559,0.7967985%,55775.89
0xd3b7949c45780ba6e8e59e8f0a05af26d12c41ba,0.7813001%,54691.01
0x1bcebf2c7f1b5f45f045de16d6f2ac2be82cca1b,0.6871707%,48101.95
0x43cf2b7a3586b25ef4e5c6ee37e45d507b77f395,0.5878406%,41148.84
0x12b421887d6b4b05fd082e0a78ccb992abcb7f16,0.4871549%,34100.84
0x57cf16e10568b833aa9fb533f25bb7ee7f71bc53,0.4870578%,34094.05
0x77c69844f6ec66c9de349a8bd101f6c9ed4a2436,0.4646776%,32527.43
0x7d1cd12489a055104087074e58dc0a42437d4740,0.4558792%,31911.54
0xcba1a275e2d858ecffaf7a87f606f74b719a8a93,0.4073139%,28511.97
0x9e4d3fed183bc3de3a7104bd3679a5ff6c16cf77,0.3982726%,27879.08
0xe449898f97a885b57d2d11f35ea26c689f9ebec0,0.3935400%,27547.80
0x3d2a233eae3e8e7ea09609815d78d2b0d8c45a81,0.3758593%,26310.15
0xc8013d0f4be7839d506dee7d4df0ad858493fa71,0.3595103%,25165.72
0x370f4b2dcf75c94d8d4450b493661a9c6170d0b5,0.3463783%,24246.48
0xcb5c7899b9bec77cdade1ec4c4d981f8a789a65b,0.3272382%,22906.67
0xd5427f4dafe83e4d38cb26da093f1b4b1c1377c0,0.3059738%,21418.17
0x28ac6da1f3c536610e085cbb3b91664173a93866,0.2958897%,20712.28
0xa25ebc740218974d39fd24ba45c2a96329a30b88,0.2895649%,20269.54
0xacfa9d9fee11351f654a337a0e6eb997a957e53c,0.2698938%,18892.57
0x6d0172b6f7d07affc6deae8cd576aa87a4b67988,0.2616260%,18313.82
0x9d0eea86da9aac6bb1bfcf233dd0dfc2529e58c8,0.2361795%,16532.57
0x5bfaad4a04ab0fab6d206c9ea1144da886d31f9a,0.2206791%,15447.53
0x02afe5211cd9731b2e65bfc7857e73bda234f6d3,0.2191104%,15337.73
0xc2464b10b74fa1a4b015b933a3c86ed9b8f489e2,0.2103313%,14723.19
0x588349be5a33a6eab84403c4fd8487552ebe52b3,0.2076369%,14534.58
0xbffc3dd2490c44015c6ea06d62b8bfac7f666663,0.2064654%,14452.58
0xd6a231b64bb1351b209b45d21084efe5f5d3d56c,0.1896207%,13273.45
0x4e609a968abeaaf866fde46a400847a9462f5931,0.1866628%,13066.39
0xa7143609af1de44cc0e4631cb80b5a022d93ed5d,0.1861498%,13030.48
0xf89734bb137fd739b9e6b4ca95f80e1c50925d69,0.1796791%,12577.54
0xad734f6138ac4f44ab5f21b81fe73a6a2274f0e5,0.1783114%,12481.80
0x1222c2cdee2558addff353fcbaaf7db5a178c869,0.1749644%,12247.51
0x72a06efc66cf958b64c6c4a3c1810aa128b37e9b,0.1696615%,11876.31
0xc325e3501a5300d0716ecf0455b71765f243d9bc,0.1557004%,10899.03
0x1d4e027c56f870c27c660c4a201735afb142b924,0.1554560%,10881.92
0xaab2b7c70eb48c17f0f3b2c2b9fc22fa450ac87e,0.1484689%,10392.83
0x9e138c3c1249f1627168d02359a4ba82e5f2ebd4,0.1467479%,10272.35
0x7d0ab1dbade3a084237d0fff9695a46e927406a5,0.1445387%,10117.71
0x885038b6b2240e5db0713f4066cc080860fac333,0.1443269%,10102.88
0x015f9945f2925a84073f13ae761f4da3fd91f33e,0.1438697%,10070.88
0x14c5fbcb7511780102ba955b1cc4f49ae1d39bf4,0.1437811%,10064.67
0xaf4dd2ea9927ece14c7a7a2171cae54ca5ca4397,0.1389654%,9727.58
0xac207c599e4a07f9a8cc5e9cf49b02e20ab7ba69,0.1308492%,9159.44
0xdcf85862f287f1fcc2b37dd19bddb2350d639d01,0.1284990%,8994.93
0x7d374fe73fd8358a93c53e978477f7ba4129be0c,0.1203816%,8426.71
0xa89d88400fd154031fb2de6fb036e59efb8073a3,0.1197653%,8383.57
0x29a890711782777a40140b5a03bf0754d8b5f49d,0.1157761%,8104.32
0xedff0452a76e278ba7594d17264a30c26b56712c,0.1139949%,7979.64
0x38d62fc0d4ff2f4b41f1830a8fe7c4e04ae338fe,0.1136568%,7955.97
0xbcc5c7180155a055bf87d97531c4584d51074c8e,0.1073376%,7513.63
0x26cabc7528854005635a7f29c6929a691bbd07ef,0.1068808%,7481.66
0xe699e8334d901986d9ff6bc5ae4b44ae5122f1ee,0.0955095%,6685.67
0x308b5dfbf0b957c83649ef848c40b75d8c6917c0,0.0891068%,6237.48
0x330ad0d38e9c12cbc34d7cffefcd99e5530b6bfb,0.0882739%,9728.84
0x9ac847ae8bcd1c39a4fe895dce66bd023db78501,0.0822120%,5754.84
0x25da6c7d756c4b79a6aac79ccbc29662830ec9c6,0.0765183%,5356.28
0xd76b8855ffe9074c3ae82dd80953f0d6ff8ffe54,0.0763880%,5347.16
0x33c832bbdccd3188b0ec369e27bfd2164cb039fe,0.0737165%,5160.16
0x08fceec59fac483eac985bb7aad0a15647ce11d4,0.0733391%,5133.74
0xee9b08e86909f37402d9e72187ecac0aecd9f3df,0.0724620%,5072.34
0xd2060f1e2be9fae691e017766b17096c8678c812,0.0708932%,4962.52
0xa0a8338295e07e11f118ddc8e3f604b84cdf791d,0.0643270%,4502.89
0x1ebe7f849436ef8ca3a772d65f32001bc406b2fc,0.0635379%,4447.65
0x435c52bb29e3a8380ba9045db70910205a4e6eab,0.0628433%,4399.03
0x8114e8d393915a02eae20bd60c30e776e9f56d38,0.0609381%,4265.66
0x3ad0d7be002a7a7794a554eb42e52021a3897dc6,0.0609136%,4263.95
0x3f81483b7d37b964681a08f0d6cc0bd5caa6575f,0.0602668%,4218.68
0x640ee436595a931df1162b46e3bf4277b35f0a98,0.0601022%,4207.15
0x6ee5d582713085980b2510be127d8c56a814fa92,0.0597420%,4181.94
0x3538035de787ac6cf5c4379147af5f49a465eadc,0.0588962%,4122.74
0x5e55fedf338deeefa37ae1222cb34bb5db2250eb,0.0569256%,3984.79
0x31b47a0b0a98d0bb7524985577ec605e5a2a99d5,0.0557013%,3899.09
0x212f91cc94f6a08f050571e1ba9c7f9c6dd55533,0.0468832%,3281.82
0x9194e7621d724c0a6912f90fc0f7f88df63f732e,0.0466096%,3262.67
0x8bf33cbf9a37a42e62be918a772f8a5c95509dbe,0.0454792%,3183.55
0x43c4ff14dae2fbb389dd94498c3d610a0c69a89d,0.0453700%,3175.90
0xfcad996b1dd841914849fde990f4a8db75204c88,0.0451068%,3157.47
0xabdb07d994530426018099838bf00e5c67a753e3,0.0450019%,3150.13
0x9aeb84cc65e389af4bd238d0486fad72bc93de81,0.0444704%,3112.93
0x737d9c3086b7ec2080ebc4b9d30a16a1edcdf234,0.0439236%,3074.65
0x1a93c570251ec9ce34216af5eee618097026bd06,0.0420818%,2945.73
0xebd8d14a611572a17fbba75032f52b64e7ce04f3,0.0406164%,2843.15
0xe63211169b7fd5bbc1145200da82ea6bf2cd662c,0.0402925%,2820.48
0x50112746a0b45479554c802f9535da6e5c71a49f,0.0398519%,2789.63
0x83b8ef1b976155c046825e94a7b756b8ba08b0e3,0.0397017%,2779.12
0x499840a087f40e24851ad4327ecbb2ade2049bfa,0.0382157%,2675.10
0xef39e9960c9f5fb2b2b60f466d6bf88718e0ce09,0.0363732%,2546.13
0x0d273523be6c44a1047fde9f0230cf169c37fe5e,0.0362182%,2535.28
0xf9e30fa66870504a420da74814299d284b585cfb,0.0361964%,2533.74
0x5943b88215da80e956fc251fb986fc213d06aaf3,0.0354703%,2482.92
0x719eb63a30bfdec25be918ea03d1e57202f446e4,0.0348615%,2440.31
0x19a46c6913f1431efdc2164587aa6c3af01045f6,0.0342129%,2394.91
0x67bf14b2fc8c66eb3c6b919d68e6fb83556538f0,0.0335039%,2345.28
0x1279ebfab0d7a28d25e28b8c3739ef329b0d25b2,0.0329270%,2304.89
0xfdba33044227fa1f76abdefad697b8dfbb24a132,0.0324275%,2269.92
0x98bc87ff17dd9aac11ea17868fb6b0ea44c4945a,0.0322104%,2254.73
0x4a8f50ccea8516455523723258de5e43615c1daa,0.0321373%,2249.61
0x57da7edd009820e167650ff79ebe44195bf9189b,0.0319528%,2236.70
0xc479d884d19fd086d65304ae4173f4e575975f50,0.0314047%,2198.33
0xecf1834e9fa20d87f66002220b7de59ae0fc671d,0.0294537%,2061.76
0xcb8f77285750f0bfef6d597d8af6ccb3edc97959,0.0292822%,2049.75
0xfc2ea617f5214fdb17caa576837cd044b93959b9,0.0291542%,2040.79
0xc87edfeefb5af5c802478d81c998f89e8aefa536,0.0290259%,4933.35
0x309e25f886bb8023c0e4e2479f2e636af4310fb4,0.0287570%,2012.99
0xbee2d469aacb46251ae33cca91f482e26c971dff,0.0268336%,1878.35
0x24be7d398e09b054a00ae6c1914081da50ba2a4e,0.0268141%,1876.99
0x9fc8024682eead9139087778c8d5ab856462df7e,0.0264516%,1851.61
0x944b1915ecab9bdf767a4ea6702f0ead69a1651f,0.0264362%,1850.53
0x379d92924fe31aac58d039ffe60215fd3a2b773b,0.0260176%,1821.24
0xbde7fd4498bb076eb0b6331b883ce0d1a28430bc,0.0258005%,1806.04
0xe97fecebde0e222c4dfded8f9da7a8dd8f8559bb,0.0236365%,1654.56
0x0f1167005bae488c92b393552d6c3940e0faa474,0.0233142%,1631.99
0x2cb84580f0efea27ebd322b10216cfce7bc173db,0.0222049%,1554.35
0x64b07802fb794c8e7519589e85ebf67da10c9f0d,0.0217268%,1520.87
0x34ca6f98fe44e12940937b0a6c9820a4eaf5db96,0.0216316%,1593.92
0x280b7f97d9b023288e4c3ae1563ce6830febd4bf,0.0215773%,1510.41
0xdb2edcc7880f0071959e2f6713cc335a6690fc84,0.0210971%,1476.80
0x368d849cb6df635bd0a2eb351e31fe0b11e54f6d,0.0209965%,1469.76
0xb124956999c07f64f3b0b147d88895dd5b457eec,0.0207736%,1454.15
0xeb4879a23c86bd16c95da353e981c66c81f31c00,0.0201580%,1411.06
0x266825611d608a24d29ce6a463004788b77d69f6,0.0200712%,1404.99
0x7f55ad0ffd96dbcca73e00059d6161f9e7643e11,0.0188891%,1322.23
0x99493f932b74db2bda0c404a7ab8b3bae0801dc7,0.0183413%,1283.88
0xe0f8e4e1e24ac3e3f1cecfdc06d80b6b05702d86,0.0182017%,1274.12
0x6158163face033046dc3773df300972f489d42f7,0.0181960%,1273.72
0x0fa69f691cfb175f791695700966fc3e60524998,0.0178001%,1246.01
0x6d1e0084a6910a8803ab7c22483a1a2db3f1001a,0.0177633%,1243.43
0x8ec631a43a27574101bbfebf86c9c54a5d92eb73,0.0172580%,1208.06
0xe6ea95328223dd14232c5666ad3652592b2ba3a7,0.0171330%,1199.31
0xe1b9c660aaa7f3649781b9b79704b93d4bcf4046,0.0168582%,1180.07
0x3d91ad906c3969f86c588c988f721d5a735c6f81,0.0167201%,1170.41
0x008c66fcfe25bdc585272d2114374dc2198c3fdd,0.0163047%,1141.33
0x0ae4cc61196507815eb50e97374539e675200418,0.0160131%,1139.37
0x33482ad919a79b7f17ac1371a4afa83a179005a0,0.0158445%,1109.11
0x01223843daba104d5cfc48006a8f22e777148971,0.0153746%,1076.22
0xba0635a678fe4cf89a0cb9ee14db1d86941c832f,0.0152693%,1068.85
0x66697dabffe51a73e506f463b27e388512ed6ecd,0.0151744%,1062.21
0x917fe0cec2cc73098abd2a9fc3dcba26f4fdd911,0.0151267%,1058.87
0x77d9439ba5b260cc04d047789b6b5012905c7f0c,0.0150888%,1056.21
0xc9c17b24a3e97783c018ee20259502341ce09732,0.0148607%,1040.25
0x0f6d1bd42d3fcbaf655d0994305234a043838fc2,0.0146338%,1024.36
0x5a2c8cf5785ccf3f3026a3291bf483eef8d55a74,0.0144458%,1011.20
0x1fc310f45b5b22a8e95a8f0e1fcff9d3c825edc6,0.0144143%,1009.00
0xb1c39123d7775b342acc4efeb4b0bfa1f0e54bff,0.0142118%,994.83
0x66c1b756a03e172416d30ab94a703c739a1adac7,0.0139872%,979.11
0xb49a51273De411b01025B0f97821D4430E6b1e05,0.0139645%,972.18
0xbc622c6bcc9200c68d525adf5c8b1b9c3d1c6de3,0.0137424%,961.97
0x451785b3f5fbbba2388d8cdeded58251b6999d91,0.0137168%,960.18
0x759b81acc98464fc508d3296b7aebd5410656cd9,0.0135404%,947.83
0xde2d7f9f2489bd8976fd0ad39d4360f5a0c3de74,0.0134712%,942.98
0x6f4fa96cff93a827cbe962f756dd29ca2c8c43ec,0.0134044%,938.31
0xd74443f25c310a880d2a1bdacf075c4ac5ac90a7,0.0127613%,893.29
0xe9b1e78cacc324973330b960550753102ae229e6,0.0126280%,883.96
0xc5a0b5a6cac7f859099589c2a1f6d4f3a315f85e,0.0126036%,882.25
0x53148980fd12511e4ac5dd8b341de063f9588406,0.0125349%,877.45
0xe120be880d79aded4cdbf6f2f9ef880987c82dc8,0.0122277%,855.94
0x4cfb21a126978af9609586da43e0b5d0a2aafdaf,0.0121956%,853.69
0x17e071372ba2c7ec0d21030e27db41e9ab74b2eb,0.0116711%,816.97
0x3063500ba2b5bfe899a02a4830cb8c43cea16283,0.0113348%,793.43
0xc074887d140e276a8b892222f925440eaf3ff40b,0.0111184%,778.29
0x2ec3f80beda63ede96ba20375032cdd3aafb3030,0.0107106%,749.74
0xf54eeeb761f18da84a0c8162484ed32b7d490716,0.0105909%,741.36
0xa3369be970151d7fd21a65375793e414f8c062a7,0.0105613%,739.29
0x34ba165d5311ac5de65a652d033332213c63614b,0.0104153%,729.07
0xaefcbcad09d299e7292f810a38ccb067b46e32ed,0.0103761%,726.33
0xeccbacefbdde4973a9589ee3b5a8149e525016a3,0.0102881%,720.17
0x20542ca974c0076d381781f5f9a8e7a311948940,0.0101449%,710.14
0x118fd113a7c081f43351d6fb9a9410af9e0cb4b3,0.0098879%,692.15
0x0e0221fd6dc9a4455d00e6d174aa1f58fe579cfe,0.0098811%,691.67
0xdb5b8b9d58324b1e08d66052baef6f1f38a078a2,0.0098373%,688.61
0x36c4c53bb6b0b8c59e98b35a1eabb5d43b5bc27f,0.0097509%,682.56
0xb9fcb3a9f04d018afb7539f1940b38b7dcaffa3b,0.0095814%,670.70
0x58270e866059bb2812a886c145f14846f28ae00e,0.0093400%,653.80
0xcd1386e63e7fd1326651b8e1eb7b119cc443d470,0.0092656%,648.59
0x179916c07eb0f064640f4fbf2acb55e0543feccb,0.0089984%,629.89
0xcb58e5b910d260aa1e6cf55fecc5261868cca570,0.0089570%,626.99
0x3f6e4667fec54733fb3b15993b9ce96b69b65cb3,0.0088745%,621.21
0x7f825692dfae7107d16bf4e2071fe06b1bc72297,0.0087177%,763.47
0xf04fd9f9eae51aea8d53c36034aa8ea9719c8b21,0.0087133%,609.93
0x97db0e57b1c315a08cc889ed405adb100d7f137d,0.0085656%,599.59
0xce02c01ad67bf8769d598886d6b68767d3d1f1a9,0.0084341%,590.39
0xe9db81a85fdc1f28239bdca8d3054ad39f44a8d5,0.0082306%,576.14
0x922d92e77293e7d65300fa9478114c73ea6ad6e4,0.0082279%,575.95
0xbe43c089e796dd787e5c3a77553cc26ef46c5b28,0.0081436%,570.06
0xfede810b234d7d5ede52c6586321564d9657d0c8,0.0080072%,560.50
0x8ef4da55cee19fb2c3a84b6e08a6a05b7a86526a,0.0079754%,558.27
0x2951b1f7058bd2c05f01954002c450bac0873847,0.0079717%,558.02
0x10b9fe14e8bb8258102ac18ac37df078d42ee0dd,0.0079338%,555.36
0x13b614c3f16f6181ea87e49f567716746e0fa60a,0.0079290%,555.03
0x9fb1dff1e9d8532a01f71bb03de68af64a12075a,0.0079178%,554.25
0xeb3f3f5b1ec4430451059cb6bddc984f723c037a,0.0078613%,550.29
0x28a5e43ce78ad9c4fcd1f291e0ff7ecc7d0427f7,0.0077287%,541.01
0x43ea941ef5ba9887aff462650244588a0f3e1c7f,0.0077134%,539.94
0x3a4ef77aaa11c9023a4d4773ecf55bba1b71c0a8,0.0076890%,538.23
0x74f2434554066a3ce9e5e400223d74d9cb4524df,0.0076660%,536.62
0x7a3793b3ba766492d867f374cb7e68443de52562,0.0074910%,524.37
0x3e7b8d12d4de6cb284a7d60bf92b462d2a6d6a2f,0.0074565%,521.96
0x57513812cfa13ccf9b1e86d181c78591d233cfbc,0.0074066%,518.46
0x64f684c2d58dab168d74b9de157fc82a082a03d4,0.0073286%,513.00
0x835f394f3d770b6ff818303f045e39f541b3d781,0.0073100%,511.70
0x329b0f4597b15cd81d6f62dcf2ad6b3fe1d74d87,0.0070784%,495.48
0x7809192c46a28c1ab87adde354fb7551a6b2b588,0.0069915%,489.40
0x40950267d12e979ad42974be5ac9a7e452f9505e,0.0069819%,488.74
0x00a2b91e018094ce830a3ccbaa0b3decb4b76fc9,0.0068996%,482.97
0xce7b3784681e21c468e5333f5a4836182fdcf7a7,0.0068112%,476.78
0x6d4ed8a1599dee2655d51b245f786293e03d58f7,0.0067555%,472.88
0x14ea8c817f26f0e2c7f93bd4391c4f1408c22792,0.0063483%,444.38
0x0a64bbd356427eb95a46da770669cb98b535b0d7,0.0063095%,441.66
0xefc1ad4d6c721de3798ff989a39181b982e80d8e,0.0062689%,438.82
0xd4d00a14d2d3181dbebeaf062933d150e9bafb27,0.0062209%,435.46
0x076a10a7b9dff849672de8cc180e767bf568408d,0.0061841%,432.89
0x3ec10a7cdbd1f60b7095b2abf66d4726589c4c95,0.0061662%,431.63
0x3342fde8408DF70bCe2f0Aa6a906bC5F7E9a3f66,0.0061400%,430.73
0x497831f4f242b1caf7ffdc494f731217ac658a17,0.0061149%,428.04
0x25c01bb79772c9115dde231b3405c31f99117e2c,0.0060975%,426.82
0xdfb0348f0d8200ee2eb50aa4755f690dc3165b52,0.0060429%,423.00
0xa63bca4aa47e42498889ab5185336fea54835c7e,0.0060046%,420.32
0x7c361828849293684ddf7212fd1d2cb5f0aade70,0.0059805%,418.63
0xb837efe33ad60b2c720a79b36ad81f9e3ad4682e,0.0059666%,417.66
0x6d46343faedd7455085bbac679216122a518d927,0.0058872%,412.11
0x432d5c6232a824002e74be0713d7be666d43e4f0,0.0058753%,411.27
0x00ea67d1e6cab97994e75c800bc65bf632598802,0.0057675%,403.73
0xbe93d14c5defb8f41af8fb092f58e3c71c712b85,0.0057407%,401.85
0x9665b6f0cf162792851a902e452248b16f2f4b5a,0.0056706%,396.95
0x99ae7de79ef503f88885f81b0f05a738e7c7de8b,0.0056540%,395.78
0x2eeaffe1422d1b46c564b131a1f3d1a685f279d1,0.0054230%,379.61
0x6ef4f698e9ec7d2f13b91042892bc2bc0fc5b7cf,0.0054070%,378.49
0x5250e04ebf05df70ec8f51d06012a1cfdb564204,0.0053861%,377.03
0x8d02f47ada375c301186fd212947f84097be852a,0.0053698%,375.89
0xa13c2def62c36697407fbe7d574e946bf60d7350,0.0052427%,366.99
0xbcb1c9373b1214ce96ce847160e33660aa293fc8,0.0052183%,365.28
0x3bd5e344ac629c9f232f921bafdeeec312deac9b,0.0052076%,364.53
0xff7b72efeec158d0d14ce3f85af559df81b53ccb,0.0050898%,356.28
0x8450a7852495dafe063c3e436d0750698777965c,0.0050643%,354.50
0xb89dee0a18e95e115cc12dd36565311d7fe09242,0.0050637%,354.46
0xc3e1e1358bda2a0c0e610b33871e6ebbf1523a58,0.0050121%,350.84
0x74c4c82ad166b621fa60a730c9d414fc17d33db3,0.0049947%,349.63
0xba11c4d82a48638af9bffb941d6a9b515448c7ac,0.0049880%,349.16
0x3778a93649348181368097fa9a22f2750eccc0bb,0.0048976%,342.83
0x496ea957960bf9a2bbc1d3c114eaa124e07d0543,0.0048607%,340.25
0xd593fe506c63b263fb8a171608c9460e07c8b171,0.0047911%,335.38
0x279cb92548f28249c7c1084e36fdac27b9655e96,0.0047606%,333.24
0x58e6884f4c0c5f8114854ef7322b4cf03086f1fb,0.0047358%,331.51
0x0740655604a8d15dafd78d4dfb335f4e8016b369,0.0046942%,328.59
0x5c07e5e19a8b2441c938054aa804988c42723041,0.0046389%,324.72
0x7191bcceed9860a719e4b8ef622d420c10486b85,0.0045860%,321.02
0xe062b15b567083486769c8c65ffb0d6c10f40ac3,0.0045234%,316.64
0xd06fee44914f8047525cdc726f2b805fb409a3cd,0.0045148%,316.04
0x43cfa56c89555c45ff78200f39ec4e59deb1617a,0.0044592%,312.14
0x8d452c1f4bae385b13933c83ecff70d74229915f,0.0044201%,309.41
0x27e9531d81e0d89ce04394e233d406256d66d36a,0.0043042%,301.29
0x04c41bf298d1e486dd9022231d925dd4f03f8d71,0.0042805%,299.64
0x3d9b0a7ef1cceada457001a6d51f28ff61e39904,0.0042462%,297.24
0x4b7292679d439ccd83b972a5ff848b47391affca,0.0041566%,290.96
0x58f74a69e24087deade4db595c4dcb5b2c1448b7,0.0041476%,290.33
0x3b592c1d44327a5d05ba415262f7e6179f14e77a,0.0041360%,289.52
0x72511ec3f51c67a3658f947d4ebf1067613c1813,0.0041327%,289.29
0x9cc2611b694dcc926aeb7a741f69d78aa9b58326,0.0041202%,288.41
0xb4cdd9ff9f72e3a6a9e688579f5e8a909c23606d,0.0040866%,603.55
0xee05f233245c33150fd061f732bd213aee0ec3c7,0.0039656%,277.60
0xe95c621e026c605b80f51fe02cccbfa389689c6a,0.0039376%,275.63
0xac8186e1cc837a24b631d444bfa572717fa02cf0,0.0039326%,275.28
0x7ae299a8358b00316e7541ed89c7c608893d9d8a,0.0038296%,268.07
0xb50a4b3906ca35e14199dd78edad73f07d6d4c8e,0.0038088%,266.62
0x8f2c46ce880c288bbf0926123814496a9842a591,0.0037295%,261.07
0xf7f7268dfbf6eebada9e73f752e55fd10a8b1777,0.0037150%,322.03
0xd44bd5996ce9e6d1f01388878ed02e3ceb49925c,0.0036951%,265.62
0xa33bc9b67f76ea6ed26776aba45bebe82e85ba3c,0.0036554%,255.88
0xa4db78324c1e337e287d109785c64b02b5aa785b,0.0036285%,253.99
0x19e3b266c124be15f120b58efd599c59a0166a0e,0.0036273%,253.91
0x657a38e6994cb578351376dcdb077330d00665d6,0.0035521%,248.65
0x25908476112081fff90380187599d572ba8a8117,0.0034940%,244.58
0xf16157f526a49c8bb072e6262d8a9f5f76f75317,0.0034356%,240.49
0x8366782726afac41b1b38761094f2d93cbb8e2d4,0.0032969%,230.78
0xf9cf8775cd6697c1bb52fdbd9625c8f5fae6c62c,0.0032618%,228.32
0xfc8084cf7e0f916f114f9bdd8a86ba2427efe976,0.0031751%,222.26
0xb29a3297a74319a06f787c341a4c3ade053fdd15,0.0030394%,212.76
0xb19ea489b141ee9ec1dfd904c49107535b31bf68,0.0030338%,212.36
0x3c5aac016ef2f178e8699d6208796a2d67557fe2,0.0029879%,209.15
0x4db24e856f34485bd5ae33e3885cd2e78f6ad252,0.0029713%,207.99
0x4713d599b17a04325e7d5e6be4f22f0224ec16b5,0.0029604%,207.23
0x668b4a53fa70994a43fd007f42e9ba0c577044d2,0.0029243%,204.70
0xc936f8bc78a04970af38a1e5638c6080a876d897,0.0028852%,249.39
0xe96602885ab28110de239dd6c5d5038d005f30eb,0.0028423%,198.96
0x1c39c305742687aa8e3fafa91635e26861302ceb,0.0027871%,195.10
0x1e048b156383ec6be20bc5438e7dd3f3e03d1025,0.0027106%,189.74
0x5b1b5d7f419c8c26a6ed51b46db09ae6376a82da,0.0025741%,180.19
0x06987a693833bd605307592894f4ff7695614d3a,0.0025449%,178.14
0x3b1594b3baa8e6602b2bb21c7875df15e0298dda,0.0025000%,175.00
0xec7372db51f9a162c3c9fa59a2e2004837b86622,0.0024753%,173.27
0x581de43b0273915f61d015e394d2c6af1f9ce8e6,0.0024712%,172.98
0x47c4ca0b9caa796092c87f5a65e41674112328c0,0.0023935%,167.55
0x8edeae4e41cea245c2e4faafe490ec9cc1cae9c4,0.0023245%,162.72
0xcdf5a1ec4d4830fea53860cc5ce779623101a485,0.0023047%,161.33
0xd8d435492ca5c2cec8e50721b8d1b37bc246c895,0.0022978%,160.84
0xb1535a47dcc649d7447dfa44cec6ca01db4b8049,0.0022974%,160.82
0x89ba6516ae678d96f0ebe584fdea9e888401404f,0.0022904%,160.33
0x8fc70cda8a72e8c83cd8372009e2cffa2ad95f5b,0.0022497%,157.48
0xf8be04ebddc05bc7364c65a6076ef6c04fcb5847,0.0021542%,150.79
0xbf2c173178637818cd146b1018cc0a49207be032,0.0021357%,149.50
0xbfee60d23c6b3c6e27611ef7e2a9ac803d07f9ba,0.0020234%,141.64
0xcc0960243d099bcae96c0d1aeacdda01434d2ebc,0.0019965%,139.75
0xf197408df45bb1e46adcbc8da9ae4bac0a90c688,0.0019901%,139.31
0x1993458d944eed551a301e5db38c03608e12390d,0.0019888%,139.22
0x28560d559eb3b0979014bece990bc992f33a928f,0.0019698%,137.89
0x7caa00a64b447ec88583b1d7675fef942e1d1ed2,0.0019466%,136.26
0x25e457d59eb0a4da5bc310a3d05702eecc940fcf,0.0019402%,135.82
0x9c9922affeb78838223b3480e80a165174987e8c,0.0019402%,135.81
0x5b989b4e384011a097601d5d5d2c049375f54541,0.0019401%,135.81
0x4805ece841434bbb75381bfae28a4da18d619d52,0.0019042%,133.29
0x9053e55d332d41bac9789d9e8027cec745ea42f4,0.0018818%,131.73
0x641d7cb3c78ce9757b578d07718e0a26d6edb7c3,0.0018687%,130.81
0x7746812e0365a5c0b820aa51832fd4718a1ce327,0.0018389%,128.72
0xd05b9dd5a631b48dfa7bdfff7a3fb700f08aac82,0.0018030%,126.21
0x7f9f23c07c7473500345a46e5dfb5d49d26f7c88,0.0017324%,121.27
0x65115c680d2e56b07dcb95c5d63750dd97b5fc6a,0.0016325%,114.28
0xb1ea6afe0827d9588958fb8926be63b8dd2f59a1,0.0016307%,114.15
0xf3e2231de65551aec276f8972f84250622aaa24b,0.0016264%,113.85
0x713a0452edb2973921dcc41e2fd1a13f61527d09,0.0016243%,113.70
0xd0d211f28f0116161abe9334476dc3fa32115fe6,0.0016123%,112.86
0xf925cc2cbea0b2b30aef6c29ec0c77d7cb6fcb6f,0.0015914%,111.40
0xf82e8bc7e11a22b5ab835ca25a477203a97bdb16,0.0015565%,108.95
0xa607746bd0c40f401feb724f74f2465cf30bae59,0.0015504%,108.53
0x4fb1453361450591a184e53ea4ee9563ce27bfcb,0.0015448%,108.14
0xaf912a4aafeba1f1e459a3f827e0d3b52ce034c5,0.0014862%,104.03
0xc1c515f7a74b5667bc1b65b2f74f46b3d49bc641,0.0014748%,103.24
0xfbe0dfcd5ae65364cbfd4d48579fe92471c1adc4,0.0014345%,100.41
0xff8db8afb5da4a676534f3a31659ca2f0fb2adc0,0.0014256%,99.79
0x6c8e4d6f376336871821dbe369bfe444fdd1fc99,0.0012912%,90.39
0xbb5432c9d47caf40e7df32cb259d977e12b79586,0.0012674%,88.72
0xf814a8e1607aa1d1a33f42a4c9b3b67eadce45bd,0.0012575%,88.02
0x7242281317cdb2616774e3b6d3176466009a68de,0.0012455%,87.19
0xbb928353b41d8bf670ea24d8278e702d4d57195c,0.0012266%,85.87
0x0b819d7d673e772ac47c6a02f0c85c568ca2ef0d,0.0012194%,85.36
0xd34901a7b2b6cc659a3f122d9d6dcc9257ab1337,0.0012143%,85.00
0xdebadcaa7d794953b91731ee5a3392f83e6a30d5,0.0012032%,84.23
0x526a1fbaee7efbd2b0bfd44c4b2c8e3ab2ef8e36,0.0012027%,84.19
0x0974bf6913c762eb143ee7a1e244166e4eb2b5a4,0.0011779%,82.45
0x950257f721cb8c2796298e04d83b0d1095ab71dd,0.0011376%,79.63
0x000cef8f0ab0a2fadbecaeb92e8781ab3e04b01e,0.0011247%,224.34
0x9d717d6276ee027b999e48c0b130da0f9e02a804,0.0011242%,78.69
0x9012ace3e33dea2f87071fab7c341356b4c23aae,0.0010878%,76.14
0x80e45d56ffa67b5179e564f418f752b5010923d3,0.0010768%,75.37
0x5a4e8d905f5fddc05e3004686cdb270f742c3280,0.0010668%,74.68
0x2055a98e0100d0b487ce5a901296d59ce2f84cf2,0.0010183%,71.28
0xaef12f22a9aea8e101bb07959bd94ced3a55d70f,0.0010180%,71.26
0x90d2d607acf25ef0d3e1b0c18f1ece1f47c8b0f5,0.0010001%,70.01
0x3f6d22192f4e56931fd4e7983947281da89cdb4d,0.0009998%,69.98
0xf8dcf631f511052e8204d25259e4ef3a33e02434,0.0009925%,69.48
0xf636a2c4ddab863261666dbffeb4d489f79f02b2,0.0009671%,67.69
0x52366339e6e1db481ccdc43dda24cad756cb9570,0.0009456%,66.19
0xac3a0c9c643d00c694d4c7a126afa834a82298ee,0.0009456%,66.19
0x2b2b75656e58216562bd90d06a85bac506519c4c,0.0009456%,66.19
0x6a473bf5a530cf766af865bcb99f7945c344a97a,0.0009456%,66.19
0x6a9e955fc7a289bc2eed204544b7981f3de3a1f3,0.0009456%,66.19
0x9e5bca800d6cfde3f0e15bbeecf1a936e9dca15b,0.0009456%,66.19
0x9bdb1ef8f7bd6919042841e6e47d2e8318c0b83a,0.0009455%,66.18
0xe1699459fdd2a49e136f55d84beb98e5a1161995,0.0009454%,66.17
0xe23da0be88c9b56c815c0525e5c1c687a99a8def,0.0009451%,66.16
0xa6f603974621c138a45aa02fec91f0f8367b267d,0.0009239%,64.68
0xaf2c5f8e882cc3e344e43dc3f4f20ba2801a2dd9,0.0009073%,63.51
0x33a8424a255d12e18939a977b1ececbf23a2e4cf,0.0008996%,62.97
0x98923f41e72e760d3c3c0904707112aa4e7e5098,0.0008613%,60.29
0x22c3c7e9ddbd7dc08bdfcbd0b8b686af42facf1c,0.0008144%,57.01
0x4c1b55215baf5bd85257320992599dfd07f23fc7,0.0008084%,56.59
0xf504103c443d277a96eb75fbed363885638f6c32,0.0007953%,55.67
0x57ed694d912079c27496a5edbd296b1fe21afda7,0.0007657%,53.60
0xce6c0bd926a76d715c829be4965ad064447d754f,0.0007598%,53.18
0x5a56e9ab6303794224ff8ab1c14bf2a5c26505bc,0.0007534%,52.74
0xc8c0442132834730a8e06cfcd5be92380a28d53c,0.0007354%,51.48
0x9076be049c795300266052da9e12cd891ae9ec57,0.0007345%,51.42
0xc6e4e5e02131f27d3804bfbfc03b2696abc84c13,0.0007252%,50.77
0xa8e3a303fcf17bea14f7d50a1132d5febbc7fce7,0.0007199%,50.40
0x48e5f77dc7e8bc570b02cea4512d9a3d03f1d6b9,0.0007138%,49.96
0x61ad8c37aaa95960097bf4e72ad3c22de94f5c86,0.0006759%,47.31
0xb13cea39a360d03198d8031ae00bc3150bcf598b,0.0006369%,44.58
0x69b6165dc97e248ee23d8d29e50f85db4c9baa43,0.0006127%,42.89
0x5bd30ab3e55b453d66534192d9ff79433ff06cb5,0.0005861%,41.02
0xdb2f3ee3e8344b0fa3a8afc4b0811b6bf8ebdded,0.0005781%,40.47
0xf7915de42680024afe33ddbd83efea194af56a2f,0.0005427%,37.99
0xfa160e9cd95900acd4a2531ce093683a1e7bcdfd,0.0004875%,34.12
0x8a146531630850fe1d158c922bda620bddf12766,0.0004760%,33.32
0xe637115620d7b3b464b20b8a8f6d9cfcba486dcc,0.0004703%,32.92
0x9f985f2363ca31052a939c0d157217d280cb6cb8,0.0004621%,32.35
0x76ca47c52ba20b42f811cf41765b074e4692ac70,0.0004581%,32.06
0x205b993bb19930c80fb10ddf4f4c423e49c4caac,0.0004434%,31.04
0xe9ea3b6556db9333646f404a689dc9a5aa50a756,0.0004240%,29.68
0xda60ecb0d78f2e37eeafac2edc14dd4702a02c94,0.0003923%,27.46
0xfa000ac96119db8ae14f89f86f5e2948af19406c,0.0003699%,25.89
0xa4a5351cd678ea8d51fb5c308241b8a6c1772a06,0.0003429%,24.00
0xe29ce9872c7838b5e84ecbe488ed76af55dd9927,0.0003409%,23.86
0x441ccfa3cabe64e457dedff3fc6b873dbf32fd00,0.0003306%,23.14
0xec200aa586f8c31f699871c46516c10da432e3bb,0.0002398%,16.79
0x9a44394ffd96a78d0b5c5b2f5dcff6052c70176d,0.0002226%,15.58
0x01c95dba0e5deb61479e3faa19e98d74d973f410,0.0001455%,10.19
0xeefd6a45e6f54fa1755cfbfccb166fab1d90559b,0.0001351%,9.46
0xed26b14762edce1d38e17b94afbb810a441c08e4,0.0001216%,8.52
0xcc7e1b524ac0513417e1e1ee219ce00b90503001,0.0001018%,7.13
0xb65ae5e1aa778e77f6cc5dbf1f7dfeb7a250017e,4.1060360%,287422.52
0xfd27e47306bd515c05b91ca533150191ad0f313e,2.2194531%,155361.72
0x63c8486f66dacde8dfb18ccc9bbcab956f79ab96,1.3088739%,91621.17
0x9429b7c7923a569104c1b26c5b2343eb3f510d7d,0.9338316%,138072.33
0x363085d9ebc20715fc61c3337f293b7940529e1f,0.8211880%,263104.2
0x93c686de8ec7addea7f743761c41714e5862d572,0.6853772%,47976.40
0xa2a2f2ddda58b1c9b7c9b9cb8c775d2b4a92c9f9,0.6234219%,43639.53
0x5da084f434cf067675e98d4f592c438a251fb454,0.5259164%,36814.15
0xbdb76d5528295381db8a085513696413e835a87f,0.4997286%,34981.01
0xce0e30cbcbebbc05d3fe7f7a4adebb21041bb1d2,0.4687480%,32812.36
0x05dc467b8173a6c4e8fb222df4e6b3a80b9d1673,0.4564243%,31949.70
0x98a23edbc5cd8827c797f8dd7e3a7c1c5ed0909e,0.4241200%,29688.40
0x8ee4c695f64c5f0e549634a9393656f8a6f5efc6,0.4227752%,29594.26
0xb6bbb8290014850f2b2a415dabc8c50de9254ca7,0.4102825%,28719.77
0xce419e83e19d11a1ea4e0740190072babbfafe4a,0.3196604%,22376.23
0x2c362fd5bd900b73c4bf140b7cd6875a56b0e7b6,0.3134471%,21941.30
0x258e559762265df0262d79122632c853133aa7a5,0.3080474%,21563.31
0xd1c2af97082bad9612224fd5bd72038df9efae15,0.3031756%,21222.29
0x6e6abb4a0b481781f38f2c61ad46396791324567,0.2840305%,19882.14
0x0575f474ea2c0420c40799dbe125cbf7efc47148,0.2606465%,18245.26
0xdb0ecae825fcaba74518326d1d6a57eab7a2321b,0.1952002%,13664.02
0xf78845201bf2e074d6d565f7453f15a1f2355bbe,0.1892583%,13248.08
0x08b5f2e81dd6a935baaabf4fa71019048dd40b66,0.1836895%,12858.26
0x8482bb7227d033508b33dfd7d50bd7006b285db8,0.1596326%,11174.28
0xac699693aff156480bdf9b728d025da059142a0b,0.1586551%,11105.86
0x076729967D582681831a8c7B2dF53B0E51cD9018,0.1532215%,10725.75
0xff43ddc30bee825873c2453185bd9c1e131edbe6,0.1487263%,10410.84
0x96b9d9a5cfe8c572def7588d31f7921138794e24,0.1399318%,9795.23
0xcff9a24208707496bbe5283d0544dce29219602d,0.1384893%,9694.25
0x4f9b05de1ede545c10903ff7e0aaac7599313e43,0.1363946%,9547.62
0x3ba3893fde7e06eaf13a4c06e190147b867c82fb,0.1353462%,9474.23
0x2f7a9223ca8ccfa212ff200e4928ffca30786d16,0.1319768%,9238.37
0x7af0d160d04111cc528ea61d5d8a9bf12cbb64df,0.1254250%,8779.75
0x76531a4ac5ea74abff672ef15a3052ce07694c70,0.1230368%,8612.57
0xb2450afd4a496288aa15031d499bfa940e053df2,0.1224383%,8570.68
0x12338df678128f02488eda555380ddf7ff0670ac,0.1153796%,8076.57
0xa91321e072c96ea372442e389c8d048647df00e5,0.0931245%,6518.71
0x1bf518dc0b82124eaa3c0ad8e7e8ae016e9b9640,0.0803626%,5625.38
0x7b5957abf4dd7a3dd63c5313665148955cc7628e,0.0786210%,5503.47
0xa24b04b313f748cfba45e2c78fd507eb85deb17e,0.0775374%,5427.62
0x4263706c751f74fd93d32cb7c88ffeb2a151bbfc,0.0761096%,5327.68
0x11ae70a0559fa929275c188ba8cf285005a59649,0.0733370%,5133.59
0xa68b6f9f2b0b6d89e835e744448022ebfef42f6e,0.0724762%,5073.34
0x72eced3d01e8854b1f6d79d3c3a507244d6b770a,0.0663443%,4644.10
0x98753bbe85db73a2904eeed445fed40d92999870,0.0653059%,4571.42
0x6f1f2bd6f3142ddda28d5b7ba4f0250c68d51cd4,0.0646407%,4524.85
0xa98fd851e1955fb0b7ef30baa0d4775ade85f78e,0.0612541%,4287.78
0x6ac3bd25a69098afb731639109ee04368981a8fc,0.0597551%,4182.85
0xcf1d714e94f36c3a5248d09b4ffb9d7a8da0e862,0.0578227%,4047.59
0x66e049f349736767e9a2ee0988e319cb61d0fa4b,0.0570510%,3993.57
0x4c05f570eec7cf254e87ac67e7116fc61b897ed2,0.0538086%,3766.60
0x063d8291346f8877a0ef0c593c481d564f3af511,0.0533683%,3735.78
0x8bacf86066d0e1fa13d750712ec155672298a0b4,0.0503635%,3525.44
0x91c59bb43d2599e9b8fa9ad3889c5382a4910fc0,0.0478794%,3351.56
0xab6b132dd2836478db15576c09cd48e5a98009ca,0.0417843%,2924.90
0x1293cf6764852a8f43da6ebf9f379e3020829e36,0.0406512%,2845.58
0xde0ff909dd702436ebf313c6a76a74520f294508,0.0388498%,3830.94
0xfb8bb1f34444c4e288ba6e43a85a1d363c369e49,0.0375603%,2629.22
0x578768d2c7c5beb60cccfc148a563c8378e281ec,0.0366697%,2566.88
0x0e9b353b5fa70146730a56394c997b6354f381e9,0.0357133%,2499.93
0x2b414f861a1eddb611d59ef1a7438181b7572742,0.0351584%,2461.09
0xe03572c07143d3417f8692073750e7cc584c7be7,0.0313113%,2191.79
0x7cde8f2ffb56a757a5e0919271b95fc34b5d393d,0.0310550%,2173.85
0x18907a779cfcf032be79e9f638319a10861fa41b,0.0295068%,2065.48
0xbf3a941f817471fec46c73035409efa899fe401e,0.0292160%,2045.12
0xcb8054d80adbbf461550ae505302b56fe81596c1,0.0282975%,1980.83
0x9aac623163472f90e48032aa1205b0af0b228f46,0.0279520%,1956.64
0x6fbafe23656dd7b55c7f1b1f86bc2ec2a07a98cc,0.0265743%,1860.20
0x735851d10d1fd6be1eb1c80194dbce4a9539160d,0.0256554%,1795.88
0x1fa8501dbcb2f553ddf6e2c8b052a8e862fd2c11,0.0246047%,1722.33
0x452678438780319797dacbab4fd79c76bf1702b3,0.0200336%,1402.35
0x826bbdd37fdd52a4ca2ac042780ec2caa67ba4f7,0.0196661%,1376.63
0x37bef083d6157243d2608ae6cd8d8b25853308bc,0.0193676%,1355.73
0xb8e871c7687bf7941b11be0d1f7d3964713fbb66,0.0186199%,1303.39
0xf432151bfa8fb86962622df838c68f3b77fc401f,0.0178770%,1251.39
0x240cca83ff98049e0e94ef601a12a79b08a7ec50,0.0171556%,1200.89
0xbbf714da87df601587affa8dbd79a4bf2fede235,0.0158074%,1106.52
0xa281009a3130c613d8eb947d0a4d18d5a69cedc6,0.0155301%,1087.11
0x8d997528fd4d7df0dfeb5c52c89d907171610bbf,0.0154734%,1083.13
0xb49aa5a200330fee75f1380052074c28dfc2c127,0.0153352%,1073.47
0xc5a435921d077cafa1b3c160ade5441c87a1d784,0.0146374%,1024.62
0xeda878d1efb9b138fefb4bee81c79b61aba392b3,0.0145623%,1019.36
0x41b8072710b6bf2f9ef71b8c17c93df8b2e539e7,0.0141390%,989.73
0xc039ec238815795d2dd9919ddd396f6893dcfb8b,0.0136580%,956.06
0xe8cdbf598e23641b47a0bd93da949620897f926f,0.0128197%,897.38
0xff5926ffa7e0d78c545a6f7375bcba9492e83ac2,0.0121743%,852.20
0x0b63383b26c5f8576fbe0f4afe0e5390510a4bda,0.0116404%,814.83
0x2488db921e7b7c331651405e91da880691b4467f,0.0112299%,786.09
0x0fabea4e732dc49575b789a72d6437bbbee256b5,0.0111299%,779.09
0x422603fc47dbada858390c213dd638dc7c84aab8,0.0110341%,772.38
0x5999b9bcf10b0e806e980c2ecc77c671baa06139,0.0106849%,747.94
0x6fb66dc3c84f32cc3f872a55c6a8ba91c405f0f3,0.0106817%,747.72
0x8cc84c70d7082e987c304d1b275c727c78f73351,0.0103053%,721.37
0x5668e3a1f443401dbd5956229ae2d8475f4deb69,0.0102765%,719.35
0x1438a0f48ed58ec9262a3293e9cddde732392f3e,0.0100841%,705.89
0xc77e7b9fd711dfd543f50405332db9e4321ef8f3,0.0096409%,674.86
0x9e4e0ac376dc518e4dee21a89c21d6e11b93f17c,0.0096300%,674.10
0xf44aacfe5680710c4952d448d65a2f03a09b038d,0.0090315%,632.21
0x6a94427245d96071539aba9a30971aa2334e2f7c,0.0089978%,629.85
0x7647ff79e707ee93d562564499850a6b495cd591,0.0085734%,600.14
0x5d1c1cef4a6706c2f137fee3edb9e333359620a4,0.0080851%,565.96
0x731484f47d4f3f92798bd1428dd5eea8ab2a4fe7,0.0077299%,541.09
0xd4bdaa7f7e7c35ee5b9f8c355bcac3ab7f776952,0.0071350%,499.45
0x6e3a124d1b82493d5182205cac64155178383b35,0.0070599%,494.19
0x5e40719da8cb764614fb790ab0d31ab82b69cfeb,0.0065320%,457.24
0xb0ff9c16fdd3cea666b0967aec2a1d6d7ec35053,0.0064594%,452.16
0xc43e5c94f0fcf442db226ab78f4985607d366052,0.0063212%,2413.47
0xee789b7e756a2e3d5ab11395cb7b666774bda533,0.0062110%,434.77
0x51497873c4b2cdd59545f3af66e022224dd6768c,0.0050464%,353.25
0x4b5abc1e18f9cecae169a63bd0a40bae1c44f515,0.0050386%,352.71
0x54f2700371c3c3c56b7de26fe9babfd90d526f84,0.0045954%,321.68
0x3c5b2d6412758140f37614f3a62c0cde1ac83a74,0.0035480%,248.36
0x26ab8ced848764902a5e6d3911f228c3a69fe684,0.0032661%,228.62
0xc2b0f24d6bcfdbb3b7960f690e2c2eb77b56f6e5,0.0031697%,221.88
0x4049719fae3ed64b190dbf1a6b3300f2744a93de,0.0030382%,212.68
0xfa3527b175a880fa9ae958d02769660062e351cf,0.0029767%,208.37
0x3c3bf980629a96844e57ec550708c60714be7e3d,0.0027409%,7053.72
0xb7dffece1f671f4429078cacfc4737db151684bf,0.0022580%,158.06
0x5896095831ada85c591016143172002bffdafc61,0.0021504%,150.53
0x4f42bc14c9a2cfa3da1f0217b71c22ecb7cd8171,0.0021352%,149.47
0x62e71d305549835aa15164a397c5827cf4b3dbf8,0.0021066%,147.46
0x30e4e5df57bf2292e6b093522d6433b5e4256317,0.0020077%,140.54
0x43f458cba4561cad6fbb3acc95e719a1e4e50b05,0.0017104%,119.73
0xa4612a95eebed31e881df3925434d0f15fb5bbd3,0.0016123%,112.86
0x1612bdeb70fc50a5fc291e992007e6aa583dc95a,0.0015978%,111.85
0xa8bffbb5649cc720ee5c08244c37f906614e43c4,0.0015314%,107.20
0xc7348f764e17a598aec05d66b369efa682f55107,0.0015299%,107.10
0x3e1f2c4c25b82dcdae650c39cc69d80b1abaa56e,0.0014070%,98.49
0x11b2860cc35bed475b01f0a1fcc2b6a999543073,0.0014032%,98.23
0x598094a9478209c2d3356a4302b875c4d7be26a7,0.0013929%,97.50
0x9d67c6ff464e447eb39e94a5199625b791f7a298,0.0013778%,96.45
0x58b4580620230bf64d4efa5911d4ede1db058587,0.0013310%,274.56
0x1b606fb21452927d7ad95671a2d154edbcf56771,0.0013010%,218.58
0x3ac7c5721e12267338bfc21b81fce9f9cf03afac,0.0012817%,89.72
0x2406dff3e88eaec9c916af9438d84345d8e7edcf,0.0012540%,87.78
0x5dbdd8aa4e32f6d4bdc1ca642825b4c7a176a7ec,0.0009640%,653.66
0x2787d30c13f969aa63782489b58851115a0058d2,0.0008905%,62.34
0x4dbde78d4b03276a999582dd9ed8c3e6ae7fb5a5,0.0007775%,54.42
0xdf955d75d7eb261178cacaa16925d25376d36c2a,0.0006876%,48.13
0xece0e3a96cea92a802932a3fa5b950ab6e5cbe3c,0.0006375%,78.04
0x954e77dac8df840c758bbfa66ae247457dae175b,0.0002124%,14.87
0x4d60f624b3da62af4365f13482ce488c325f8b0a,0.0001665%,11.66
0xda57c7757c515c111a735b75001a5afef21e9ce0,0.0001336%,9.35
0xa5f9f3e9ec7ce29cf9c0692085ed9d5f5a03e149,3.2814925%,229704.47
0xe31587b06d0353d39cd1f711f4f8828685c20810,1.3583748%,95086.24
0xdf5b3f79a47926ccda98821d5417d0c1299cabe8,1.2479232%,87354.63
0xbe32ef4533db4087192047edf7048206ea9e4746,1.1786689%,82506.82
0xe624f97939706fd6c8fd0776d4ea0c9b51175e1e,1.1360659%,275828.41
0xa93a32d55381a57149fdff1729ecc99782210d7b,1.0699384%,74895.69
0xf0e8e69703ce72224463b508b7ee0c3180279d0d,0.8927614%,62493.30
0x48acaf117925425c572603eeefee48f6b2181dfd,0.6938702%,48570.91
0x6ec6a0e46845a439d53f2affcff5e1a2b7e59b77,0.6348606%,44440.24
0xbdf2657ffc1fadfd73cf0a8cde95d50b62d3df8c,0.5425487%,37978.41
0x7db0a3b33ae8a1142dc72bcee61c5b4f7be09186,0.5233028%,36631.19
0x3c0fa0643322feff1b54c3b19de6aa6fa2e1fa03,0.2564433%,17951.03
0xb39ff833f6b42d474bc649e3f435856c8f0cb426,0.2034193%,14239.35
0xba14977adcfc73f1552c5c510b9bff83d95f346b,0.1992832%,144435.55
0xf2f54bafc06b56e51819b4091714e37156266556,0.1990073%,13930.51
0xe5b882839614343187cbe976d9307196cafc077c,0.1884421%,13190.95
0xbfbe5822a880a41c2075dc7e1d92663739cf119e,0.1799001%,12593.01
0x89cff61026f6743b8d25ae9b253582083136b1c4,0.1720856%,32461.08
0x139e54bf1624cbca0a7c28a54de335496b78bb22,0.1681336%,11769.35
0x568b491fb2b4b9440f6d05e7723df0060fdaef1c,0.1276224%,8933.57
0xfe7015cec0fa88e260dcce59fb0def0b0d033a82,0.1132291%,7926.04
0x1855ca2c1bd691f0bba30303bee8319be5e328d1,0.1064353%,7450.47
0x0f25809d8e83abc5ff0f4ceb8a8c39c79746d0b6,0.0820298%,5742.09
0x48914c5fa86aa9c4c7a87f50f03290c8beb74d7b,0.0797852%,5584.96
0x051b91ac3d1700d5ecae2356f33b6e498814ba4c,0.0796374%,5574.62
0xbe44acb7797880916cfc9c23a85a753b21c9af80,0.0790339%,5532.37
0x88c9b730526359155ad1c10bc26c4907ab8ee39f,0.0704525%,4931.67
0xe2d128323cf7560a6e7a82726d7b425aedc7a556,0.0700182%,4901.28
0x3a33084d5d3dc92291187a48456a688e092d911f,0.0640208%,4481.46
0xfb29366cd27f56a67676bae7970c5f23d40b34e6,0.0431242%,3018.70
0xff37e27206c1972f723a63804f3f349dd07453fb,0.0395572%,2769.00
0xc3fd02ce3f6bfdab37f5b8f3a31da56f4bcd7dfe,0.0279754%,1958.28
0x962de35217e9d4d0d79e8106a3d5ea121fe71685,0.0261463%,1830.24
0xa9dba4aeabf7af1c0c9f68de7381b93fc07c5a32,0.0070571%,962.14
0x0503aca4e502422d116ff730bf2c4ef5a7865d00,0.0067490%,472.43
0xed6a35e2c6d965a9b4acde63bd64d692d6b1832b,0.0053613%,2531.77
0x6446fbcbe9326aa21b8e0a531bb23fcb9275854f,0.0051108%,357.75
0x78a97188707a808044f0d3193af9b71254781cf8,0.0051015%,357.10
0x535a00c4425bc194c748c34c42249d7c083c2013,0.0042487%,297.41