<svg width="200px" height="200px" xmlns="http://www.w3.org/2000/svg" viewBox="0 0 100 100" preserveAspectRatio="xMidYMid" class="lds-ripple" style="shape-rendering: auto; animation-play-state: running; animation-delay: 0s; background: rgba(0, 0, 0, 0) none repeat scroll 0% 0%;">

<circle cx="50" cy="50" r="0" fill="none" ng-attr-stroke="{{config.c1}}" ng-attr-stroke-width="{{config.width}}" stroke="#0062B7" stroke-width="2" style="animation-play-state: running; animation-delay: 0s;"><animate attributeName="r" calcMode="spline" values="0;40" keyTimes="0;1" dur="2" keySplines="0 0.2 0.8 1" begin="-1s" repeatCount="indefinite" style="animation-play-state: running; animation-delay: 0s;"></animate><animate attributeName="opacity" calcMode="spline" values="1;0" keyTimes="0;1" dur="2" keySplines="0.2 0 0.8 1" begin="-1s" repeatCount="indefinite" style="animation-play-state: running; animation-delay: 0s;"></animate></circle><circle cx="50" cy="50" r="0" fill="none" ng-attr-stroke="{{config.c2}}" ng-attr-stroke-width="{{config.width}}" stroke="#0062B7" stroke-width="2" style="animation-play-state: running; animation-delay: 0s;"><animate attributeName="r" calcMode="spline" values="0;40" keyTimes="0;1" dur="2" keySplines="0 0.2 0.8 1" begin="0s" repeatCount="indefinite" style="animation-play-state: running; animation-delay: 0s;"></animate><animate attributeName="opacity" calcMode="spline" values="1;0" keyTimes="0;1" dur="2" keySplines="0.2 0 0.8 1" begin="0s" repeatCount="indefinite" style="animation-play-state: running; animation-delay: 0s;"></animate></circle>

</svg>