<svg xmlns="http://www.w3.org/2000/svg" width="16" height="16" viewBox="0 0 16 16">
  <g fill="none" fill-rule="evenodd" stroke="#0062B7" stroke-linecap="round">
    <line x1="8" x2="8" y1="3" y2="13" stroke-width="2"/>
    <line x1="8" x2="8" y1="3" y2="13" stroke-width="2" transform="rotate(90 8 8)"/>
  </g>
</svg>
