<svg xmlns="http://www.w3.org/2000/svg" width="24" height="24" viewBox="0 0 24 24">
  <g fill="none" fill-rule="evenodd" stroke="#8C5A2D" stroke-width="1.5" transform="translate(3 1.5)">
    <path d="M12.9465896,9.18440035 C15.7958321,9.18440035 18.1055994,11.4941677 18.1055994,14.3434101 L18.1055994,14.4344004 C18.1055994,17.3338953 15.7550943,19.6844004 12.8555994,19.6844004 L5.12307166,19.6844004 C4.79852922,19.6844004 4.49417009,19.5269029 4.30672613,19.2619642 L2.38452166,16.5450644 L2.38452166,16.5450644" transform="rotate(45 10.245 14.434)"/>
    <g stroke-linecap="round" stroke-linejoin="round">
      <polygon points="18 10.59 10.59 18 0 7.41 0 0 7.41 0"/>
      <circle cx="3.967" cy="3.967" r="1.08"/>
      <line x1="7.942" x2="13.238" y1="5.82" y2="11.115"/>
      <line x1="5.82" x2="9" y1="7.942" y2="11.115"/>
    </g>
  </g>
</svg>
