<svg xmlns="http://www.w3.org/2000/svg" width="24" height="24" viewBox="0 0 24 24">
  <g fill="none" fill-rule="evenodd">
    <g stroke="#0062B7" stroke-linecap="round" stroke-linejoin="round" transform="translate(3.75 1.5)">
      <path d="M9.12,3.09 L9.5475,3.435 C9.81459764,3.65512708 10.1543244,3.76747767 10.5,3.75 L11.055,3.75 C11.6902152,3.71909562 12.2651179,4.12400016 12.45,4.7325 L12.5925,5.2725 C12.6828324,5.5984701 12.8879294,5.88081138 13.17,6.0675 L13.635,6.3675 C14.180552,6.72566834 14.4048716,7.41420495 14.175,8.025 L13.98,8.5425 C13.8527985,8.85764869 13.8527985,9.20985131 13.98,9.525 L14.175,10.05 C14.4068423,10.6585189 14.1817523,11.3462939 13.635,11.7 L13.17,12 C12.8859826,12.1880254 12.6805715,12.4734669 12.5925,12.8025 L12.45,13.335 C12.2806258,13.9658474 11.6921662,14.3915415 11.04,14.355 L10.485,14.355 C10.1462475,14.3363608 9.81249927,14.4431603 9.5475,14.655 L9.12,15.0075 C8.61106396,15.4135399 7.88893604,15.4135399 7.38,15.0075 L6.9525,14.655 C6.68750073,14.4431603 6.35375252,14.3363608 6.015,14.355 L5.46,14.355 C4.8078338,14.3915415 4.21937424,13.9658474 4.05,13.335 L3.9075,12.8025 C3.81942852,12.4734669 3.61401736,12.1880254 3.33,12 L2.865,11.7 C2.31824765,11.3462939 2.09315768,10.6585189 2.325,10.05 L2.52,9.525 C2.64720149,9.20985131 2.64720149,8.85764869 2.52,8.5425 L2.325,8.025 C2.09512836,7.41420495 2.31944799,6.72566834 2.865,6.3675 L3.33,6.0675 C3.6164936,5.87530216 3.82209725,5.58425284 3.9075,5.25 L4.05,4.71 C4.24456538,4.10476412 4.82557083,3.70918594 5.46,3.75 L6,3.75 C6.33961996,3.76582278 6.67322881,3.65639908 6.9375,3.4425 L7.365,3.0975 C7.87285707,2.67542266 8.60855404,2.67227866 9.12,3.09 Z"/>
      <path d="M4.5525,16.0875 C3.68966175,16.125664 2.91493779,15.5625112 2.685,14.73 L2.4975,14.025 C2.38492405,13.5927877 2.11817109,13.2166661 1.7475,12.9675 L1.1325,12.5625 C0.398679225,12.0996427 0.0864865974,11.1880402 0.3825,10.3725 L0.645,9.69 C0.809712208,9.27059202 0.809712208,8.80440798 0.645,8.385 L0.3825,7.695 C0.0864865974,6.87945977 0.398679225,5.9678573 1.1325,5.505 L1.725,5.1 C2.09667527,4.85523765 2.36401137,4.4809671 2.475,4.05 L2.6625,3.3 C2.89044455,2.46708335 3.66761469,1.90527361 4.53,1.95 L5.28,1.95 C5.72706082,1.97199692 6.16687368,1.8307237 6.5175,1.5525 L7.095,1.0875 C7.76495644,0.548210394 8.72004356,0.548210394 9.39,1.0875 L9.9675,1.5525 C10.3198917,1.86565903 10.778792,2.03204395 11.25,2.0175 L12,2.0175 C12.8623853,1.97277361 13.6395555,2.53458335 13.8675,3.3675 L14.055,4.1175 C14.1659886,4.5484671 14.4333247,4.92273765 14.805,5.1675 L15.42,5.5725 C16.1398784,6.04646507 16.4356873,6.95568824 16.1325,7.7625 L15.87,8.4525 C15.7052878,8.87190798 15.7052878,9.33809202 15.87,9.7575 L16.1325,10.44 C16.4356873,11.2468118 16.1398784,12.1560349 15.42,12.63 L14.805,13.035 C14.4343289,13.2841661 14.167576,13.6602877 14.055,14.0925 L13.8675,14.7975 C13.6375622,15.6300112 12.8628382,16.193164 12,16.155"/>
      <polyline points="10.928 14.783 10.928 20.25 8.25 18.945 5.58 20.25 5.58 14.783"/>
    </g>
    <g stroke="#0062B7" stroke-linecap="round" stroke-linejoin="round" transform="translate(8.688 7.7)">
      <path stroke-width=".8" d="M5.99069767,7.99360578e-15 L6.25116279,7.99360578e-15 C6.53886461,7.99360578e-15 6.77209302,0.233228409 6.77209302,0.520930233 L6.77209302,4.94883721 C6.77209302,5.23653903 6.53886461,5.46976744 6.25116279,5.46976744 L0.520930233,5.46976744 C0.233228409,5.46976744 6.84341472e-13,5.23653903 6.84341472e-13,4.94883721 L6.84341472e-13,0.520930233 C6.84341472e-13,0.233228409 0.233228409,7.99360578e-15 0.520930233,7.99360578e-15 L0.781395349,7.99360578e-15 L5.99069767,7.99360578e-15 Z"/>
      <line x1="6.772" y1="1.563" y2="1.563" stroke-width=".8"/>
      <polyline stroke-width=".7" points="2.379 3.596 3.065 4.282 4.324 2.55"/>
    </g>
  </g>
</svg>
