80;Antiphospholipid syndrome;non rare
106;Autism;non rare
155;Cardiomyopathy, hypertrophic, primary or idiopathic;non rare
164;Cerebral cavernous malformations;non rare
206;Crohn disease;non rare
279;Macular degeneration, age-related;non rare
336;Fibromuscular dysplasia of arteries;non rare
362;Glucose-6-phosphate-dehydrogenase deficiency;non rare
378;Sjögren syndrome;non rare
387;Hidradenitis suppurativa;non rare
406;Hypercholesterolemia, familial;non rare
484;Klinefelter syndrome;non rare
555;Celiac disease;non rare
651;Nystagmus, idiopathic congenital;non rare
771;Ulcerative colitis;non rare
802;Multiple sclerosis;non rare
825;Ankylosing spondylarthritis;non rare
856;Tourette syndrome;non rare
862;Tremor hereditary essential;non rare
1983;Chronic fatigue syndrome;non rare
2335;Keratoconus;non rare
3435;Vitiligo;non rare
33409;Lichen sclerosus;non rare
35056;Trimethylaminuria;non rare
85142;Conn's syndrome;non rare
488201;Non-small cell lung cancer;non rare
94059;Uremic pruritus;RD-CODE
306644;Complication after organ transplantation;RD-CODE
506207;Rare disorder potentially indicated for transplant;RD-CODE
171673;Limbal stem cell deficiency;RD-CODE
1956;Erythromelalgia;obsolete
79461;Melanoma type 1;obsolete
79462;Melanoma type 2;obsolete