<?xml version="1.0" encoding="UTF-8" standalone="no"?>
<!-- Generator: Adobe Illustrator 14.0.0, SVG Export Plug-In . SVG Version: 6.00 Build 43363)  -->

<svg
   xmlns:dc="http://purl.org/dc/elements/1.1/"
   xmlns:cc="http://creativecommons.org/ns#"
   xmlns:rdf="http://www.w3.org/1999/02/22-rdf-syntax-ns#"
   xmlns:svg="http://www.w3.org/2000/svg"
   xmlns="http://www.w3.org/2000/svg"
   xmlns:sodipodi="http://sodipodi.sourceforge.net/DTD/sodipodi-0.dtd"
   xmlns:inkscape="http://www.inkscape.org/namespaces/inkscape"
   version="1.1"
   id="Layer_1"
   x="0px"
   y="0px"
   width="151.814"
   height="138.118"
   viewBox="0 0 151.814 138.118"
   enable-background="new 0 0 191.34 191.34"
   xml:space="preserve"
   inkscape:version="0.48.5 r10040"
   sodipodi:docname="tilde_logo.svg"><metadata
   id="metadata13"><rdf:RDF><cc:Work
       rdf:about=""><dc:format>image/svg+xml</dc:format><dc:type
         rdf:resource="http://purl.org/dc/dcmitype/StillImage" /></cc:Work></rdf:RDF></metadata><defs
   id="defs11" /><sodipodi:namedview
   pagecolor="#ffffff"
   bordercolor="#666666"
   borderopacity="1"
   objecttolerance="10"
   gridtolerance="10"
   guidetolerance="10"
   inkscape:pageopacity="0"
   inkscape:pageshadow="2"
   inkscape:window-width="1189"
   inkscape:window-height="883"
   id="namedview9"
   showgrid="false"
   fit-margin-top="0"
   fit-margin-left="0"
   fit-margin-right="0"
   fit-margin-bottom="0"
   inkscape:zoom="1.2334065"
   inkscape:cx="35.79418"
   inkscape:cy="62.167514"
   inkscape:window-x="0"
   inkscape:window-y="0"
   inkscape:window-maximized="0"
   inkscape:current-layer="Layer_1" />
<g
   id="g3"
   transform="translate(-20.447001,-26.17)">
	<rect
   x="20.447001"
   y="26.17"
   width="151.814"
   height="138.118"
   id="rect5"
   style="fill:#811331" />
	<path
   d="m 116.53,93.875 h -7.861 v -33.62 h 7.861 c 4.135,0 7.865,1.626 7.865,6.166 v 21.355 c 0,4.473 -3.73,6.099 -7.865,6.099 z m -27.24,0 v -33.62 h 6.641 v 28.811 h 5.897 v 4.809 H 89.29 z m -1.895,25.342 c -16.403,-7.932 -34.629,-8.062 -34.629,8.805 h -5.08 c -0.814,-23.65 22.633,-36.722 48.99,-23.986 38.56,18.635 45.062,5.761 45.062,-9.688 V 93.94 l -8.062,-0.066 v -33.62 h 12.475 v 4.809 h -5.831 v 7.733 h 5.559 v 4.811 h -5.559 v 11.458 h 6.094 v 7.379 c -10e-4,27.718 -19.514,41.948 -59.019,22.773 z M 72.891,93.875 v -33.62 h 6.71 v 33.62 h -6.71 z M 60.56,65.064 V 93.875 H 53.917 V 65.064 H 49.38 v -4.809 h 15.653 v 4.809 H 60.56 z m 57.125,2.239 c 0,-0.95 -0.136,-2.239 -1.155,-2.239 h -1.146 v 24.001 h 1.146 c 1.02,0 1.155,-1.29 1.155,-2.17 V 67.303 z"
   id="path7"
   inkscape:connector-curvature="0"
   style="fill:#ffffff" />
</g>
</svg>