<svg width="64" height="64" viewBox="0 0 64 64" fill="none" xmlns="http://www.w3.org/2000/svg">
<path d="M32.5 62.5C49.0685 62.5 62.5 49.0685 62.5 32.5C62.5 15.9315 49.0685 2.5 32.5 2.5C15.9315 2.5 2.5 15.9315 2.5 32.5C2.5 49.0685 15.9315 62.5 32.5 62.5Z" stroke="#7C5CD6" stroke-width="3" stroke-miterlimit="10" stroke-linecap="round" stroke-linejoin="round"/>
<path d="M46.5 18.5L37.5 37.5L18.5 46.5L27.5 27.5L46.5 18.5Z" stroke="#7C5CD6" stroke-width="3" stroke-miterlimit="10" stroke-linecap="round" stroke-linejoin="round"/>
<path d="M32.5 33.5C33.0523 33.5 33.5 33.0523 33.5 32.5C33.5 31.9477 33.0523 31.5 32.5 31.5C31.9477 31.5 31.5 31.9477 31.5 32.5C31.5 33.0523 31.9477 33.5 32.5 33.5Z" stroke="#7C5CD6" stroke-width="3" stroke-miterlimit="10" stroke-linecap="round" stroke-linejoin="round"/>
<path d="M33 32.5C33 32.7761 32.7761 33 32.5 33C32.2239 33 32 32.7761 32 32.5C32 32.2239 32.2239 32 32.5 32C32.7761 32 33 32.2239 33 32.5Z" fill="#7C5CD6" stroke="#7C5CD6"/>
</svg>
