<svg width="64" height="64" viewBox="0 0 64 64" fill="none" xmlns="http://www.w3.org/2000/svg">
<path d="M32.5 29.5V13.5" stroke="#D65C9D" stroke-width="3" stroke-miterlimit="10" stroke-linecap="round" stroke-linejoin="round"/>
<path d="M11.5547 23.5809L28.4467 11.4189" stroke="#D65C9D" stroke-width="3" stroke-miterlimit="10" stroke-linecap="round" stroke-linejoin="round"/>
<path d="M15.0635 51.7111L8.9375 31.2891" stroke="#D65C9D" stroke-width="3" stroke-miterlimit="10" stroke-linecap="round" stroke-linejoin="round"/>
<path d="M43.5 56.5H21.5" stroke="#D65C9D" stroke-width="3" stroke-miterlimit="10" stroke-linecap="round" stroke-linejoin="round"/>
<path d="M36.5547 11.4189L53.5007 23.6199" stroke="#D65C9D" stroke-width="3" stroke-miterlimit="10" stroke-linecap="round" stroke-linejoin="round"/>
<path d="M37.2617 32.9759L52.7367 28.0239" stroke="#D65C9D" stroke-width="3" stroke-miterlimit="10" stroke-linecap="round" stroke-linejoin="round"/>
<path d="M12.2617 28.0239L27.7367 32.9759" stroke="#D65C9D" stroke-width="3" stroke-miterlimit="10" stroke-linecap="round" stroke-linejoin="round"/>
<path d="M19.4375 52.46L29.5595 38.542" stroke="#D65C9D" stroke-width="3" stroke-miterlimit="10" stroke-linecap="round" stroke-linejoin="round"/>
<path d="M45.5624 52.459L35.4414 38.542" stroke="#D65C9D" stroke-width="3" stroke-miterlimit="10" stroke-linecap="round" stroke-linejoin="round"/>
<path d="M32.5 39.5C35.2614 39.5 37.5 37.2614 37.5 34.5C37.5 31.7386 35.2614 29.5 32.5 29.5C29.7386 29.5 27.5 31.7386 27.5 34.5C27.5 37.2614 29.7386 39.5 32.5 39.5Z" stroke="#D65C9D" stroke-width="3" stroke-miterlimit="10" stroke-linecap="round" stroke-linejoin="round"/>
<path d="M56.0635 31.2891L49.9375 51.7111" stroke="#D65C9D" stroke-width="3" stroke-miterlimit="10" stroke-linecap="round" stroke-linejoin="round"/>
<path d="M32.5 13.5C35.2614 13.5 37.5 11.2614 37.5 8.5C37.5 5.73858 35.2614 3.5 32.5 3.5C29.7386 3.5 27.5 5.73858 27.5 8.5C27.5 11.2614 29.7386 13.5 32.5 13.5Z" stroke="#D65C9D" stroke-width="3" stroke-miterlimit="10" stroke-linecap="round" stroke-linejoin="round"/>
<path d="M57.5 31.5C60.2614 31.5 62.5 29.2614 62.5 26.5C62.5 23.7386 60.2614 21.5 57.5 21.5C54.7386 21.5 52.5 23.7386 52.5 26.5C52.5 29.2614 54.7386 31.5 57.5 31.5Z" stroke="#D65C9D" stroke-width="3" stroke-miterlimit="10" stroke-linecap="round" stroke-linejoin="round"/>
<path d="M48.5 61.5C51.2614 61.5 53.5 59.2614 53.5 56.5C53.5 53.7386 51.2614 51.5 48.5 51.5C45.7386 51.5 43.5 53.7386 43.5 56.5C43.5 59.2614 45.7386 61.5 48.5 61.5Z" stroke="#D65C9D" stroke-width="3" stroke-miterlimit="10" stroke-linecap="round" stroke-linejoin="round"/>
<path d="M16.5 61.5C19.2614 61.5 21.5 59.2614 21.5 56.5C21.5 53.7386 19.2614 51.5 16.5 51.5C13.7386 51.5 11.5 53.7386 11.5 56.5C11.5 59.2614 13.7386 61.5 16.5 61.5Z" stroke="#D65C9D" stroke-width="3" stroke-miterlimit="10" stroke-linecap="round" stroke-linejoin="round"/>
<path d="M7.5 31.5C10.2614 31.5 12.5 29.2614 12.5 26.5C12.5 23.7386 10.2614 21.5 7.5 21.5C4.73858 21.5 2.5 23.7386 2.5 26.5C2.5 29.2614 4.73858 31.5 7.5 31.5Z" stroke="#D65C9D" stroke-width="3" stroke-miterlimit="10" stroke-linecap="round" stroke-linejoin="round"/>
</svg>
