{
  "metadata_record_identifier": {
    "value": "user_provider_elg_id",
    "metadata_record_identifier_scheme": "http://w3id.org/meta-share/meta-share/elg"
  },
  "metadata_creation_date": "2020-02-03",
  "metadata_last_date_updated": "2020-02-03",
  "metadata_curator": [
    {
      "surname": {
        "en": "Gkirtzou"
      },
      "given_name": {
        "en": "Katerina"
      },
      "personal_identifier": [
        {
          "personal_identifier_scheme": "http://purl.org/spar/datacite/orcid",
          "value": "https://orcid.org/0000-0002-4725-3094"
        }
      ],
      "email": [
        "katerina.gkirtzou@athenarc.gr",
        "katerina.gkirtzou@gmail.com"
      ]
    },
    {
      "surname": {
        "en": "Deligiannis"
      },
      "given_name": {
        "en": "Miltos"
      },
      "email": [
        "mdel@athenarc.gr"
      ]
    }
  ],
  "metadata_creator": {
    "surname": {
      "en": "Gkirtzou"
    },
    "given_name": {
      "en": "Katerina"
    },
    "personal_identifier": [
      {
        "personal_identifier_scheme": "http://purl.org/spar/datacite/orcid",
        "value": "https://orcid.org/0000-0002-4725-3094"
      }
    ],
    "email": [
      "katerina.gkirtzou@athenarc.gr",
      "katerina.gkirtzou@gmail.com"
    ]
  },
  "source_of_metadata_record": {
    "repository_name": {
      "en": "Repo name"
    },
    "repository_url": "http://www.repo.com",
    "repository_identifier": [
      {
            "repository_identifier_scheme": "http://purl.org/spar/datacite/handle",
            "value": "repository test value"
      }
    ]
  },
  "source_metadata_record": {
    "metadata_record_identifier": {
      "metadata_record_identifier_scheme": "http://purl.org/spar/datacite/handle",
      "value": "http://hdl.handle.net/11304/6eacaa76-c275-11e4-ac7e-860aa0063d1f"
    }
  },
  "revision": {
    "en": "Revision information"
  },
  "described_entity": {
    "entity_type": "Project",
    "project_name": {
      "en": "European Live Translator"
    },
    "project_short_name": {
      "en": "ELITR"
    },
    "project_alternative_name": [
      {
        "en": "European Live Translator alternative name"
      }
    ],
    "project_identifier": [
      {
        "project_identifier_scheme": "http://w3id.org/meta-share/meta-share/elg",
        "value": "this_is_elg_value_id"
      },
      {
        "project_identifier_scheme": "http://w3id.org/meta-share/meta-share/other",
        "value": "doi_value_id"
      }
    ],
    "funding_type": [
      "http://w3id.org/meta-share/meta-share/euFunds"
    ],
    "funder": [
      {
        "actor_type": "Organization",
        "organization_name": {
          "en": "European Commission"
        },
        "organization_identifier": [
          {
            "organization_identifier_scheme": "http://purl.org/spar/datacite/doi",
            "value": "doi_value"
          }
        ],
        "website": [
          "http://www.european-commission.eu"
        ]
      },
      {
        "actor_type": "Person",
        "surname": {
          "en": "Giagkou"
        },
        "given_name": {
          "en": "Maria"
        },
        "email": [
          "mgiagkou@athenarc.gr"
        ]
      },
      {
        "actor_type": "Group",
        "organization_name": {
          "en": "Institute Rockerfeller"
        },
        "group_identifier": [
          {
            "organization_identifier_scheme": "http://purl.org/spar/datacite/doi",
            "value": "doi_value"
          }
        ],
        "website": [
          "http://www.institute-rockerfeller.org"
        ]
      }
    ],
    "funding_country": [
      "EU",
      "FR"
    ],
    "project_start_date": "2019-01-01",
    "project_end_date": "2031-12-31",
    "email": [ "project@email.com"],
    "website": [
      "https://elitr.eu/long/slug/test/",
      "http://www.secondurl.eu/"
    ],
    "logo": "https://dev.european-language-grid.eu/cms/sites/default/files/inline-images/logo__community-elitr_0.png",
    "lt_area": [
      "http://w3id.org/meta-share/omtd-share/MachineTranslation",
      "http://w3id.org/meta-share/omtd-share/LanguageTechnology",
      "http://w3id.org/meta-share/omtd-share/SpeechRecognition",
      "Free text describing project's lt_area"
    ],
    "domain": [
      {
        "category_label": {
          "en": "Machine Translation"
        },
        "domain_identifier": {
          "domain_classification_scheme": "http://w3id.org/meta-share/meta-share/ELG_domainClassification",
          "value": "http://w3id.org/meta-share/omtd-share/MachineTranslation"
        }
      }
    ],
    "subject": [
      {
        "category_label": {
          "en": "Parole subject label"
        },
        "subject_identifier": {
          "subject_classification_scheme": "http://w3id.org/meta-share/meta-share/PAROLE_topicClassification",
          "value": "Parole subject value"
        }
      }
    ],
    "keyword": [
      {
        "en": "Spoken language translation"
      },
      {
        "en": "Automatic minuting"
      },
      {
        "en": "multilinguality"
      }
    ],
    "social_media_occupational_account": [
      {
        "social_media_occupational_account_type": "http://w3id.org/meta-share/meta-share/facebook",
        "value": "https://www.facebook.com/ELITR"
      }
    ],
    "grant_number": "825460",
    "project_summary": {
      "en": "The goal of the ELITR project is to remove the language barrier in communication within and among European citizens, companies, institutes and organizations at large assemblies like conferences, in smaller live discussions like workshops and in discussions held over long distance like formal or informal online meetings. Within the project, we will create automatic subtitling system of live meetings and conference presentations and provide the system of spoken language translation (interpreting). Furthermore, the project will design and implement automatic minuting, i.e. create structured summaries from automatic transcript of a discussion. We also aim to advance the state of the art to deliver machine translation of high-quality at the level of whole documents and to scale up to multilingual settings with dozens of source and/or target languages. The technologies will be tested by the Supreme Audit Office of the Czech Republic and alfaview®, a German online conferencing system. \n     Lorem ipsum dolor sit amet, consectetur adipiscing elit, sed do eiusmod tempor incididunt ut labore et dolore magna aliqua. Ut enim ad minim veniam, quis nostrud exercitation ullamco laboris nisi ut aliquip ex ea commodo consequat. Duis aute irure dolor in reprehenderit in voluptate velit esse cillum dolore eu fugiat nulla pariatur. Excepteur sint occaecat cupidatat non proident, sunt in culpa qui officia deserunt mollit anim id est laborum."
    },
    "cost": {
      "amount": "1500000",
      "currency": "http://w3id.org/meta-share/meta-share/euro"
    },
    "ec_max_contribution": {
      "amount": "1500000",
      "currency": "http://w3id.org/meta-share/meta-share/euro"
    },
    "national_max_contribution": {
      "amount": "1500000",
      "currency": "http://w3id.org/meta-share/meta-share/euro"
    },
    "funding_scheme_category": "RIA - Research and Innovation action",
    "status": "The status",
    "related_call": "H2020-ICT-2018-2",
    "related_programme": "H2020",
    "related_subprogramme": "EU.2.1.1. - INDUSTRIAL LEADERSHIP - Leadership in enabling and industrial technologies - Information and Communication Technologies (ICT)",
    "coordinator": {
      "organization_name": {
        "en": "Institute of Formal and Applied Linguistics"
      }
    },
    "participating_organization": [
      {
        "organization_name": {
          "en": "Per Voice"
        }
      },
      {
        "organization_name": {
          "en": "Karlsruhe Institute of Technology"
        }
      },
      {
        "organization_name": {
          "en": "Alpha Training"
        }
      },
      {
        "organization_name": {
          "en": "University of Edinburgh"
        }
      }
    ],
    "is_related_to_document": [
      {
        "title": {
          "en": "bibliographic record\n    Lorem ipsum dolor sit amet, consectetur adipiscing elit, sed do eiusmod tempor incididunt ut labore et dolore magna aliqua. Ut enim ad minim veniam, quis nostrud exercitation ullamco laboris nisi ut aliquip ex ea commodo consequat. Duis aute irure dolor in reprehenderit in voluptate velit esse cillum dolore eu fugiat nulla pariatur. Excepteur sint occaecat cupidatat non proident, sunt in culpa qui officia deserunt mollit anim id est laborum."
        },
        "document_identifier": [
          {
            "document_identifier_scheme": "http://purl.org/spar/datacite/doi",
            "value": "document_value_id"
          }
        ]
      }
    ],
    "project_report": {
      "en": "Project report\n Lorem ipsum dolor sit amet, consectetur adipiscing elit, sed do eiusmod tempor incididunt ut labore et dolore magna aliqua. Ut enim ad minim veniam, quis nostrud exercitation ullamco laboris nisi ut aliquip ex ea commodo consequat. Duis aute irure dolor in reprehenderit in voluptate velit esse cillum dolore eu fugiat nulla pariatur. Excepteur sint occaecat cupidatat non proident, sunt in culpa qui officia deserunt mollit anim id est laborum"
    }
  },
  "management_object": {}
}



