{
  "metadata_record_identifier": {
    "value": "user_provider_elg_id",
    "metadata_record_identifier_scheme": "http://w3id.org/meta-share/meta-share/elg"
  },
  "metadata_creation_date": "2020-02-03",
  "metadata_last_date_updated": "2020-02-03",
  "metadata_curator": [
    {
      "surname": {
        "en": "Labropoulou"
      },
      "given_name": {
        "en": "Penny"
      },
      "personal_identifier": [
        {
          "personal_identifier_scheme": "http://purl.org/spar/datacite/orcid",
          "value": "0000-0001-5123-7890"
        },
        {
          "personal_identifier_scheme": "http://w3id.org/meta-share/meta-share/elg",
          "value": "ELG-ENT-PER-270220-00000001"
        }
      ],
      "email": [
        "penny@athenarc.gr"
      ]
    }
  ],
  "metadata_creator": {
    "surname": {
      "en": "Labropoulou"
    },
    "given_name": {
      "en": "Penny"
    },
    "personal_identifier": [
      {
        "personal_identifier_scheme": "http://w3id.org/meta-share/meta-share/elg",
        "value": "ELG-ENT-PER-270220-00000001"
      }
    ]
  },
  "source_of_metadata_record": {
    "repository_name": {
      "en": "Repo name"
    },
    "repository_url": "http://www.repo.com",
    "repository_identifier": [
      {
        "repository_identifier_scheme": "http://purl.org/spar/datacite/handle",
        "value": "repository test value"
      }
    ]
  },
  "source_metadata_record": {
    "metadata_record_identifier": {
      "metadata_record_identifier_scheme": "http://purl.org/spar/datacite/handle",
      "value": "http://hdl.handle.net/11304/6eacaa76-c275-11e4-ac7e-860aa0063d1f"
    }
  },
  "revision": {
    "en": "Revision information"
  },
  "described_entity": {
    "entity_type": "LicenceTerms",
    "licence_terms_name": {
      "en": "BSD Zero Clause License"
    },
    "licence_terms_short_name": {
      "en": "0BSD"
    },
    "licence_terms_url": [
      "http://landley.net/toybox/license.html",
      "http://randomlicencetermsurl.com/terms.html"
    ],
    "condition_of_use": [
      "http://w3id.org/meta-share/meta-share/unspecified"
    ],
    "licence_identifier": [
      {
        "value": "0BSD",
        "licence_identifier_scheme": "http://w3id.org/meta-share/meta-share/SPDX"
      },
      {
        "value": "ELG-ENT-LIC-270220-00000002",
        "licence_identifier_scheme": "http://w3id.org/meta-share/meta-share/elg"
      }
    ]
  },
  "management_object": {}
}