{
  "metadata_record_identifier": {
    "value": "user_provider_elg_id",
    "metadata_record_identifier_scheme": "http://w3id.org/meta-share/meta-share/elg"
  },
  "metadata_creation_date": "2020-02-03",
  "metadata_last_date_updated": "2020-02-03",
  "metadata_curator": [
    {
      "surname": {
        "en": "Labropoulou"
      },
      "given_name": {
        "en": "Penny"
      },
      "personal_identifier": [
        {
          "personal_identifier_scheme": "http://purl.org/spar/datacite/orcid",
          "value": "0000-0001-5123-7890"
        },
        {
          "personal_identifier_scheme": "http://w3id.org/meta-share/meta-share/elg",
          "value": "ELG-ENT-PER-270220-00000001"
        }
      ],
      "email": [
        "penny@athenarc.gr"
      ]
    }
  ],
  "metadata_creator": {
    "surname": {
      "en": "Labropoulou"
    },
    "given_name": {
      "en": "Penny"
    },
    "personal_identifier": [
      {
        "personal_identifier_scheme": "http://w3id.org/meta-share/meta-share/elg",
        "value": "ELG-ENT-PER-270220-00000001"
      }
    ]
  },
  "source_of_metadata_record": {
    "repository_name": {
      "en": "Repo name"
    },
    "repository_url": "http://www.repo.com",
    "repository_identifier": [
      {
            "repository_identifier_scheme": "http://purl.org/spar/datacite/handle",
            "value": "repository test value"
      }
    ]
  },
  "source_metadata_record": {
    "metadata_record_identifier": {
      "metadata_record_identifier_scheme": "http://purl.org/spar/datacite/handle",
      "value": "http://hdl.handle.net/11304/6eacaa76-c275-11e4-ac7e-860aa0063d1f"
    }
  },
  "revision": {
    "en": "Revision information"
  },
  "described_entity": {
    "entity_type": "Organization",
    "organization_alternative_name": [
      {
        "en": "ATHINA-EREVNITIKO KENTRO KAINOTOMIAS STIS TECHNOLOGIES TIS PLIROFORIAS, TON EPIKOINONION KAI TIS GNOSIS"
      }
    ],
    "organization_name": {
      "en": "Athena Research Center"
    },
    "organization_short_name": [
      {
        "en": "ARC"
      }
    ],
    "organization_identifier": [
      {
        "organization_identifier_scheme": "http://purl.org/spar/datacite/doi",
        "value": "0000-0001-5123-7890"
      },
      {
        "organization_identifier_scheme": "http://w3id.org/meta-share/meta-share/elg",
        "value": "ELG-ENT-ORG-270220-00000002"
      }
    ],
    "email": ["org@email.com"],
    "website": [
      "https://www.athena-innovation.gr"
    ],
    "organization_role": [
      "http://w3id.org/meta-share/meta-share/LTUser",
      "http://w3id.org/meta-share/meta-share/researchOrganization"
    ],
    "organization_legal_status": "http://w3id.org/meta-share/meta-share/publicOrganization",
    "organization_bio": {
      "en": "Athena Research and Innovation Centre (ARC) is a scientific research and technological organisation, functioning under the auspices of the General Secretariat for Research and Technology (Greek Ministry of Education). It comprises 3 research Institutes: Institute for Language and Speech Processing (ILSP), dedicated to language technology research, development and innovation; Institute for the Management of Information Systems (IMIS), dedicated to data and information management, and Industrial Systems Institute (ISI). The scope of activities of Athena RC includes all Information and Communication Technologies, from the perspective of both Computer Science and Computational Sciences, and covering all  software and hardware aspects. These include all areas of informatics, data science, robotics, automation, signal processing, artificial intelligence, networking and digital communication, and modelling. Multidisciplinarity is at the foundation of the research philosophy of Athena RC, which carries out R&D both at the level of information technology itself and at the level of specific applications. Computational sciences thus form a strong component of the Athena RC activities, including - but not being limited to - computational linguistics, archaeology, engineering, medicine, biology, biodiversity, earth observation, space science, mechanics, and the arts. Together with research, innovation is also a fundamental pillar of the mission of Athena RC. Research institutes, spin-off companies, and three highly-specialised clusters in knowledge-intensive thematic sectors create a fertile technological innovation ecosystem within the Center. Collaboration between all actors, including systematic efforts to bring research results to market, has always been mutually beneficial."
    },
    "logo": "http://www.ilsp.gr/templates/ilsp1/images/athena_title_en.jpg",
    "lt_area": [
      "http://w3id.org/meta-share/omtd-share/LanguageTechnology"
    ],
    "head_office_address": {
        "address": {
          "en": "Artemidos 6 and Epidavrou"
        },
        "region": {
          "en": "Maroussi"
        },
        "city": {
          "en": "Athens"
        },
        "zip_code": "151 25",
        "country": "GR"
      },
    "other_office_address": [{
        "address": {
          "en": "Artemidos 6 and Epidavrou"
        },
        "region": {
          "en": "Maroussi"
        },
        "city": {
          "en": "Athens"
        },
        "zip_code": "151 25",
        "country": "GR"
      }],
    "social_media_occupational_account" : [{
           "social_media_occupational_account_type": "http://w3id.org/meta-share/meta-share/facebook",
           "value": "value"
    }],
    "division_category": "http://w3id.org/meta-share/meta-share/department",
    "is_division_of": [{
      "actor_type": "Organization",
       "organization_name": {
         "en": "ILSP"
       },
      "website": [
        "https://www.ilsp.gr"
      ],
      "is_division_of": [{
        "actor_type": "Organization",
         "organization_name": {
           "en": "evenhigher"
         },
        "website": [
          "https://www.evenhigher.gr"
        ]
      }]
    }]
  },
  "management_object": {}
}