<?xml version="1.0" encoding="iso-8859-1"?>
<!-- Generator: Adobe Illustrator 25.0.0, SVG Export Plug-In . SVG Version: 6.00 Build 0)  -->
<svg version="1.1" xmlns="http://www.w3.org/2000/svg" xmlns:xlink="http://www.w3.org/1999/xlink" x="0px" y="0px"
	 viewBox="0 0 1119.118 452.409" style="enable-background:new 0 0 1119.118 452.409;" xml:space="preserve">
<g id="colourscheme">
</g>
<g id="grid">
</g>
<g id="safety_zone">
</g>
<g id="typogram">
</g>
<g id="monogram">
</g>
<g id="symbol">
	<g>
		<path style="fill:#5CCED6;" d="M376.7,263.608l-10.139,45.42c-1.934,8.648-13.12,15.827-24.847,15.827H64.757
			c-11.706,0-17.662-7.179-13.295-15.827l23.012-45.42c3.966-7.832,16.115-14.16,27.055-14.16H359.98
			c9.428,0,16.319,4.697,16.931,11.01C377.002,261.471,376.946,262.525,376.7,263.608z"/>
		<path style="fill:#5CCED6;" d="M389.927,125.817H248.525H161.8c-9.643,0-20.037,4.925-23.124,11.018l-10.914,21.563l-6.856,13.527
			c-3.365,6.648,2.243,12.152,12.498,12.152h126.684h115.735c10.255,0,19.875-5.504,21.355-12.152l4.671-20.915l3.168-14.175
			C406.369,130.742,399.582,125.817,389.927,125.817z"/>
		<path style="fill:#47E0EB;" d="M376.909,260.455c-0.613-6.313-7.504-11.007-16.927-11.007H101.527
			c-10.938,0-23.089,6.324-27.055,14.163l-23.008,45.415c-4.37,8.648,1.584,15.828,13.296,15.828h165.393h111.561
			c11.724,0,22.916-7.18,24.846-15.828l10.14-45.415C376.944,262.524,377.001,261.472,376.909,260.455z"/>
		<path style="fill:#5CCED6;" d="M389.928,125.817H248.525H161.8c-9.643,0-20.037,4.925-23.124,11.018l-10.914,21.563l-6.856,13.527
			c-3.365,6.648,2.243,12.152,12.498,12.152h126.684h115.735c10.255,0,19.875-5.504,21.355-12.152l4.671-20.915l3.168-14.175
			C406.369,130.742,399.582,125.817,389.928,125.817z"/>
		<g>
			<path style="fill:#464646;" d="M655.821,380.193c-16.024,0-33.435-5.047-33.435-27.63v-42.521h19.683v42.016
				c0,9.083,3.911,11.985,13.752,11.985c9.588,0,13.752-3.028,13.752-14.006v-39.995h19.304v40.249
				C688.878,374.515,671.592,380.193,655.821,380.193z"/>
			<path style="fill:#464646;" d="M746.621,378.931l-5.424-15.898h-23.594l-6.057,15.898h-19.809l26.243-68.889h25.991
				l22.963,68.889H746.621z M732.112,332.879l-1.892-8.706l-2.272,8.706l-4.921,15.896h13.375L732.112,332.879z"/>
			<path style="fill:#464646;" d="M476.535,378.928v-68.886h51.854v15.266h-32.298v11.86h30.154v14.509h-30.154v11.986h34.569
				v15.266H476.535z"/>
			<path style="fill:#464646;" d="M574.441,380.695c-24.981,0-37.471-13.878-37.471-35.957c0-23.341,15.139-35.579,39.364-35.579
				c25.864,0,37.219,14.257,37.219,35.705C613.552,367.826,599.674,380.695,574.441,380.695z M575.45,324.677
				c-13.5,0-18.799,8.327-18.799,19.934c0,11.733,5.299,20.565,18.042,20.565c14.005,0,19.051-8.453,19.051-20.313
				C593.744,332.878,588.192,324.677,575.45,324.677z M600.557,400.755c-7.065,0-12.238-2.019-18.798-3.407
				c-1.388-0.252-2.776-0.378-9.588-0.378v-14.004c7.191,0,10.472,0.378,13.499,0.883c4.921,0.883,9.841,2.523,14.887,2.523h11.986
				v14.383H600.557z"/>
			<path style="fill:#464646;" d="M774.467,378.928v-68.886h19.556v53.494h29.775v15.392H774.467z"/>
			<path style="fill:#464646;" d="M834.093,378.928v-68.886h19.556v68.886H834.093z"/>
			<path style="fill:#464646;" d="M905.073,325.308v53.62h-19.556v-53.62h-21.574v-15.266h62.704v15.266H905.073z"/>
			<path style="fill:#464646;" d="M974.767,356.218v22.71h-19.556v-22.205l-26.369-46.681h22.584l14.257,29.649l15.139-29.649
				h22.079L974.767,356.218z"/>
			<path style="fill:#464646;" d="M476.535,141.597V72.32h52.149v15.354h-32.481V99.6h30.323v14.59h-30.323v12.053h34.764v15.354
				H476.535z"/>
			<path style="fill:#464646;" d="M574.951,142.866c-16.114,0-33.624-5.075-33.624-27.786V72.32h19.794v42.252
				c0,9.134,3.932,12.053,13.83,12.053c9.642,0,13.83-3.045,13.83-14.085V72.32h19.412v40.475
				C608.193,137.156,590.81,142.866,574.951,142.866z"/>
			<path style="fill:#464646;" d="M684.714,142.866c-12.816-0.508-20.681-5.456-27.406-12.814c0,0-6.599-7.233-10.152-11.295
				c-1.013,0-2.029,0-3.043,0h-3.553v22.839h-19.794V72.32h28.422c15.985,0,28.167,7.36,28.167,23.345
				c0,7.36-3.427,13.832-10.279,18.146c2.411,2.537,5.964,6.215,5.964,6.215c3.933,4.061,6.725,5.838,15.354,7.994L684.714,142.866z
				 M647.029,88.053h-6.47v16.622h4.059c9.389,0,12.563-3.553,12.563-8.628C657.181,90.338,655.278,88.053,647.029,88.053z"/>
			<path style="fill:#464646;" d="M726.375,142.739c-25.122,0-37.683-13.83-37.683-35.779c0-23.347,15.227-35.527,39.586-35.527
				c26.011,0,37.43,14.209,37.43,35.653C765.707,130.052,751.751,142.739,726.375,142.739z M727.391,86.91
				c-13.577,0-18.904,8.249-18.904,19.92c0,11.674,5.328,20.428,18.144,20.428c14.082,0,19.16-8.373,19.16-20.3
				C745.789,95.16,740.207,86.91,727.391,86.91z"/>
			<path style="fill:#464646;" d="M797.723,124.722h-3.553v16.875h-19.794V72.32h28.422c16.114,0,28.546,10.023,28.546,25.756
				C831.344,114.825,818.912,124.469,797.723,124.722z M800.639,87.926h-6.47v21.571h4.059c9.644,0,12.942-5.712,12.942-11.039
				C811.171,92.367,808.507,87.926,800.639,87.926z"/>
			<path style="fill:#464646;" d="M838.913,141.597V72.32h52.149v15.354h-32.481V99.6h30.323v14.59h-30.323v12.053h34.763v15.354
				H838.913z"/>
			<path style="fill:#464646;" d="M952.329,141.597l-5.454-15.988h-23.727l-6.091,15.988h-19.92l26.39-69.277h26.138l23.092,69.277
				H952.329z M937.739,95.286l-1.903-8.755l-2.285,8.755l-4.949,15.985h13.45L937.739,95.286z"/>
			<path style="fill:#464646;" d="M1024.975,141.597l-28.549-41.362l1.016,8.628v32.734h-19.668V72.32h21.697l28.549,42.505
				l-0.508-7.36V72.32h19.665v69.277H1024.975z"/>
			<path style="fill:#464646;" d="M476.535,260.942v-69.278h19.668v53.798h29.944v15.48H476.535z"/>
			<path style="fill:#464646;" d="M582.039,260.942l-5.454-15.988h-23.727l-6.091,15.988h-19.921l26.391-69.278h26.138
				l23.093,69.278H582.039z M567.449,214.63l-1.903-8.755l-2.285,8.755l-4.949,15.986h13.451L567.449,214.63z"/>
			<path style="fill:#464646;" d="M655.722,260.942l-28.549-41.363l1.016,8.628v32.735h-19.668v-69.278h21.698l28.549,42.506
				l-0.508-7.36v-35.146h19.666v69.278H655.722z"/>
			<path style="fill:#464646;" d="M726.649,261.958c-23.598,0-39.46-11.166-39.46-35.148c0-24.867,14.464-35.78,40.223-35.78
				c10.024,0,15.733,1.777,22.585,4.567l-5.33,14.085c-7.865-1.903-10.658-2.538-17.51-2.538c-11.674,0-20.047,5.075-20.047,18.779
				c0,13.577,9.263,19.794,21.316,19.794c0.89,0,1.903,0,2.793-0.129v-15.351h19.666v27.407
				C741.876,260.942,735.151,261.958,726.649,261.958z"/>
			<path style="fill:#464646;" d="M794.871,262.211c-16.115,0-33.624-5.075-33.624-27.786v-42.761h19.794v42.253
				c0,9.134,3.933,12.053,13.83,12.053c9.642,0,13.83-3.046,13.83-14.085v-40.221h19.413v40.476
				C828.114,256.501,810.731,262.211,794.871,262.211z"/>
			<path style="fill:#464646;" d="M883.684,260.942l-5.454-15.988h-23.727l-6.091,15.988h-19.921l26.391-69.278h26.138
				l23.093,69.278H883.684z M869.093,214.63l-1.903-8.755l-2.285,8.755l-4.949,15.986h13.451L869.093,214.63z"/>
			<path style="fill:#464646;" d="M944.114,261.958c-23.598,0-39.46-11.166-39.46-35.148c0-24.867,14.464-35.78,40.223-35.78
				c10.024,0,15.733,1.777,22.585,4.567l-5.33,14.085c-7.865-1.903-10.658-2.538-17.51-2.538c-11.674,0-20.047,5.075-20.047,18.779
				c0,13.577,9.263,19.794,21.316,19.794c0.89,0,1.903,0,2.793-0.129v-15.351h19.666v27.407
				C959.341,260.942,952.616,261.958,944.114,261.958z"/>
			<path style="fill:#464646;" d="M979.328,260.942v-69.278h52.15v15.354h-32.482v11.927h30.324v14.591h-30.324v12.053h34.764
				v15.354H979.328z"/>
		</g>
	</g>
</g>
</svg>
