{
    "bg": "Bulgarian",
    "hr": "Croatian",
    "cs": "Czech",
    "da": "Danish",
    "nl": "Dutch; Flemish",
    "en": "English",
    "et": "Estonian",
    "fi": "Finnish",
    "fr": "French",
    "de": "German",
    "hu": "Hungarian",
    "ga": "Irish",
    "it": "Italian",
    "lv": "Latvian",
    "lt": "Lithuanian",
    "mt": "Maltese",
    "el": "Modern Greek (1453-)",
    "pl": "Polish",
    "pt": "Portuguese",
    "ro": "Romanian; Moldavian; Moldovan",
    "sk": "Slovak",
    "sl": "Slovenian",
    "es": "Spanish; Castilian",
    "sv": "Swedish",
    "ab": "Abkhazian",
    "sq": "Albanian",
    "an": "Aragonese",
    "hy": "Armenian",
    "ast": "Asturian; Asturleonese; Bable; Leonese",
    "bar": "Bavarian",
    "az": "Azerbaijani",
    "be": "Belarusian",
    "eu": "Basque",
    "bs": "Bosnian",
    "br": "Breton",
    "ca": "Catalan; Valencian",
    "ce": "Chechen",
    "kw": "Cornish",
    "co": "Corsican",
    "fo": "Faroese",
    "ka": "Georgian",
    "gl": "Galician",
    "is": "Icelandic",
    "kk": "Kazakh",
    "lij": "Ligurian",
    "lmo": "Lombard",
    "dsb": "Lower Sorbian",
    "lb": "Luxembourgish; Letzeburgesch",
    "mk": "Macedonian",
    "nap": "Neapolitan",
    "frr": "Northern Frisian",
    "nn": "Norwegian Nynorsk",
    "se": "Northern Sami",
    "no": "Norwegian",
    "oc": "Occitan (post 1500)",
    "os": "Ossetian; Ossetic",
    "pms": "Piemontese",
    "ru": "Russian",
    "sc": "Sardinian",
    "sco": "Scots",
    "sr": "Serbian",
    "sh": "Serbo-Croatian",
    "scn": "Sicilian",
    "szl": "Silesian",
    "sms": "Skolt Sami",
    "swl": "Swedish Sign Language",
    "tr": "Turkish",
    "uk": "Ukrainian",
    "hsb": "Upper Sorbian",
    "vec": "Venetian",
    "wa": "Walloon",
    "cy": "Welsh",
    "fy": "Western Frisian",
    "gd": "Scottish Gaelic; Gaelic",
    "nds": "Low German; Low Saxon",
    "nb": "Norwegian Bokmål",
    "gsw": "Swiss German; Alemannic; Alsatian",
    "smi": "Sami languages",
    "zh": "Chinese",
    "ja": "Japanese"
}