<svg width="16" height="16" viewBox="0 0 16 16" fill="none" xmlns="http://www.w3.org/2000/svg">
<path d="M8.0001 12C8.3001 12 8.5001 11.9 8.7001 11.7L14.4001 6L13.0001 4.6L9.0001 8.6V0H7.0001V8.6L3.0001 4.6L1.6001 6L7.3001 11.7C7.5001 11.9 7.7001 12 8.0001 12Z" fill="#299BA3"/>
<path d="M15 14H1V16H15V14Z" fill="#299BA3"/>
</svg>
