{
  "header": {
    "id": "2579efd9-42c3-4cb7-a7f2-ed359a7ab9cb",
    "name": "test",
    "title": "Socrata Harvester",
    "version": "2.0.0",
    "context": "EDP2",
    "transport": "payload"
  },
  "body": {
    "segments": [
      {
        "header": {
          "name": "importing-socrata",
          "segmentNumber": 1,
          "title": "Importing Socrata",
          "processed": false
        },
        "body": {
          "config": {
            "address": "https://cohesiondata.ec.europa.eu",
            "catalogue": "test",
            "outputFormat": "application/json"
          }
        }
      },
      {
        "header": {
          "name": "exporting-hub",
          "segmentNumber": 2,
          "title": "Exporting hub",
          "processed": false
        },
        "body": {
          "config": {
            "hub": {
              "serviceName": "piveau-hub"
            }
          }
        }
      }
    ]
  }
}
