{
  "title": "Lufttemperatur",
  "notes": "Der Datensatz liefert die aktuellen Stundenmittelwerte der Lufttemperatur des NÖ Luftgüteüberwachungsnetzes. Die Daten werden in °C als Einstundenmittelwerte bereitgestellt. Die Aktualisierung erfolgt stündlich (Angaben immer in MEZ!). Die Datei wird täglich für den Zeitraum von  0 bis 24 Uhr erstellt, sodass immer nur die Messwerte des aktuellen Tages zur Verfügung stehen. Der Dateiname ist immer der gleiche.",
  "name": "land-noe-lufttemperatur",
  "author": null,
  "author_email": null,
  "maintainer": "Abteilung Umwelttechnik",
  "maintainer_email": null,
  "license_id": "cc-by",
  "url": null,
  "state": "active",
  "tags": [
    {
      "name": "Immission"
    },
    {
      "name": "Luftgüte"
    },
    {
      "name": "Luftqualität"
    },
    {
      "name": "Luftschadstoffe"
    },
    {
      "name": "Lufttemperatur"
    },
    {
      "name": "NUMBIS"
    },
    {
      "name": "Wetterdaten"
    }
  ],
  "resources": [
    {
      "name": null,
      "description": "",
      "format": "CSV",
      "url": "http://open-data.noe.gv.at/BD4/Lufttemperatur.csv"
    }
  ],
  "accrual_periodicity": [
    {
      "resource": "http://purl.org/cld/freq/continuous"
    }
  ],
  "temporal": [
    {
      "start_date": "2013-04-10T00:00:00.000000",
      "end_date": "2011-10-31T00:00:00.000000"
    }
  ],
  "publisher": {
    "name": "Land Niederösterreich",
    "type": "Organization"
  },
  "groups": [
    {
      "name": "environment"
    }
  ]
}
