<?xml version="1.0" encoding="UTF-8"?>
<svg xmlns="http://www.w3.org/2000/svg" xmlns:xlink="http://www.w3.org/1999/xlink" version="1.1" id="Layer_1" x="0px" y="0px" viewBox="0 0 375 490" style="enable-background:new 0 0 375 490;" xml:space="preserve">
<style type="text/css">
	.st0{fill:#1E646E;}
	.st1{fill:#134148;}
	.st2{fill:#55C3D2;}
	.st3{clip-path:url(#SVGID_00000070803758511325539970000000960024756427956413_);}
	.st4{fill:none;}
	.st5{fill:#FFD6CA;}
	.st6{clip-path:url(#SVGID_00000038403678347353865030000011182658004492327089_);}
	.st7{clip-path:url(#SVGID_00000052816385774568421320000000740495294069124757_);}
	.st8{clip-path:url(#SVGID_00000029034546910414532850000006587622808502552766_);}
	.st9{clip-path:url(#SVGID_00000050638210980498366340000013328735980885733053_);}
	.st10{clip-path:url(#SVGID_00000057110294179895516040000004710881337182094991_);}
	.st11{clip-path:url(#SVGID_00000140692542609372912210000005041407097556201140_);}
	.st12{clip-path:url(#SVGID_00000055709439410368483620000009913399566764923819_);}
	.st13{clip-path:url(#SVGID_00000057863806651870122730000016354232527808824478_);}
	.st14{clip-path:url(#SVGID_00000142891457424228302970000009443996410371968401_);}
	.st15{clip-path:url(#SVGID_00000156574479134403787490000005244949682826547866_);}
	.st16{clip-path:url(#SVGID_00000085964575587384312890000017380541746685498003_);}
	.st17{clip-path:url(#SVGID_00000174568961649294421600000002779225132616625045_);}
	.st18{clip-path:url(#SVGID_00000110439650610859143610000009475422993656890031_);}
	.st19{clip-path:url(#SVGID_00000098915675372478729570000014628216165341465224_);}
	.st20{clip-path:url(#SVGID_00000029750296834243978910000014889230401007949497_);}
	.st21{clip-path:url(#SVGID_00000029725281062396321730000000654739704378658441_);}
	.st22{clip-path:url(#SVGID_00000048485498213629942100000006864079211102627483_);}
	.st23{clip-path:url(#SVGID_00000092443231707691543020000004801924306898457277_);}
	.st24{clip-path:url(#SVGID_00000065769762113702274980000016070100937128362174_);}
	.st25{clip-path:url(#SVGID_00000030455877460898618660000010721185047004774590_);}
	.st26{clip-path:url(#SVGID_00000150786070397600327280000012658059600194432702_);}
	.st27{clip-path:url(#SVGID_00000041286210925457465510000001752271304419451528_);}
	.st28{fill:none;stroke:#55C3D2;stroke-miterlimit:10;}
</style>
<g>
	<rect class="st0" width="375" height="490"></rect>
	<path class="st1" d="M0,90.181V427.34c52.945-37.296,87.539-98.895,87.539-168.579S52.945,127.477,0,90.181z"></path>
	<path class="st1" d="M375,490V347.748c-43.799,3.636-78.219,40.311-78.219,85.049c0,22.016,8.348,42.069,22.035,57.203H375z"></path>
	<path class="st2" d="M165.322,0c-16.638,35.709-52.867,60.523-94.789,60.523c-27.164,0-51.93-10.428-70.533-27.478v1.348   c18.704,16.85,43.435,27.131,70.533,27.131c42.488,0,79.185-25.246,95.893-61.523L165.322,0L165.322,0z"></path>
	<g>
		<g>
			<g>
				<defs>
					<circle id="SVGID_1_" cx="17.186" cy="378.095" r="97.877"></circle>
				</defs>
				<clipPath id="SVGID_00000072961851347760190100000002431073621017404578_">
					<use xlink:href="#SVGID_1_" style="overflow:visible;"></use>
				</clipPath>
				<g style="clip-path:url(#SVGID_00000072961851347760190100000002431073621017404578_);">
					
						<rect x="49.829" y="237.325" transform="matrix(0.7071 -0.7071 0.7071 0.7071 -162.4479 127.0244)" class="st4" width="44.559" height="44.559"></rect>
					<path class="st5" d="M97.504,255.205c0.473,0.473,0.473,1.239,0,1.712s-1.239,0.473-1.712,0s-0.473-1.239,0-1.712       C96.265,254.732,97.032,254.732,97.504,255.205z"></path>
					<path class="st5" d="M87.002,265.708c0.473,0.473,0.473,1.239,0,1.712s-1.239,0.473-1.712,0s-0.473-1.239,0-1.712       C85.763,265.235,86.529,265.235,87.002,265.708z"></path>
					<path class="st5" d="M76.499,276.211c0.473,0.473,0.473,1.239,0,1.712s-1.239,0.473-1.712,0s-0.473-1.239,0-1.712       S76.026,275.738,76.499,276.211z"></path>
					<path class="st5" d="M83.501,248.203c0.473,0.473,0.473,1.239,0,1.712s-1.239,0.473-1.712,0s-0.473-1.239,0-1.712       C82.262,247.731,83.028,247.731,83.501,248.203z"></path>
					<path class="st5" d="M72.998,258.706c0.473,0.473,0.473,1.239,0,1.712s-1.239,0.473-1.712,0s-0.473-1.239,0-1.712       S72.525,258.233,72.998,258.706z"></path>
					<circle class="st5" cx="61.639" cy="270.065" r="1.21"></circle>
					<circle class="st5" cx="68.641" cy="242.057" r="1.21"></circle>
					<path class="st5" d="M58.994,251.704c0.473,0.473,0.473,1.239,0,1.712s-1.239,0.473-1.712,0c-0.473-0.473-0.473-1.239,0-1.712       C57.755,251.232,58.522,251.232,58.994,251.704z"></path>
					<circle class="st5" cx="47.636" cy="263.063" r="1.21"></circle>
				</g>
			</g>
		</g>
		<g>
			<g>
				<defs>
					<circle id="SVGID_00000144301047218539639370000002815871046716271529_" cx="17.186" cy="378.095" r="97.877"></circle>
				</defs>
				<clipPath id="SVGID_00000062878930411452233790000002470576274469539488_">
					<use xlink:href="#SVGID_00000144301047218539639370000002815871046716271529_" style="overflow:visible;"></use>
				</clipPath>
				<g style="clip-path:url(#SVGID_00000062878930411452233790000002470576274469539488_);">
					
						<rect x="81.337" y="268.833" transform="matrix(0.7071 -0.7071 0.7071 0.7071 -175.4989 158.5324)" class="st4" width="44.559" height="44.559"></rect>
					
						<ellipse transform="matrix(0.1414 -0.9899 0.9899 0.1414 -174.6428 373.7737)" class="st5" cx="128.163" cy="287.57" rx="1.21" ry="1.21"></ellipse>
					<circle class="st5" cx="117.654" cy="298.072" r="1.21"></circle>
					<path class="st5" d="M108.007,307.719c0.473,0.473,0.473,1.239,0,1.712s-1.239,0.473-1.712,0s-0.473-1.239,0-1.712       C106.768,307.246,107.535,307.246,108.007,307.719z"></path>
					<path class="st5" d="M115.009,279.711c0.473,0.473,0.473,1.239,0,1.712s-1.239,0.473-1.712,0s-0.473-1.239,0-1.712       C113.77,279.239,114.536,279.239,115.009,279.711z"></path>
					<circle class="st5" cx="103.65" cy="291.07" r="1.21"></circle>
					<circle class="st5" cx="93.148" cy="301.573" r="1.21"></circle>
					<path class="st5" d="M101.005,272.71c0.473,0.473,0.473,1.239,0,1.712s-1.239,0.473-1.712,0s-0.473-1.239,0-1.712       S100.533,272.237,101.005,272.71z"></path>
					<path class="st5" d="M90.503,283.212c0.473,0.473,0.473,1.239,0,1.712s-1.239,0.473-1.712,0s-0.473-1.239,0-1.712       C89.264,282.74,90.03,282.74,90.503,283.212z"></path>
					<path class="st5" d="M80,293.715c0.473,0.473,0.473,1.239,0,1.712s-1.239,0.473-1.712,0s-0.473-1.239,0-1.712       S79.527,293.242,80,293.715z"></path>
				</g>
			</g>
		</g>
		<g>
			<g>
				<defs>
					<circle id="SVGID_00000006679226798029528410000007013421069255624587_" cx="17.186" cy="378.095" r="97.877"></circle>
				</defs>
				<clipPath id="SVGID_00000012458211137070418250000010068146772282714501_">
					<use xlink:href="#SVGID_00000006679226798029528410000007013421069255624587_" style="overflow:visible;"></use>
				</clipPath>
				<g style="clip-path:url(#SVGID_00000012458211137070418250000010068146772282714501_);">
					
						<rect x="112.844" y="300.341" transform="matrix(0.7071 -0.7071 0.7071 0.7071 -188.55 190.0397)" class="st4" width="44.559" height="44.559"></rect>
					<circle class="st5" cx="159.665" cy="319.077" r="1.21"></circle>
					<circle class="st5" cx="149.162" cy="329.58" r="1.21"></circle>
					<path class="st5" d="M139.515,339.227c0.473,0.473,0.473,1.239,0,1.712s-1.239,0.473-1.712,0s-0.473-1.239,0-1.712       S139.043,338.754,139.515,339.227z"></path>
					<path class="st5" d="M146.517,311.22c0.473,0.473,0.473,1.239,0,1.712s-1.239,0.473-1.712,0s-0.473-1.239,0-1.712       S146.045,310.747,146.517,311.22z"></path>
					<path class="st5" d="M136.014,321.722c0.473,0.473,0.473,1.239,0,1.712s-1.239,0.473-1.712,0s-0.473-1.239,0-1.712       C134.775,321.25,135.542,321.25,136.014,321.722z"></path>
					<path class="st5" d="M125.512,332.225c0.473,0.473,0.473,1.239,0,1.712s-1.239,0.473-1.712,0s-0.473-1.239,0-1.712       S125.039,331.752,125.512,332.225z"></path>
					<path class="st5" d="M132.514,304.218c0.473,0.473,0.473,1.239,0,1.712s-1.239,0.473-1.712,0s-0.473-1.239,0-1.712       C131.274,303.745,132.041,303.745,132.514,304.218z"></path>
					<path class="st5" d="M122.011,314.721c0.473,0.473,0.473,1.239,0,1.712s-1.239,0.473-1.712,0s-0.473-1.239,0-1.712       C120.772,314.248,121.538,314.248,122.011,314.721z"></path>
					<path class="st5" d="M111.508,325.223c0.473,0.473,0.473,1.239,0,1.712s-1.239,0.473-1.712,0s-0.473-1.239,0-1.712       C110.269,324.751,111.035,324.751,111.508,325.223z"></path>
				</g>
			</g>
		</g>
		<g>
			<g>
				<defs>
					<circle id="SVGID_00000094605479703522083820000012017814075023337912_" cx="17.186" cy="378.095" r="97.877"></circle>
				</defs>
				<clipPath id="SVGID_00000002382087341034556550000002284937813038037949_">
					<use xlink:href="#SVGID_00000094605479703522083820000012017814075023337912_" style="overflow:visible;"></use>
				</clipPath>
				<g style="clip-path:url(#SVGID_00000002382087341034556550000002284937813038037949_);">
					
						<rect x="-13.186" y="237.324" transform="matrix(0.7071 -0.7071 0.7071 0.7071 -180.9042 82.466)" class="st4" width="44.559" height="44.559"></rect>
					<path class="st5" d="M34.488,255.205c0.473,0.473,0.473,1.239,0,1.712s-1.239,0.473-1.712,0c-0.473-0.473-0.473-1.239,0-1.712       C33.249,254.732,34.015,254.732,34.488,255.205z"></path>
					<path class="st5" d="M23.985,265.708c0.473,0.473,0.473,1.239,0,1.712s-1.239,0.473-1.712,0s-0.473-1.239,0-1.712       C22.746,265.235,23.513,265.235,23.985,265.708z"></path>
					<circle class="st5" cx="12.627" cy="277.066" r="1.21"></circle>
					<path class="st5" d="M20.484,248.203c0.473,0.473,0.473,1.239,0,1.712s-1.239,0.473-1.712,0s-0.473-1.239,0-1.712       C19.245,247.731,20.012,247.731,20.484,248.203z"></path>
					<path class="st5" d="M9.982,258.706c0.473,0.473,0.473,1.239,0,1.712s-1.239,0.473-1.712,0c-0.473-0.473-0.473-1.239,0-1.712       C8.743,258.233,9.509,258.233,9.982,258.706z"></path>
					<path class="st5" d="M6.481,241.201c0.473,0.473,0.473,1.239,0,1.712s-1.239,0.473-1.712,0s-0.473-1.239,0-1.712       C5.242,240.729,6.008,240.729,6.481,241.201z"></path>
				</g>
			</g>
		</g>
		<g>
			<g>
				<defs>
					<circle id="SVGID_00000064346887710624073290000015858210527539895739_" cx="17.186" cy="378.095" r="97.877"></circle>
				</defs>
				<clipPath id="SVGID_00000119100109921547088730000004172783285050150069_">
					<use xlink:href="#SVGID_00000064346887710624073290000015858210527539895739_" style="overflow:visible;"></use>
				</clipPath>
				<g style="clip-path:url(#SVGID_00000119100109921547088730000004172783285050150069_);">
					
						<rect x="18.321" y="268.832" transform="matrix(0.7071 -0.7071 0.7071 0.7071 -193.9553 113.9733)" class="st4" width="44.559" height="44.559"></rect>
					<path class="st5" d="M65.996,286.713c0.473,0.473,0.473,1.239,0,1.712s-1.239,0.473-1.712,0s-0.473-1.239,0-1.712       C64.757,286.241,65.524,286.241,65.996,286.713z"></path>
					<path class="st5" d="M55.494,297.216c0.473,0.473,0.473,1.239,0,1.712s-1.239,0.473-1.712,0c-0.473-0.473-0.473-1.239,0-1.712       C54.254,296.743,55.021,296.743,55.494,297.216z"></path>
					<path class="st5" d="M44.991,307.719c0.473,0.473,0.473,1.239,0,1.712s-1.239,0.473-1.712,0s-0.473-1.239,0-1.712       S44.518,307.246,44.991,307.719z"></path>
					<path class="st5" d="M51.993,279.711c0.473,0.473,0.473,1.239,0,1.712s-1.239,0.473-1.712,0c-0.473-0.473-0.473-1.239,0-1.712       C50.754,279.239,51.52,279.239,51.993,279.711z"></path>
					<path class="st5" d="M41.49,290.214c0.473,0.473,0.473,1.239,0,1.712s-1.239,0.473-1.712,0c-0.473-0.473-0.473-1.239,0-1.712       C40.251,289.742,41.017,289.742,41.49,290.214z"></path>
					<path class="st5" d="M30.987,300.717c0.473,0.473,0.473,1.239,0,1.712s-1.239,0.473-1.712,0s-0.473-1.239,0-1.712       C29.748,300.244,30.514,300.244,30.987,300.717z"></path>
					<circle class="st5" cx="37.133" cy="273.566" r="1.21"></circle>
					<circle class="st5" cx="26.63" cy="284.068" r="1.21"></circle>
					<path class="st5" d="M16.984,293.715c0.473,0.473,0.473,1.239,0,1.712s-1.239,0.473-1.712,0s-0.473-1.239,0-1.712       C15.744,293.242,16.511,293.242,16.984,293.715z"></path>
				</g>
			</g>
		</g>
		<g>
			<g>
				<defs>
					<circle id="SVGID_00000047030124687618481530000002244659697194992036_" cx="17.186" cy="378.095" r="97.877"></circle>
				</defs>
				<clipPath id="SVGID_00000157286054059693102260000004854624966433688467_">
					<use xlink:href="#SVGID_00000047030124687618481530000002244659697194992036_" style="overflow:visible;"></use>
				</clipPath>
				<g style="clip-path:url(#SVGID_00000157286054059693102260000004854624966433688467_);">
					
						<rect x="49.827" y="300.341" transform="matrix(0.7071 -0.7071 0.7071 0.7071 -207.0071 145.4803)" class="st4" width="44.559" height="44.559"></rect>
					<path class="st5" d="M97.504,318.222c0.473,0.473,0.473,1.239,0,1.712s-1.239,0.473-1.712,0s-0.473-1.239,0-1.712       S97.032,317.749,97.504,318.222z"></path>
					<path class="st5" d="M87.002,328.724c0.473,0.473,0.473,1.239,0,1.712s-1.239,0.473-1.712,0s-0.473-1.239,0-1.712       C85.763,328.252,86.529,328.252,87.002,328.724z"></path>
					<circle class="st5" cx="75.643" cy="340.083" r="1.21"></circle>
					<circle class="st5" cx="82.645" cy="312.076" r="1.21"></circle>
					<path class="st5" d="M72.998,321.722c0.473,0.473,0.473,1.239,0,1.712s-1.239,0.473-1.712,0s-0.473-1.239,0-1.712       C71.759,321.25,72.525,321.25,72.998,321.722z"></path>
					<circle class="st5" cx="61.639" cy="333.081" r="1.21"></circle>
					<circle class="st5" cx="68.641" cy="305.074" r="1.21"></circle>
					<path class="st5" d="M58.994,314.721c0.473,0.473,0.473,1.239,0,1.712s-1.239,0.473-1.712,0c-0.473-0.473-0.473-1.239,0-1.712       C57.755,314.248,58.522,314.248,58.994,314.721z"></path>
					<path class="st5" d="M48.492,325.223c0.473,0.473,0.473,1.239,0,1.712s-1.239,0.473-1.712,0c-0.473-0.473-0.473-1.239,0-1.712       C47.253,324.751,48.019,324.751,48.492,325.223z"></path>
				</g>
			</g>
		</g>
		<g>
			<g>
				<defs>
					<circle id="SVGID_00000133495342004921520850000007887349188984573340_" cx="17.186" cy="378.095" r="97.877"></circle>
				</defs>
				<clipPath id="SVGID_00000099655761965048956110000012727221481112109728_">
					<use xlink:href="#SVGID_00000133495342004921520850000007887349188984573340_" style="overflow:visible;"></use>
				</clipPath>
				<g style="clip-path:url(#SVGID_00000099655761965048956110000012727221481112109728_);">
					
						<rect x="81.336" y="331.849" transform="matrix(0.7071 -0.7071 0.7071 0.7071 -220.0579 176.9888)" class="st4" width="44.559" height="44.559"></rect>
					<path class="st5" d="M129.013,349.73c0.473,0.473,0.473,1.239,0,1.712s-1.239,0.473-1.712,0s-0.473-1.239,0-1.712       C127.774,349.257,128.54,349.257,129.013,349.73z"></path>
					<path class="st5" d="M118.51,360.232c0.473,0.473,0.473,1.239,0,1.712s-1.239,0.473-1.712,0s-0.473-1.239,0-1.712       C117.271,359.76,118.037,359.76,118.51,360.232z"></path>
					<circle class="st5" cx="107.151" cy="371.591" r="1.21"></circle>
					<path class="st5" d="M115.009,342.728c0.473,0.473,0.473,1.239,0,1.712s-1.239,0.473-1.712,0s-0.473-1.239,0-1.712       C113.77,342.255,114.536,342.255,115.009,342.728z"></path>
					<path class="st5" d="M104.506,353.231c0.473,0.473,0.473,1.239,0,1.712s-1.239,0.473-1.712,0s-0.473-1.239,0-1.712       S104.034,352.758,104.506,353.231z"></path>
					<path class="st5" d="M94.004,363.733c0.473,0.473,0.473,1.239,0,1.712s-1.239,0.473-1.712,0s-0.473-1.239,0-1.712       C92.764,363.261,93.531,363.261,94.004,363.733z"></path>
					<path class="st5" d="M101.005,335.726c0.473,0.473,0.473,1.239,0,1.712s-1.239,0.473-1.712,0s-0.473-1.239,0-1.712       C99.766,335.253,100.533,335.253,101.005,335.726z"></path>
					<path class="st5" d="M90.503,346.229c0.473,0.473,0.473,1.239,0,1.712s-1.239,0.473-1.712,0s-0.473-1.239,0-1.712       S90.03,345.756,90.503,346.229z"></path>
					<path class="st5" d="M80,356.732c0.473,0.473,0.473,1.239,0,1.712s-1.239,0.473-1.712,0s-0.473-1.239,0-1.712       S79.527,356.259,80,356.732z"></path>
				</g>
			</g>
		</g>
		<g>
			<g>
				<defs>
					<circle id="SVGID_00000178916016238970487640000017267147250972694715_" cx="17.186" cy="378.095" r="97.877"></circle>
				</defs>
				<clipPath id="SVGID_00000040568561968614171120000006064469035297473471_">
					<use xlink:href="#SVGID_00000178916016238970487640000017267147250972694715_" style="overflow:visible;"></use>
				</clipPath>
				<g style="clip-path:url(#SVGID_00000040568561968614171120000006064469035297473471_);">
					
						<rect x="112.843" y="363.356" transform="matrix(0.7071 -0.7071 0.7071 0.7071 -233.1089 208.4961)" class="st4" width="44.559" height="44.559"></rect>
					<path class="st5" d="M160.521,381.238c0.473,0.473,0.473,1.239,0,1.712s-1.239,0.473-1.712,0s-0.473-1.239,0-1.712       S160.048,380.765,160.521,381.238z"></path>
					<path class="st5" d="M150.018,391.741c0.473,0.473,0.473,1.239,0,1.712s-1.239,0.473-1.712,0s-0.473-1.239,0-1.712       S149.545,391.268,150.018,391.741z"></path>
					<path class="st5" d="M139.515,402.243c0.473,0.473,0.473,1.239,0,1.712s-1.239,0.473-1.712,0s-0.473-1.239,0-1.712       C138.276,401.771,139.043,401.771,139.515,402.243z"></path>
					<path class="st5" d="M146.517,374.236c0.473,0.473,0.473,1.239,0,1.712s-1.239,0.473-1.712,0s-0.473-1.239,0-1.712       S146.045,373.763,146.517,374.236z"></path>
					<path class="st5" d="M136.014,384.739c0.473,0.473,0.473,1.239,0,1.712s-1.239,0.473-1.712,0s-0.473-1.239,0-1.712       C134.775,384.266,135.542,384.266,136.014,384.739z"></path>
					<path class="st5" d="M125.512,395.242c0.473,0.473,0.473,1.239,0,1.712s-1.239,0.473-1.712,0s-0.473-1.239,0-1.712       S125.039,394.769,125.512,395.242z"></path>
					<circle class="st5" cx="131.658" cy="368.09" r="1.21"></circle>
					<circle class="st5" cx="121.155" cy="378.593" r="1.21"></circle>
					<path class="st5" d="M111.508,388.24c0.473,0.473,0.473,1.239,0,1.712s-1.239,0.473-1.712,0s-0.473-1.239,0-1.712       C110.269,387.767,111.035,387.767,111.508,388.24z"></path>
				</g>
			</g>
		</g>
		<g>
			<g>
				<defs>
					<circle id="SVGID_00000027575423414780110050000006074479466279785366_" cx="17.186" cy="378.095" r="97.877"></circle>
				</defs>
				<clipPath id="SVGID_00000093868161956254462420000011112385149329351826_">
					<use xlink:href="#SVGID_00000027575423414780110050000006074479466279785366_" style="overflow:visible;"></use>
				</clipPath>
				<g style="clip-path:url(#SVGID_00000093868161956254462420000011112385149329351826_);">
					
						<rect x="-44.695" y="268.831" transform="matrix(0.7071 -0.7071 0.7071 0.7071 -212.4113 69.4142)" class="st4" width="44.559" height="44.559"></rect>
					<circle class="st5" cx="2.124" cy="287.569" r="1.21"></circle>
				</g>
			</g>
		</g>
		<g>
			<g>
				<defs>
					<circle id="SVGID_00000069399140582531867020000014787041055221383300_" cx="17.186" cy="378.095" r="97.877"></circle>
				</defs>
				<clipPath id="SVGID_00000148629946826947285620000002725250546619596939_">
					<use xlink:href="#SVGID_00000069399140582531867020000014787041055221383300_" style="overflow:visible;"></use>
				</clipPath>
				<g style="clip-path:url(#SVGID_00000148629946826947285620000002725250546619596939_);">
					
						<rect x="-13.187" y="300.339" transform="matrix(0.7071 -0.7071 0.7071 0.7071 -225.4623 100.9216)" class="st4" width="44.559" height="44.559"></rect>
					<path class="st5" d="M34.488,318.222c0.473,0.473,0.473,1.239,0,1.712s-1.239,0.473-1.712,0c-0.473-0.473-0.473-1.239,0-1.712       C33.249,317.749,34.015,317.749,34.488,318.222z"></path>
					<path class="st5" d="M23.985,328.724c0.473,0.473,0.473,1.239,0,1.712s-1.239,0.473-1.712,0s-0.473-1.239,0-1.712       C22.746,328.252,23.513,328.252,23.985,328.724z"></path>
					<path class="st5" d="M13.483,339.227c0.473,0.473,0.473,1.239,0,1.712s-1.239,0.473-1.712,0s-0.473-1.239,0-1.712       C12.244,338.754,13.01,338.754,13.483,339.227z"></path>
					<circle class="st5" cx="19.629" cy="312.076" r="1.21"></circle>
					<circle class="st5" cx="9.126" cy="322.578" r="1.21"></circle>
					<path class="st5" d="M6.481,304.218c0.473,0.473,0.473,1.239,0,1.712s-1.239,0.473-1.712,0s-0.473-1.239,0-1.712       S6.008,303.745,6.481,304.218z"></path>
				</g>
			</g>
		</g>
		<g>
			<g>
				<defs>
					<circle id="SVGID_00000056399326397064141630000001790857097166059696_" cx="17.186" cy="378.095" r="97.877"></circle>
				</defs>
				<clipPath id="SVGID_00000038390524653914284490000005816553981226252709_">
					<use xlink:href="#SVGID_00000056399326397064141630000001790857097166059696_" style="overflow:visible;"></use>
				</clipPath>
				<g style="clip-path:url(#SVGID_00000038390524653914284490000005816553981226252709_);">
					
						<rect x="18.32" y="331.848" transform="matrix(0.7071 -0.7071 0.7071 0.7071 -238.5143 132.4297)" class="st4" width="44.559" height="44.559"></rect>
					<circle class="st5" cx="65.14" cy="350.586" r="1.21"></circle>
					<path class="st5" d="M55.494,360.232c0.473,0.473,0.473,1.239,0,1.712s-1.239,0.473-1.712,0c-0.473-0.473-0.473-1.239,0-1.712       C54.254,359.76,55.021,359.76,55.494,360.232z"></path>
					<path class="st5" d="M44.991,370.735c0.473,0.473,0.473,1.239,0,1.712s-1.239,0.473-1.712,0c-0.473-0.473-0.473-1.239,0-1.712       S44.518,370.262,44.991,370.735z"></path>
					<circle class="st5" cx="51.137" cy="343.584" r="1.21"></circle>
					<circle class="st5" cx="40.634" cy="354.087" r="1.21"></circle>
					<circle class="st5" cx="30.131" cy="364.589" r="1.21"></circle>
					<path class="st5" d="M37.989,335.726c0.473,0.473,0.473,1.239,0,1.712s-1.239,0.473-1.712,0c-0.473-0.473-0.473-1.239,0-1.712       C36.75,335.253,37.516,335.253,37.989,335.726z"></path>
					<path class="st5" d="M27.486,346.229c0.473,0.473,0.473,1.239,0,1.712s-1.239,0.473-1.712,0s-0.473-1.239,0-1.712       S27.014,345.756,27.486,346.229z"></path>
					
						<ellipse transform="matrix(0.0256 -0.9997 0.9997 0.0256 -341.7555 364.5375)" class="st5" cx="16.121" cy="357.581" rx="1.21" ry="1.21"></ellipse>
				</g>
			</g>
		</g>
		<g>
			<g>
				<defs>
					<circle id="SVGID_00000106866322170401050140000010364938654755081613_" cx="17.186" cy="378.095" r="97.877"></circle>
				</defs>
				<clipPath id="SVGID_00000147908411369763882840000017237087506824320424_">
					<use xlink:href="#SVGID_00000106866322170401050140000010364938654755081613_" style="overflow:visible;"></use>
				</clipPath>
				<g style="clip-path:url(#SVGID_00000147908411369763882840000017237087506824320424_);">
					
						<rect x="49.827" y="363.356" transform="matrix(0.7071 -0.7071 0.7071 0.7071 -251.5661 163.9369)" class="st4" width="44.559" height="44.559"></rect>
					<circle class="st5" cx="96.649" cy="382.094" r="1.21"></circle>
					<path class="st5" d="M87.002,391.741c0.473,0.473,0.473,1.239,0,1.712s-1.239,0.473-1.712,0s-0.473-1.239,0-1.712       S86.529,391.268,87.002,391.741z"></path>
					<path class="st5" d="M76.499,402.243c0.473,0.473,0.473,1.239,0,1.712s-1.239,0.473-1.712,0s-0.473-1.239,0-1.712       C75.26,401.771,76.026,401.771,76.499,402.243z"></path>
					<path class="st5" d="M83.501,374.236c0.473,0.473,0.473,1.239,0,1.712s-1.239,0.473-1.712,0s-0.473-1.239,0-1.712       S83.028,373.763,83.501,374.236z"></path>
					<path class="st5" d="M72.998,384.739c0.473,0.473,0.473,1.239,0,1.712s-1.239,0.473-1.712,0s-0.473-1.239,0-1.712       C71.759,384.266,72.525,384.266,72.998,384.739z"></path>
					<path class="st5" d="M62.495,395.242c0.473,0.473,0.473,1.239,0,1.712s-1.239,0.473-1.712,0c-0.473-0.473-0.473-1.239,0-1.712       C61.256,394.769,62.023,394.769,62.495,395.242z"></path>
					<path class="st5" d="M69.497,367.234c0.473,0.473,0.473,1.239,0,1.712s-1.239,0.473-1.712,0s-0.473-1.239,0-1.712       C68.258,366.762,69.024,366.762,69.497,367.234z"></path>
					<path class="st5" d="M58.994,377.737c0.473,0.473,0.473,1.239,0,1.712s-1.239,0.473-1.712,0c-0.473-0.473-0.473-1.239,0-1.712       C57.755,377.264,58.522,377.264,58.994,377.737z"></path>
					<path class="st5" d="M48.492,388.24c0.473,0.473,0.473,1.239,0,1.712s-1.239,0.473-1.712,0c-0.473-0.473-0.473-1.239,0-1.712       S48.019,387.767,48.492,388.24z"></path>
				</g>
			</g>
		</g>
		<g>
			<g>
				<defs>
					<circle id="SVGID_00000088095562117035696330000008018164020068644533_" cx="17.186" cy="378.095" r="97.877"></circle>
				</defs>
				<clipPath id="SVGID_00000055672190624805888700000001191614701096461450_">
					<use xlink:href="#SVGID_00000088095562117035696330000008018164020068644533_" style="overflow:visible;"></use>
				</clipPath>
				<g style="clip-path:url(#SVGID_00000055672190624805888700000001191614701096461450_);">
					
						<rect x="81.335" y="394.864" transform="matrix(0.7071 -0.7071 0.7071 0.7071 -264.6171 195.4448)" class="st4" width="44.559" height="44.559"></rect>
					<path class="st5" d="M129.013,412.746c0.473,0.473,0.473,1.239,0,1.712s-1.239,0.473-1.712,0s-0.473-1.239,0-1.712       S128.54,412.273,129.013,412.746z"></path>
					<path class="st5" d="M118.51,423.249c0.473,0.473,0.473,1.239,0,1.712s-1.239,0.473-1.712,0s-0.473-1.239,0-1.712       S118.037,422.776,118.51,423.249z"></path>
					<path class="st5" d="M108.007,433.752c0.473,0.473,0.473,1.239,0,1.712s-1.239,0.473-1.712,0s-0.473-1.239,0-1.712       C106.768,433.279,107.535,433.279,108.007,433.752z"></path>
					<path class="st5" d="M115.009,405.744c0.473,0.473,0.473,1.239,0,1.712s-1.239,0.473-1.712,0s-0.473-1.239,0-1.712       C113.77,405.272,114.536,405.272,115.009,405.744z"></path>
					<path class="st5" d="M104.506,416.247c0.473,0.473,0.473,1.239,0,1.712s-1.239,0.473-1.712,0s-0.473-1.239,0-1.712       C103.267,415.774,104.034,415.774,104.506,416.247z"></path>
					<path class="st5" d="M94.004,426.75c0.473,0.473,0.473,1.239,0,1.712s-1.239,0.473-1.712,0s-0.473-1.239,0-1.712       C92.764,426.277,93.531,426.277,94.004,426.75z"></path>
					<path class="st5" d="M101.005,398.742c0.473,0.473,0.473,1.239,0,1.712s-1.239,0.473-1.712,0s-0.473-1.239,0-1.712       C99.766,398.27,100.533,398.27,101.005,398.742z"></path>
					<circle class="st5" cx="89.647" cy="410.101" r="1.21"></circle>
					<circle class="st5" cx="79.144" cy="420.604" r="1.21"></circle>
				</g>
			</g>
		</g>
		<g>
			<g>
				<defs>
					<circle id="SVGID_00000110437041782674472800000012258817060060252820_" cx="17.186" cy="378.095" r="97.877"></circle>
				</defs>
				<clipPath id="SVGID_00000066500772058158010400000016509360776888446651_">
					<use xlink:href="#SVGID_00000110437041782674472800000012258817060060252820_" style="overflow:visible;"></use>
				</clipPath>
				<g style="clip-path:url(#SVGID_00000066500772058158010400000016509360776888446651_);">
					
						<rect x="112.842" y="426.372" transform="matrix(0.7071 -0.7071 0.7071 0.7071 -277.6681 226.9522)" class="st4" width="44.559" height="44.559"></rect>
					<circle class="st5" cx="159.665" cy="445.11" r="1.21"></circle>
					<path class="st5" d="M150.018,454.757c0.473,0.473,0.473,1.239,0,1.712s-1.239,0.473-1.712,0s-0.473-1.239,0-1.712       S149.545,454.284,150.018,454.757z"></path>
					<path class="st5" d="M139.515,465.26c0.473,0.473,0.473,1.239,0,1.712s-1.239,0.473-1.712,0s-0.473-1.239,0-1.712       C138.276,464.787,139.043,464.787,139.515,465.26z"></path>
					<circle class="st5" cx="145.661" cy="438.108" r="1.21"></circle>
					<circle class="st5" cx="135.159" cy="448.611" r="1.21"></circle>
					<path class="st5" d="M125.512,458.258c0.473,0.473,0.473,1.239,0,1.712s-1.239,0.473-1.712,0s-0.473-1.239,0-1.712       S125.039,457.785,125.512,458.258z"></path>
					<path class="st5" d="M132.514,430.251c0.473,0.473,0.473,1.239,0,1.712s-1.239,0.473-1.712,0s-0.473-1.239,0-1.712       C131.274,429.778,132.041,429.778,132.514,430.251z"></path>
					<path class="st5" d="M122.011,440.753c0.473,0.473,0.473,1.239,0,1.712s-1.239,0.473-1.712,0s-0.473-1.239,0-1.712       C120.772,440.281,121.538,440.281,122.011,440.753z"></path>
					<circle class="st5" cx="110.652" cy="452.112" r="1.21"></circle>
				</g>
			</g>
		</g>
		<g>
			<g>
				<defs>
					<circle id="SVGID_00000086683995782293492290000014530632339280906152_" cx="17.186" cy="378.095" r="97.877"></circle>
				</defs>
				<clipPath id="SVGID_00000102522942268746506640000013674259550510515864_">
					<use xlink:href="#SVGID_00000086683995782293492290000014530632339280906152_" style="overflow:visible;"></use>
				</clipPath>
				<g style="clip-path:url(#SVGID_00000102522942268746506640000013674259550510515864_);">
					
						<rect x="-44.695" y="331.847" transform="matrix(0.7071 -0.7071 0.7071 0.7071 -256.9706 87.8713)" class="st4" width="44.559" height="44.559"></rect>
					<path class="st5" d="M2.98,349.73c0.473,0.473,0.473,1.239,0,1.712s-1.239,0.473-1.712,0s-0.473-1.239,0-1.712       C1.741,349.257,2.507,349.257,2.98,349.73z"></path>
				</g>
			</g>
		</g>
		<g>
			<g>
				<defs>
					<circle id="SVGID_00000177464980587870061990000003767107282497113753_" cx="17.186" cy="378.095" r="97.877"></circle>
				</defs>
				<clipPath id="SVGID_00000127752315685184363950000009361723814225851306_">
					<use xlink:href="#SVGID_00000177464980587870061990000003767107282497113753_" style="overflow:visible;"></use>
				</clipPath>
				<g style="clip-path:url(#SVGID_00000127752315685184363950000009361723814225851306_);">
					
						<rect x="-13.187" y="363.355" transform="matrix(0.7071 -0.7071 0.7071 0.7071 -270.0217 119.3788)" class="st4" width="44.559" height="44.559"></rect>
					<path class="st5" d="M34.488,381.238c0.473,0.473,0.473,1.239,0,1.712s-1.239,0.473-1.712,0c-0.473-0.473-0.473-1.239,0-1.712       C33.249,380.765,34.015,380.765,34.488,381.238z"></path>
					<circle class="st5" cx="23.129" cy="392.597" r="1.21"></circle>
					<path class="st5" d="M13.483,402.243c0.473,0.473,0.473,1.239,0,1.712s-1.239,0.473-1.712,0s-0.473-1.239,0-1.712       C12.244,401.771,13.01,401.771,13.483,402.243z"></path>
					<path class="st5" d="M20.484,374.236c0.473,0.473,0.473,1.239,0,1.712s-1.239,0.473-1.712,0s-0.473-1.239,0-1.712       C19.245,373.763,20.012,373.763,20.484,374.236z"></path>
					<circle class="st5" cx="9.126" cy="385.595" r="1.21"></circle>
					<path class="st5" d="M6.481,367.234c0.473,0.473,0.473,1.239,0,1.712s-1.239,0.473-1.712,0s-0.473-1.239,0-1.712       C5.242,366.762,6.008,366.762,6.481,367.234z"></path>
				</g>
			</g>
		</g>
		<g>
			<g>
				<defs>
					<circle id="SVGID_00000005967977237469584150000004052176993011700648_" cx="17.186" cy="378.095" r="97.877"></circle>
				</defs>
				<clipPath id="SVGID_00000168801316549108080770000004400752692397791915_">
					<use xlink:href="#SVGID_00000005967977237469584150000004052176993011700648_" style="overflow:visible;"></use>
				</clipPath>
				<g style="clip-path:url(#SVGID_00000168801316549108080770000004400752692397791915_);">
					
						<rect x="18.319" y="394.863" transform="matrix(0.7071 -0.7071 0.7071 0.7071 -283.0734 150.8858)" class="st4" width="44.559" height="44.559"></rect>
					<circle class="st5" cx="65.14" cy="413.602" r="1.21"></circle>
					<circle class="st5" cx="54.638" cy="424.105" r="1.21"></circle>
					<path class="st5" d="M44.991,433.752c0.473,0.473,0.473,1.239,0,1.712s-1.239,0.473-1.712,0c-0.473-0.473-0.473-1.239,0-1.712       C43.752,433.279,44.518,433.279,44.991,433.752z"></path>
					<path class="st5" d="M51.993,405.744c0.473,0.473,0.473,1.239,0,1.712s-1.239,0.473-1.712,0c-0.473-0.473-0.473-1.239,0-1.712       C50.754,405.272,51.52,405.272,51.993,405.744z"></path>
					<path class="st5" d="M41.49,416.247c0.473,0.473,0.473,1.239,0,1.712s-1.239,0.473-1.712,0c-0.473-0.473-0.473-1.239,0-1.712       C40.251,415.774,41.017,415.774,41.49,416.247z"></path>
					<path class="st5" d="M30.987,426.75c0.473,0.473,0.473,1.239,0,1.712s-1.239,0.473-1.712,0s-0.473-1.239,0-1.712       S30.514,426.277,30.987,426.75z"></path>
					<path class="st5" d="M37.989,398.742c0.473,0.473,0.473,1.239,0,1.712s-1.239,0.473-1.712,0c-0.473-0.473-0.473-1.239,0-1.712       C36.75,398.27,37.516,398.27,37.989,398.742z"></path>
					<path class="st5" d="M27.486,409.245c0.473,0.473,0.473,1.239,0,1.712s-1.239,0.473-1.712,0s-0.473-1.239,0-1.712       S27.014,408.772,27.486,409.245z"></path>
					<path class="st5" d="M16.984,419.748c0.473,0.473,0.473,1.239,0,1.712s-1.239,0.473-1.712,0s-0.473-1.239,0-1.712       C15.744,419.275,16.511,419.275,16.984,419.748z"></path>
				</g>
			</g>
		</g>
		<g>
			<g>
				<defs>
					<circle id="SVGID_00000062185163559014102930000008363297190309539469_" cx="17.186" cy="378.095" r="97.877"></circle>
				</defs>
				<clipPath id="SVGID_00000129188936297859758910000009043173930670186914_">
					<use xlink:href="#SVGID_00000062185163559014102930000008363297190309539469_" style="overflow:visible;"></use>
				</clipPath>
				<g style="clip-path:url(#SVGID_00000129188936297859758910000009043173930670186914_);">
					
						<rect x="49.827" y="426.371" transform="matrix(0.7071 -0.7071 0.7071 0.7071 -296.1245 182.3932)" class="st4" width="44.559" height="44.559"></rect>
					<path class="st5" d="M97.504,444.254c0.473,0.473,0.473,1.239,0,1.712s-1.239,0.473-1.712,0s-0.473-1.239,0-1.712       C96.265,443.782,97.032,443.782,97.504,444.254z"></path>
					<path class="st5" d="M87.002,454.757c0.473,0.473,0.473,1.239,0,1.712s-1.239,0.473-1.712,0s-0.473-1.239,0-1.712       S86.529,454.284,87.002,454.757z"></path>
					<path class="st5" d="M76.499,465.26c0.473,0.473,0.473,1.239,0,1.712s-1.239,0.473-1.712,0s-0.473-1.239,0-1.712       C75.26,464.787,76.026,464.787,76.499,465.26z"></path>
					<path class="st5" d="M83.501,437.252c0.473,0.473,0.473,1.239,0,1.712s-1.239,0.473-1.712,0s-0.473-1.239,0-1.712       C82.262,436.78,83.028,436.78,83.501,437.252z"></path>
					<path class="st5" d="M72.998,447.755c0.473,0.473,0.473,1.239,0,1.712s-1.239,0.473-1.712,0s-0.473-1.239,0-1.712       C71.759,447.283,72.525,447.283,72.998,447.755z"></path>
					<circle class="st5" cx="61.639" cy="459.114" r="1.21"></circle>
					<circle class="st5" cx="68.641" cy="431.107" r="1.21"></circle>
					<path class="st5" d="M58.994,440.753c0.473,0.473,0.473,1.239,0,1.712s-1.239,0.473-1.712,0c-0.473-0.473-0.473-1.239,0-1.712       C57.755,440.281,58.522,440.281,58.994,440.753z"></path>
					<circle class="st5" cx="47.636" cy="452.112" r="1.21"></circle>
				</g>
			</g>
		</g>
		<g>
			<g>
				<defs>
					<circle id="SVGID_00000126298569418454465740000003675827946666406321_" cx="17.186" cy="378.095" r="97.877"></circle>
				</defs>
				<clipPath id="SVGID_00000145020444125034544910000005478456254333801613_">
					<use xlink:href="#SVGID_00000126298569418454465740000003675827946666406321_" style="overflow:visible;"></use>
				</clipPath>
				<g style="clip-path:url(#SVGID_00000145020444125034544910000005478456254333801613_);">
					
						<rect x="81.335" y="457.879" transform="matrix(0.7071 -0.7071 0.7071 0.7071 -309.1755 213.9012)" class="st4" width="44.559" height="44.559"></rect>
					
						<ellipse transform="matrix(0.1414 -0.9899 0.9899 0.1414 -361.7911 536.0901)" class="st5" cx="128.166" cy="476.621" rx="1.21" ry="1.21"></ellipse>
					<circle class="st5" cx="117.654" cy="487.121" r="1.21"></circle>
					<path class="st5" d="M115.009,468.761c0.473,0.473,0.473,1.239,0,1.712s-1.239,0.473-1.712,0s-0.473-1.239,0-1.712       C113.77,468.288,114.536,468.288,115.009,468.761z"></path>
					<circle class="st5" cx="103.65" cy="480.119" r="1.21"></circle>
					<circle class="st5" cx="93.148" cy="490.622" r="1.21"></circle>
					<path class="st5" d="M101.005,461.759c0.473,0.473,0.473,1.239,0,1.712s-1.239,0.473-1.712,0s-0.473-1.239,0-1.712       S100.533,461.286,101.005,461.759z"></path>
					<path class="st5" d="M90.503,472.262c0.473,0.473,0.473,1.239,0,1.712s-1.239,0.473-1.712,0s-0.473-1.239,0-1.712       S90.03,471.789,90.503,472.262z"></path>
					<path class="st5" d="M80,482.764c0.473,0.473,0.473,1.239,0,1.712s-1.239,0.473-1.712,0s-0.473-1.239,0-1.712       C78.761,482.292,79.527,482.292,80,482.764z"></path>
				</g>
			</g>
		</g>
		<g>
			<g>
				<defs>
					<circle id="SVGID_00000096757689463411461080000015217673692178411448_" cx="17.186" cy="378.095" r="97.877"></circle>
				</defs>
				<clipPath id="SVGID_00000064318519909719588090000016325437743405435044_">
					<use xlink:href="#SVGID_00000096757689463411461080000015217673692178411448_" style="overflow:visible;"></use>
				</clipPath>
				<g style="clip-path:url(#SVGID_00000064318519909719588090000016325437743405435044_);">
					
						<rect x="-44.696" y="394.862" transform="matrix(0.7071 -0.7071 0.7071 0.7071 -301.5295 106.3266)" class="st4" width="44.559" height="44.559"></rect>
					<path class="st5" d="M2.98,412.746c0.473,0.473,0.473,1.239,0,1.712s-1.239,0.473-1.712,0s-0.473-1.239,0-1.712       S2.507,412.273,2.98,412.746z"></path>
				</g>
			</g>
		</g>
		<g>
			<g>
				<defs>
					<circle id="SVGID_00000152976453500660155120000011050331139466889626_" cx="17.186" cy="378.095" r="97.877"></circle>
				</defs>
				<clipPath id="SVGID_00000147930373356245877390000015551892013030998425_">
					<use xlink:href="#SVGID_00000152976453500660155120000011050331139466889626_" style="overflow:visible;"></use>
				</clipPath>
				<g style="clip-path:url(#SVGID_00000147930373356245877390000015551892013030998425_);">
					
						<rect x="-13.189" y="426.37" transform="matrix(0.7071 -0.7071 0.7071 0.7071 -314.5805 137.8341)" class="st4" width="44.559" height="44.559"></rect>
					<path class="st5" d="M34.488,444.254c0.473,0.473,0.473,1.239,0,1.712s-1.239,0.473-1.712,0c-0.473-0.473-0.473-1.239,0-1.712       C33.249,443.782,34.015,443.782,34.488,444.254z"></path>
					<path class="st5" d="M23.985,454.757c0.473,0.473,0.473,1.239,0,1.712s-1.239,0.473-1.712,0s-0.473-1.239,0-1.712       S23.513,454.284,23.985,454.757z"></path>
					<circle class="st5" cx="12.627" cy="466.116" r="1.21"></circle>
					<path class="st5" d="M20.484,437.252c0.473,0.473,0.473,1.239,0,1.712s-1.239,0.473-1.712,0s-0.473-1.239,0-1.712       C19.245,436.78,20.012,436.78,20.484,437.252z"></path>
					<path class="st5" d="M9.982,447.755c0.473,0.473,0.473,1.239,0,1.712s-1.239,0.473-1.712,0c-0.473-0.473-0.473-1.239,0-1.712       C8.743,447.283,9.509,447.283,9.982,447.755z"></path>
					<path class="st5" d="M6.481,430.251c0.473,0.473,0.473,1.239,0,1.712s-1.239,0.473-1.712,0s-0.473-1.239,0-1.712       S6.008,429.778,6.481,430.251z"></path>
				</g>
			</g>
		</g>
		<g>
			<g>
				<defs>
					<circle id="SVGID_00000178187080202996510370000000393900698555729599_" cx="17.186" cy="378.095" r="97.877"></circle>
				</defs>
				<clipPath id="SVGID_00000033363098759279854500000006868609615243305116_">
					<use xlink:href="#SVGID_00000178187080202996510370000000393900698555729599_" style="overflow:visible;"></use>
				</clipPath>
				<g style="clip-path:url(#SVGID_00000033363098759279854500000006868609615243305116_);">
					
						<rect x="18.318" y="457.879" transform="matrix(0.7071 -0.7071 0.7071 0.7071 -327.6326 169.3418)" class="st4" width="44.559" height="44.559"></rect>
					<path class="st5" d="M65.996,475.763c0.473,0.473,0.473,1.239,0,1.712s-1.239,0.473-1.712,0s-0.473-1.239,0-1.712       S65.524,475.29,65.996,475.763z"></path>
					<path class="st5" d="M55.494,486.265c0.473,0.473,0.473,1.239,0,1.712s-1.239,0.473-1.712,0c-0.473-0.473-0.473-1.239,0-1.712       C54.254,485.793,55.021,485.793,55.494,486.265z"></path>
					<path class="st5" d="M51.993,468.761c0.473,0.473,0.473,1.239,0,1.712s-1.239,0.473-1.712,0c-0.473-0.473-0.473-1.239,0-1.712       C50.754,468.288,51.52,468.288,51.993,468.761z"></path>
					<path class="st5" d="M41.49,479.263c0.473,0.473,0.473,1.239,0,1.712s-1.239,0.473-1.712,0c-0.473-0.473-0.473-1.239,0-1.712       C40.251,478.791,41.017,478.791,41.49,479.263z"></path>
					<path class="st5" d="M30.987,489.766c0.473,0.473,0.473,1.239,0,1.712s-1.239,0.473-1.712,0s-0.473-1.239,0-1.712       S30.514,489.293,30.987,489.766z"></path>
					<circle class="st5" cx="37.133" cy="462.615" r="1.21"></circle>
					<circle class="st5" cx="26.63" cy="473.117" r="1.21"></circle>
					<path class="st5" d="M16.984,482.764c0.473,0.473,0.473,1.239,0,1.712s-1.239,0.473-1.712,0s-0.473-1.239,0-1.712       C15.744,482.292,16.511,482.292,16.984,482.764z"></path>
				</g>
			</g>
		</g>
		<g>
			<g>
				<defs>
					<circle id="SVGID_00000093881525041975226880000002664567021321908103_" cx="17.186" cy="378.095" r="97.877"></circle>
				</defs>
				<clipPath id="SVGID_00000161624094861932657860000011943115288646988714_">
					<use xlink:href="#SVGID_00000093881525041975226880000002664567021321908103_" style="overflow:visible;"></use>
				</clipPath>
				<g style="clip-path:url(#SVGID_00000161624094861932657860000011943115288646988714_);">
					
						<rect x="-44.697" y="457.877" transform="matrix(0.7071 -0.7071 0.7071 0.7071 -346.088 124.783)" class="st4" width="44.559" height="44.559"></rect>
					<circle class="st5" cx="2.124" cy="476.618" r="1.21"></circle>
				</g>
			</g>
		</g>
	</g>
	<g>
		<polygon class="st28" points="360.944,271.545 367.999,266.108 359.108,266.205 356.133,257.877 353.54,266.333 344.744,265.889     352.149,271.101 349.555,279.557 356.515,274.661 363.382,279.777   "></polygon>
		<polygon class="st28" points="334.118,297.996 341.078,293.1 332.282,292.656 329.845,284.423 327.251,292.879 318.361,292.976     325.227,298.093 322.634,306.549 329.689,301.112 337.093,306.324   "></polygon>
		<polygon class="st28" points="324.346,334.713 331.401,329.276 322.511,329.373 320.073,321.14 317.48,329.596 308.589,329.692     315.456,334.809 312.863,343.265 319.917,337.829 327.322,343.041   "></polygon>
		<polygon class="st28" points="334.065,370.982 341.025,366.085 332.134,366.182 329.791,357.409 327.198,365.865 318.308,365.961     325.174,371.078 322.581,379.534 329.541,374.638 336.945,379.85   "></polygon>
		<polygon class="st28" points="360.392,397.934 367.352,393.038 358.556,392.594 356.119,384.361 352.988,392.722 344.097,392.819     351.502,398.031 348.908,406.487 355.963,401.05 362.829,406.167   "></polygon>
	</g>
</g>
</svg>
