<?xml version="1.0" encoding="UTF-8"?>
<svg id="Ebene_1" data-name="Ebene 1" xmlns="http://www.w3.org/2000/svg" viewBox="0 0 250 250">
  <defs>
    <style>
      .cls-1 {
        fill: #033a4f;
      }

      .cls-2 {
        stroke: #033a4f;
      }

      .cls-2, .cls-3 {
        fill: none;
        stroke-miterlimit: 10;
        stroke-width: 2px;
      }

      .cls-3 {
        stroke: #55c3d2;
      }
    </style>
  </defs>
  <g>
    <g>
      <g>
        <line class="cls-3" x1="128.173" y1="144.342" x2="154.565" y2="144.342"/>
        <line class="cls-3" x1="94.921" y1="144.342" x2="118.801" y2="144.342"/>
        <circle class="cls-3" cx="123.7" cy="144.342" r="4.639"/>
      </g>
      <g>
        <line class="cls-3" x1="147.164" y1="122.757" x2="154.565" y2="122.757"/>
        <line class="cls-3" x1="94.921" y1="122.757" x2="137.791" y2="122.757"/>
        <circle class="cls-3" cx="142.691" cy="122.757" r="4.639"/>
      </g>
      <g>
        <line class="cls-3" x1="111.714" y1="101.171" x2="154.565" y2="101.171"/>
        <line class="cls-3" x1="94.921" y1="101.171" x2="102.342" y2="101.171"/>
        <circle class="cls-3" cx="107.241" cy="101.171" r="4.639"/>
      </g>
    </g>
    <rect class="cls-3" x="74.619" y="72.633" width="100.247" height="100.247" rx="16.645" ry="16.645"/>
  </g>
  <g>
    <path class="cls-2" d="m88.215,40.244c11.363-4.981,23.919-7.746,37.12-7.746,51.108,0,92.54,41.432,92.54,92.54s-41.432,92.54-92.54,92.54-92.54-41.432-92.54-92.54c0-27.733,12.199-52.616,31.524-69.577"/>
    <polygon class="cls-1" points="64.994 66.023 62.999 65.862 63.799 56.034 53.937 55.953 53.955 53.952 65.966 54.052 64.994 66.023"/>
  </g>
</svg>