# Exported from ProBuilder
# http://www.procore3d.com/probuilder
# 2/9/2019 4:30:10 PM

mtllib ./UnderFloorCube.mtl
o UnderFloorCube

g Cube (15)
v 12 -6 67.75
v 7 -6 67.75
v 12 -3 67.75
v 7 -3 67.75
v 7 -6 67.75
v 7 -6 52
v 7 -3 67.75
v 7 -3 52
v 7 -6 52
v 12 -6 52
v 7 -3 52
v 12 -3 52
v 12 -6 52
v 12 -6 67.75
v 12 -3 52
v 12 -3 67.75
v 12 -3 67.75
v 7 -3 67.75
v 12 -3 52
v 7 -3 52
v 12 -6 52
v 7 -6 52
v 12 -6 67.75
v 7 -6 67.75

vn 0 0 1
vn 0 0 1
vn 0 0 1
vn 0 0 1
vn -0.9999999 0 0
vn -0.9999999 0 0
vn -0.9999999 0 0
vn -0.9999999 0 0
vn 0 0 -1
vn 0 0 -1
vn 0 0 -1
vn 0 0 -1
vn 0.9999999 0 0
vn 0.9999999 0 0
vn 0.9999999 0 0
vn 0.9999999 0 0
vn 0 1 0
vn 0 1 0
vn 0 1 0
vn 0 1 0
vn 0 -1 0
vn 0 -1 0
vn 0 -1 0
vn 0 -1 0

vt -4 -7
vt -9 -7
vt -4 -4
vt -9 -4
vt 12.75 -7
vt -3 -7
vt 12.75 -4
vt -3 -4
vt 9 -7
vt 4 -7
vt 9 -4
vt 4 -4
vt 3 -7
vt -12.75 -7
vt 3 -4
vt -12.75 -4
vt 4 12.75
vt 9 12.75
vt 4 -3
vt 9 -3
vt -4 -3
vt -9 -3
vt -4 12.75
vt -9 12.75

g Cube (15)
usemtl M06_WallBlack
f 3/3/3 4/4/4 2/2/2 1/1/1
f 7/7/7 8/8/8 6/6/6 5/5/5
f 11/11/11 12/12/12 10/10/10 9/9/9
f 15/15/15 16/16/16 14/14/14 13/13/13
f 19/19/19 20/20/20 18/18/18 17/17/17
f 23/23/23 24/24/24 22/22/22 21/21/21

