<?xml version="1.0" encoding="UTF-8"?>
<!-- Generator: Adobe Illustrator 15.0.2, SVG Export Plug-In . SVG Version: 6.00 Build 0)  -->
<svg version="1.2" baseProfile="tiny" id="Ebene_1" xmlns="http://www.w3.org/2000/svg" xmlns:xlink="http://www.w3.org/1999/xlink" x="0px" y="0px" width="100px" height="100px" viewBox="0 0 100 100" xml:space="preserve">
<image width="101" height="101" xlink:href="data:image/png;base64,iVBORw0KGgoAAAANSUhEUgAAAGUAAABlCAYAAABUfC3PAAAACXBIWXMAAAsSAAALEgHS3X78AAAA GXRFWHRTb2Z0d2FyZQBBZG9iZSBJbWFnZVJlYWR5ccllPAAACPRJREFUeNrsnY2SpDYMhGXDe+fF Fzt1qZ0U0VlSt23A5NZV1LJ/M0YfLcliEElE/pKfsdTYXzz3auz/GsnY/4Ey0fjnTRpfrZEaX8/b DxQSQlHGt8AIAUYD+fU1rwZpXxSE3vdUUgmVtOBkY/+PhVIMEC0gV7gvDUMDyn8SlKI2FEgdVEoi wGS1/W+hFGOzoJQABqIUD04moNwG5y4ov4x3AFCimOIBqUYKnAK1tFyWB2W7OubsN8D4GJuBUm52 X5mAUtXfvQpKMYAcBJSiQJTBQJ8VoExA2U5z2RScV0D5GP/ogMK4MGZFj7ouC0pt7G8K9pJQqgLh wTgmQRlxXwiUs0KyUon+eVoNSj2B0AqJFFOdbOwMSEAwFhBRIKxsKxkK2ZT7ktP3MgvMfqG7OgI3 doYTQSlO9oUoJRmxxIOiFZKVQjYF5Bxv8tNQilJIBOQgoRQiLY7WKehiMSkYLZVoIJt67/wUFAsI oppoQ1NjJNCjqbAV2BF1tEa+G0oE5HBiTAHgeGoZDfTo6l0Heh3gN8BO+S4o1TH+F+DSCqiYnrSY TYdzsNWG+xKjmhC50MugIEC+OuML68KYQN8DZQvc1mfbv4/ZmgeVlfVAaRnaA8KkyRGUAmZgVuaV CSgtIJ7baoFJ38dH2XrviCOea/oiY8tBQClkBpYG40l1lOLZ82gASd/zz7OhlMCw7MaUX6LYEvlz BooV2JGgbsWzo1F/G4ZSGwBQMF/O30VurFXSr0BhslWITGCJPgrsFYxjR0Mt0Ic2dtJtlcCFWUCQ NUwLTFTSZwN9VA3ejFV7BdNgLw3/HEeKVLd3qKQ4wb5c4MYstYy4rwjIRkIQQxWHse9ei0GgeGfz AQR/ZB3juTEESgVUEkHx3FY1gBzGe5YTBGt/74VSAtfFBv9W2sy4MSQtjtLhHrdlpbtixJCWOs7u q3jZGAPlMIqJ3voDXcdEabJ3NbIaSkngVcYclOOtdUhygLRgtH5GQykd2zG4jmm5xHr66lWNo3hy zsC279dh01+9DmnFD62G4vysCWYfdF0FvPTbG/g1lEIEeXGyr6rK8+jisKWO0qGQLihlklIQIF/A BbGDBGGtK4qC4dW1vMDuZVeoQkwwI1AO50oimgR8gW6sB4YHyLqa6KmlpZLkKCFSCAWlkhuroEK4 sSLXDB2nGBCHk01pQzN2TAiUMrgdneuY42Swq0cJEgUrqLNKiC5PhFBaH/MpE+IMU6a5A4hWjaeS YgTvGTB+c2G747qsQuCoaiKV3AnEA5OI+MGCsOybPCjIC/SA8rKrp4C0wESlEhZAdKK7UKJ/aoEY UdEZ0pNAWsXX1AnEs1F00ufIfVXwTYrEHwVC0ulVRgGCOXKsyEncrEzkRiWUTYcRpVgTXg1IlOyw x8rY8l8G++D6BHVxesLHInEkii/n8kwl4kYvmH/iSiagCPFmUdbG1q+eAhPNv5C2gOycjRpRBEJI IN7frQylDB4jakOxoERgxHmznpLMykA0mNLpikSwG2nDQG/tVweedLq5N0Bh3ZI4F+AqYusMGLYO /F6AM+ctUNizvttumVQH8ntGwvISMIjrnmbDHEyiB0j0v/WFUCphj1Ewv7kv5qwR43+pCbxQLQIc x8hx10xMaMbfvREIA2GKrbL8jOUGAgW92SVNfK0VRwJ+N8VWufPFvB6NKdhPLwaSSEhdwHLHBBLw M+9/08vAtObMHjt1ouYOwyMTaPVqTC9Vi3cM3nF12zAbbxwZF/29AIDepJIUHOMUu0VK8YgiE8vi Nxd4ExTvs8mITWD1ZGMSPWc9sulWG2+AoufMbKy6mjEFPesFPIM8tawOBpk74hGEUFeyoLAvjk7a OuPe4Lqs+WfSFpCddwIK2mTZOhB9f8jK11Y+c/xsyMmF2iWEkoGUlgGTAxjW9ytWOpB5R8faE39+ +9wX086PlbDVQOD8SZGVgOSTUhCFePZAoUkLSgaDWCbPnqiBwCpuLBkwNuLYopPYi7niKYVRAwPD aiP7uT/kyc+BpQDGRh4royJXKYwMR2HoO3LlQTA6sJ/hWPs9W2TfJhQZdEseEKunbwvAnWAsIB6A bYJdzGRnd/LzWTB0/BDx71f/jDs+Z6wDuqWSzXBtM+FAUHpKJ1ZjTK/DnHX2nm8/qBcF9BwA0IAY lfSUZEwo0qkENH5swAq6dTvbjOzsvHi1oHz298E4wyhJZkGpErf4q4bbspShVXLIfxsSzGpusCk4 jFo8OL0uDIIipEK8VBdxV5bb0t0hZrYBiRSDurMcqCZSjMyAUgXrJtcK6ntgwCLtGz6zXNswZwNU swNJwbBKIijSqRBPHV/G2ugw4sqdraWyEy8+QHYwCUAVI6NQamcw12fxB4x1G7S+6fOuJmyeUrIT +LcgYaBcFwJFxH9+yBYsBq1s6wjiyFPtCvNA4EdLNJtM6CGZiFIJ0uZPG+wgVHJHY0/PjY1mZxty xRXtttp6/JEVzNGzFrlX/YkWuFHAj9YxSJlGZkBJRqmEXaEL4baebBbdkyZHMQZSCQPlfJWSCeo9 6e8qbdWRNJl1a9PbqusCXiuo7wCQQ/DmM08/gCATYHYg+5IroIj4jzz6CoqcVlfSlR/VEaW73joG yrZmQEnGxSlrHeLVtaImNCs81AZRSrSOufyhNmcw1jjAutZbHv80Evjpz7aNPJMLveGICewrPSgt CvzoAlPuhOKB8dxWqytplvUeKbiRZZgpQGZAaYHx+ve24kiSdR++6cWXaF+ehKJXzJ46rM7WKz+m diPT5GUeU6uDv6eWVj/f1R/ojNbHlnug8+fA95PRvQaZs6AggX4ECpKFLf3ocx1nWm7LK6dEj+Uo oEq8wiRyNRKFcskH1K+C0vLdSI2LSYVnuK9EQGkBueT+miuhiMpikHIK47qsnjCJSIstFxZBufRm p6uhtGINs3qPVvLsOkUkvsEngnL5uAuKrjL3XDe50n0hUG4bd0Ox4FQCzEigR4E8epfZU1A0HLSn rwwqRQS/R/Gx8TQUaaSo3gWtnpaHUaeHJUCsCMUCJBe7ryXHLusPy4Dsiv41428BBgA7eRUddAAy OwAAAABJRU5ErkJggg==" transform="matrix(1 0 0 1 -0.5 -0.5)">
</image>
</svg>