{
	"testCaseName": "DV15963_GGPM_DTVR_PauseTimeout_Event7.xml",
	"baselineGeneratedDate": "2020-03-11T15:59:21.618Z",
	"testUrl": "http://engtestsite.com/bsdk/testsuite/testharness/single/index_eugenia.html?env=qat4&file=DV15963_GGPM_DTVR_PauseTimeout_Event7.xml&cdn=cdn-gl&nsdkv=600&configEnv=static-staging2&ggcmbVersion=bundled600",
	"results": [
		{
			"_baseurl": "https://secure-qat4.imrworldwide.com/cgi-bin/gn",
			"_sentAt": "2020-03-11T15:57:15.734Z",
			"prd": "session",
			"c9": "devid,",
			"c13": "asid,DHG163HR-BH45-JKY6-BKH7-67GJKY68GJK7",
			"sessionId": "SCKgCslQEOc65GEBdKbsThypQHLgz1583942235",
			"c16": "sdkv,bj.6.0.0",
			"uoo": "",
			"retry": "0"
		},
		{
			"_baseurl": "https://secure-qat4.imrworldwide.com/cgi-bin/tsv",
			"_sentAt": "2020-03-11T15:57:17.903Z",
			"id3": "www.nielsen.com/68wuuay-eFqaYBZ-mzPTjQ",
			"fmt": "json",
			"pli": "15839422353539572",
			"segment1": "",
			"segment2": "",
			"tsvevt": "tsvupdate",
			"nmspc": "NOLBUNDLE"
		},
		{
			"_baseurl": "https://secure-qat4.imrworldwide.com/cgi-bin/d",
			"_sentAt": "2020-03-11T15:57:17.994Z",
			"ci": "us-506843",
			"sessionId": "SCKgCslQEOc65GEBdKbsThypQHLgz1583942235",
			"c29": "plid,15839422353539572",
			"c30": "bldv,6.0.0.474",
			"davty": "0",
			"forward": "0",
			"c6": "mtvr,b01",
			"ca": "PC_68wuuay-eFqaYBZ-mzPTjQ",
			"pc": "DHG163HR-BH45-JKY6-BKH7-67GJKY68GJK7",
			"cr": "2_00_99_I264_00000_0",
			"segment1": "",
			"segment2": "",
			"c9": "devid,",
			"c8": "devgrp,",
			"c7": "osgrp,",
			"c1": "nuid,uXFno6jNf5XErpbFZiPNPGsichqoh1583942235",
			"c10": "plt,",
			"plugv": "",
			"playerv": "",
			"c11": "agg,0",
			"c12": "apv,",
			"c13": "asid,DHG163HR-BH45-JKY6-BKH7-67GJKY68GJK7",
			"c15": "apn,",
			"c16": "sdkv,bj.6.0.0",
			"c14": "osver,NA",
			"h33": "2",
			"c26": "dmap,3",
			"c27": "cln,0",
			"at": "start",
			"rt": "video",
			"st": "mtvr",
			"vn": "1",
			"c24": "zip,99",
			"dd": "",
			"hrd": "",
			"wkd": "",
			"uoo": "",
			"c68": "bndlid,",
			"c61": "createtm,1583942236",
			"nodeTM": "",
			"logTM": "",
			"c73": "phtype,",
			"c74": "dvcnm,",
			"c62": "sendTime,1583942236",
			"rnd": "691522"
		},
		{
			"_baseurl": "https://secure-qat4.imrworldwide.com/cgi-bin/d",
			"_sentAt": "2020-03-11T15:57:21.841Z",
			"ci": "us-506843",
			"sessionId": "SCKgCslQEOc65GEBdKbsThypQHLgz1583942235",
			"c29": "plid,15839422353539572",
			"c30": "bldv,6.0.0.474",
			"davty": "0",
			"forward": "1",
			"c6": "mtvr,b01",
			"ca": "FD_mI8OMaaM3ASJy4smaf9V7w",
			"pc": "DHG163HR-BH45-JKY6-BKH7-67GJKY68GJK7",
			"cr": "2_00_90_I265_00000_0",
			"segment1": "",
			"segment2": "",
			"c9": "devid,",
			"c8": "devgrp,",
			"c7": "osgrp,",
			"c1": "nuid,uXFno6jNf5XErpbFZiPNPGsichqoh1583942235",
			"c10": "plt,",
			"plugv": "",
			"playerv": "",
			"c11": "agg,1",
			"c12": "apv,",
			"c13": "asid,DHG163HR-BH45-JKY6-BKH7-67GJKY68GJK7",
			"c15": "apn,",
			"c16": "sdkv,bj.6.0.0",
			"c14": "osver,NA",
			"h33": "2",
			"c26": "dmap,3",
			"c27": "cln,0",
			"at": "start",
			"rt": "video",
			"st": "mtvr",
			"vn": "1",
			"c24": "zip,99",
			"dd": "",
			"hrd": "",
			"wkd": "",
			"uoo": "",
			"c68": "bndlid,",
			"c61": "createtm,1583942240",
			"nodeTM": "",
			"logTM": "",
			"c73": "phtype,",
			"c74": "dvcnm,",
			"c62": "sendTime,1583942240",
			"rnd": "89781"
		},
		{
			"_baseurl": "https://secure-qat4.imrworldwide.com/cgi-bin/gn",
			"_sentAt": "2020-03-11T15:57:23.806Z",
			"prd": "session",
			"c9": "devid,",
			"c13": "asid,DHG163HR-BH45-JKY6-BKH7-67GJKY68GJK7",
			"sessionId": "SCKgCslQEOc65GEBdKbsThypQHLgz1583942235",
			"c16": "sdkv,bj.6.0.0",
			"uoo": "",
			"retry": "1"
		},
		{
			"_baseurl": "https://secure-qat4.imrworldwide.com/cgi-bin/gn",
			"_sentAt": "2020-03-11T15:57:27.717Z",
			"prd": "session",
			"c9": "devid,",
			"c13": "asid,DHG163HR-BH45-JKY6-BKH7-67GJKY68GJK7",
			"sessionId": "SCKgCslQEOc65GEBdKbsThypQHLgz1583942235",
			"c16": "sdkv,bj.6.0.0",
			"uoo": "",
			"retry": "2"
		},
		{
			"_baseurl": "https://secure-qat4.imrworldwide.com/cgi-bin/gn",
			"_sentAt": "2020-03-11T15:57:30.663Z",
			"prd": "session",
			"c9": "devid,",
			"c13": "asid,DHG163HR-BH45-JKY6-BKH7-67GJKY68GJK7",
			"sessionId": "SCKgCslQEOc65GEBdKbsThypQHLgz1583942235",
			"c16": "sdkv,bj.6.0.0",
			"uoo": "",
			"retry": "3"
		},
		{
			"_baseurl": "https://secure-qat4.imrworldwide.com/cgi-bin/trans",
			"_sentAt": "2020-03-11T15:57:47.399Z",
			"ci": "us-506843",
			"sessionId": "SCKgCslQEOc65GEBdKbsThypQHLgz1583942235",
			"forward": "1",
			"pc": "DHG163HR-BH45-JKY6-BKH7-67GJKY68GJK7",
			"c6": "id3,b01",
			"segment1": "",
			"segment2": "",
			"c9": "devid,",
			"c8": "devgrp,",
			"c7": "osgrp,",
			"c1": "nuid,uXFno6jNf5XErpbFZiPNPGsichqoh1583942235",
			"c10": "plt,",
			"c14": "osver,NA",
			"tp": "0:S:99:1583942237,www.nielsen.com/68wuuay-eFqaYBZ-mzPTjQ",
			"channame": "defaultChannelName",
			"h33": "2",
			"c26": "dmap,3",
			"uoo": "",
			"c68": "bndlid,",
			"c61": "createtm,1583942266",
			"plugv": "",
			"playerv": "",
			"nodeTM": "",
			"logTM": "",
			"c73": "phtype,",
			"c74": "dvcnm,",
			"c62": "sendTime,1583942266",
			"rnd": "478894"
		},
		{
			"_baseurl": "https://secure-qat4.imrworldwide.com/cgi-bin/tsv",
			"_sentAt": "2020-03-11T15:58:46.386Z",
			"id3": "www.nielsen.com/68wuuay-eFqaYBZ-mzPTjQ",
			"fmt": "json",
			"pli": "15839422353539572",
			"segment1": "",
			"segment2": "",
			"tsvevt": "tsvupdate",
			"nmspc": "NOLBUNDLE"
		},
		{
			"_baseurl": "https://secure-qat4.imrworldwide.com/cgi-bin/d",
			"_sentAt": "2020-03-11T15:58:46.446Z",
			"ci": "us-506843",
			"sessionId": "SCKgCslQEOc65GEBdKbsThypQHLgz1583942235",
			"c29": "plid,15839422353539572",
			"c30": "bldv,6.0.0.474",
			"davty": "1",
			"forward": "1",
			"c6": "mtvr,b01",
			"ca": "FD_mI8OMaaM3ASJy4smaf9V7w",
			"pc": "DHG163HR-BH45-JKY6-BKH7-67GJKY68GJK7",
			"cr": "2_00_90_V265_00000_0",
			"segment1": "",
			"segment2": "",
			"c9": "devid,",
			"c8": "devgrp,",
			"c7": "osgrp,",
			"c1": "nuid,uXFno6jNf5XErpbFZiPNPGsichqoh1583942235",
			"c10": "plt,",
			"plugv": "",
			"playerv": "",
			"c11": "agg,1",
			"c12": "apv,",
			"c13": "asid,DHG163HR-BH45-JKY6-BKH7-67GJKY68GJK7",
			"c15": "apn,",
			"c16": "sdkv,bj.6.0.0",
			"c14": "osver,NA",
			"h33": "2",
			"c26": "dmap,3",
			"c27": "cln,47",
			"at": "view",
			"rt": "video",
			"st": "mtvr",
			"vn": "1",
			"c24": "zip,99",
			"dd": "",
			"hrd": "",
			"wkd": "",
			"uoo": "",
			"c68": "bndlid,",
			"c61": "createtm,1583942325",
			"nodeTM": "",
			"logTM": "",
			"c73": "phtype,",
			"c74": "dvcnm,",
			"c62": "sendTime,1583942325",
			"rnd": "517814"
		},
		{
			"_baseurl": "https://secure-qat4.imrworldwide.com/cgi-bin/d",
			"_sentAt": "2020-03-11T15:58:47.881Z",
			"ci": "us-506843",
			"sessionId": "SCKgCslQEOc65GEBdKbsThypQHLgz1583942235",
			"c29": "plid,15839422353539572",
			"c30": "bldv,6.0.0.474",
			"davty": "1",
			"forward": "1",
			"c6": "mtvr,b01",
			"ca": "FD_mI8OMaaM3ASJy4smaf9V7w",
			"pc": "DHG163HR-BH45-JKY6-BKH7-67GJKY68GJK7",
			"cr": "2_00_90_D265_00001_0",
			"segment1": "",
			"segment2": "",
			"c9": "devid,",
			"c8": "devgrp,",
			"c7": "osgrp,",
			"c1": "nuid,uXFno6jNf5XErpbFZiPNPGsichqoh1583942235",
			"c10": "plt,",
			"plugv": "",
			"playerv": "",
			"c11": "agg,1",
			"c12": "apv,",
			"c13": "asid,DHG163HR-BH45-JKY6-BKH7-67GJKY68GJK7",
			"c15": "apn,",
			"c16": "sdkv,bj.6.0.0",
			"c14": "osver,NA",
			"h33": "2",
			"c26": "dmap,3",
			"c27": "cln,47",
			"at": "timer",
			"rt": "video",
			"st": "mtvr",
			"vn": "1",
			"c24": "zip,99",
			"dd": "",
			"hrd": "",
			"wkd": "",
			"uoo": "",
			"c68": "bndlid,",
			"c61": "createtm,1583942326",
			"nodeTM": "",
			"logTM": "",
			"c73": "phtype,",
			"c74": "dvcnm,",
			"c62": "sendTime,1583942326",
			"rnd": "145613"
		},
		{
			"_baseurl": "https://secure-qat4.imrworldwide.com/cgi-bin/d",
			"_sentAt": "2020-03-11T15:59:00.403Z",
			"ci": "us-506843",
			"sessionId": "SCKgCslQEOc65GEBdKbsThypQHLgz1583942235",
			"c29": "plid,15839422353539572",
			"c30": "bldv,6.0.0.474",
			"davty": "2",
			"forward": "1",
			"c6": "mtvr,b01",
			"ca": "FD_mI8OMaaM3ASJy4smaf9V7w",
			"pc": "DHG163HR-BH45-JKY6-BKH7-67GJKY68GJK7",
			"cr": "2_00_90_D265_00000_0",
			"segment1": "",
			"segment2": "",
			"c9": "devid,",
			"c8": "devgrp,",
			"c7": "osgrp,",
			"c1": "nuid,uXFno6jNf5XErpbFZiPNPGsichqoh1583942235",
			"c10": "plt,",
			"plugv": "",
			"playerv": "",
			"c11": "agg,1",
			"c12": "apv,",
			"c13": "asid,DHG163HR-BH45-JKY6-BKH7-67GJKY68GJK7",
			"c15": "apn,",
			"c16": "sdkv,bj.6.0.0",
			"c14": "osver,NA",
			"h33": "2",
			"c26": "dmap,3",
			"c27": "cln,13",
			"at": "timer",
			"rt": "video",
			"st": "mtvr",
			"vn": "1",
			"c24": "zip,99",
			"dd": "",
			"hrd": "",
			"wkd": "",
			"uoo": "",
			"c68": "bndlid,",
			"c61": "createtm,1583942339",
			"nodeTM": "",
			"logTM": "",
			"c73": "phtype,",
			"c74": "dvcnm,",
			"c62": "sendTime,1583942339",
			"rnd": "937125"
		},
		{
			"_baseurl": "https://secure-qat4.imrworldwide.com/cgi-bin/trans",
			"_sentAt": "2020-03-11T15:59:00.406Z",
			"ci": "us-506843",
			"sessionId": "SCKgCslQEOc65GEBdKbsThypQHLgz1583942235",
			"forward": "1",
			"pc": "DHG163HR-BH45-JKY6-BKH7-67GJKY68GJK7",
			"c6": "id3,b01",
			"segment1": "",
			"segment2": "",
			"c9": "devid,",
			"c8": "devgrp,",
			"c7": "osgrp,",
			"c1": "nuid,uXFno6jNf5XErpbFZiPNPGsichqoh1583942235",
			"c10": "plt,",
			"c14": "osver,NA",
			"tp": "1:S:90:1583942315,www.nielsen.com/68wuuay-eFqaYBZ-mzPTjQ",
			"channame": "defaultChannelName",
			"h33": "2",
			"c26": "dmap,3",
			"uoo": "",
			"c68": "bndlid,",
			"c61": "createtm,1583942339",
			"plugv": "",
			"playerv": "",
			"nodeTM": "",
			"logTM": "",
			"c73": "phtype,",
			"c74": "dvcnm,",
			"c62": "sendTime,1583942339",
			"rnd": "261147"
		},
		{
			"_baseurl": "https://secure-qat4.imrworldwide.com/cgi-bin/trans",
			"_sentAt": "2020-03-11T15:59:00.779Z",
			"ci": "us-506843",
			"sessionId": "SCKgCslQEOc65GEBdKbsThypQHLgz1583942235",
			"forward": "1",
			"pc": "DHG163HR-BH45-JKY6-BKH7-67GJKY68GJK7",
			"c6": "id3,b01",
			"segment1": "",
			"segment2": "",
			"c9": "devid,",
			"c8": "devgrp,",
			"c7": "osgrp,",
			"c1": "nuid,uXFno6jNf5XErpbFZiPNPGsichqoh1583942235",
			"c10": "plt,",
			"c14": "osver,NA",
			"tp": "false",
			"channame": "defaultChannelName",
			"h33": "2",
			"c26": "dmap,3",
			"uoo": "",
			"c68": "bndlid,",
			"c61": "createtm,1583942339",
			"plugv": "",
			"playerv": "",
			"nodeTM": "",
			"logTM": "",
			"c73": "phtype,",
			"c74": "dvcnm,",
			"c62": "sendTime,1583942339",
			"rnd": "709869"
		}
	]
}