{
	"testCaseName": "PauseTimeout_GGPM_DCRVideo_PrerollContentNOPauseTimeout.xml",
	"baselineGeneratedDate": "2020-04-02T19:26:38.548Z",
	"testUrl": "http://engtestsite.com/bsdk/testsuite/testharness/single/index_eugenia.html?env=qat4&file=PauseTimeout_GGPM_DCRVideo_PrerollContentNOPauseTimeout.xml&cdn=static-staging1&nsdkv=600_rc&configEnv=static-staging2&ggcmbVersion=bundled600",
	"results": [
		{
			"_baseurl": "https://secure-qat4.imrworldwide.com/cgi-bin/gn",
			"_sentAt": "2020-04-02T19:25:07.601Z",
			"prd": "session",
			"c9": "devid,",
			"c13": "asid,DHG163HR-BH45-JKY6-BKH7-67GJKY68GJK7",
			"sessionId": "xhCjksnvpvqEeJIiywD2UK1tPjQUN1585855507",
			"c16": "sdkv,bj.6.0.0",
			"uoo": "",
			"retry": "0"
		},
		{
			"_baseurl": "https://secure-qat4.imrworldwide.com/cgi-bin/gn",
			"_sentAt": "2020-04-02T19:25:20.868Z",
			"prd": "dcr",
			"ci": "us-506843",
			"ch": "us-506843_b01_P",
			"asn": "ProgramAsset8",
			"sessionId": "xhCjksnvpvqEeJIiywD2UK1tPjQUN1585855507",
			"tl": "",
			"prv": "1",
			"c6": "vc,b01",
			"ca": "us-506843_b01_preroll123",
			"cg": "latacg",
			"c13": "asid,DHG163HR-BH45-JKY6-BKH7-67GJKY68GJK7",
			"c32": "segA,S07E04%3ANBC",
			"c33": "segB,teams",
			"c34": "segC,AtlanataFalcons",
			"c15": "apn,",
			"plugv": "",
			"playerv": "",
			"sup": "0",
			"segment2": "",
			"segment1": "",
			"forward": "1",
			"ad": "0",
			"cr": "4_00_99_D1_00000",
			"c9": "devid,",
			"enc": "true",
			"c1": "nuid,H1BhTZGZvGCcPNuIJOyhKvkSU5U1S1585855507",
			"at": "timer",
			"rt": "video",
			"c16": "sdkv,bj.6.0.0",
			"c27": "cln,10",
			"crs": "",
			"lat": "",
			"lon": "",
			"c29": "plid,15858555071299378",
			"c30": "bldv,6.0.0.494",
			"st": "dcr",
			"c7": "osgrp,",
			"c8": "devgrp,",
			"c10": "plt,",
			"c40": "adbid,",
			"c14": "osver,NA",
			"c26": "dmap,1",
			"dd": "",
			"hrd": "",
			"wkd": "",
			"c35": "adrsid,",
			"c36": "cref1,",
			"c37": "cref2,",
			"c11": "agg,1",
			"c12": "apv,",
			"c51": "adl,10",
			"c52": "noad,1",
			"sd": "20",
			"devtypid": "",
			"pc": "NA",
			"c53": "fef,n",
			"c54": "oad,",
			"c55": "cref3,",
			"c57": "adldf,2",
			"ai": "preroll123",
			"c3": "st,a",
			"c64": "starttm,1585855510",
			"adid": "preroll123",
			"c58": "isLive,false",
			"c59": "sesid,gFXySQwP6oUZ2yAmG8j9R8DEBWcLx1585855509",
			"c61": "createtm,1585855519",
			"c63": "pipMode,",
			"c60": "agfall,~~~~~~~~~~~~~~~~~~~~p10,~~~~~~~~~~~~~~preroll~~~~",
			"c17": "stnid,defaultStationId",
			"c19": "stntype,",
			"c68": "bndlid,",
			"c69": "cvw,0",
			"nodeTM": "",
			"logTM": "",
			"c73": "phtype,",
			"c74": "dvcnm,",
			"c76": "adbsnid,",
			"uoo": "",
			"c44": "progen,",
			"davty": "1",
			"si": "http%3A%2F%2Fengtestsite.com%2Fbsdk%2Ftestsuite%2Ftestharness%2Fsingle%2Findex_eugenia.html%3Fenv%3Dqat4%26file%3DPauseTimeout_GGPM_DCRVideo_PrerollContentNOPauseTimeout.xml%26cdn%3Dstatic-staging1%26nsdkv%3D600_rc%26configEnv%3Dstatic-staging2%26ggcmbVersion%3Dbundled600",
			"c66": "mediaurl,",
			"c62": "sendTime,1585855519",
			"rnd": "992063"
		},
		{
			"_baseurl": "https://secure-qat4.imrworldwide.com/cgi-bin/gn",
			"_sentAt": "2020-04-02T19:25:21.908Z",
			"prd": "dcr",
			"ci": "us-506843",
			"ch": "us-506843_b01_P",
			"asn": "ProgramAsset8",
			"sessionId": "xhCjksnvpvqEeJIiywD2UK1tPjQUN1585855507",
			"tl": "Skydiving%20Across%20Europe",
			"prv": "1",
			"c6": "vc,b01",
			"ca": "us-506843_b01_204558915992",
			"cg": "latacg",
			"c13": "asid,DHG163HR-BH45-JKY6-BKH7-67GJKY68GJK7",
			"c32": "segA,S07E04%3ANBC",
			"c33": "segB,teams",
			"c34": "segC,AtlanataFalcons",
			"c15": "apn,",
			"plugv": "",
			"playerv": "",
			"sup": "0",
			"segment2": "",
			"segment1": "",
			"forward": "1",
			"ad": "0",
			"cr": "4_00_99_V1_00000",
			"c9": "devid,",
			"enc": "true",
			"c1": "nuid,H1BhTZGZvGCcPNuIJOyhKvkSU5U1S1585855507",
			"at": "view",
			"rt": "video",
			"c16": "sdkv,bj.6.0.0",
			"c27": "cln,0",
			"crs": "",
			"lat": "",
			"lon": "",
			"c29": "plid,15858555071299378",
			"c30": "bldv,6.0.0.494",
			"st": "dcr",
			"c7": "osgrp,",
			"c8": "devgrp,",
			"c10": "plt,",
			"c40": "adbid,",
			"c14": "osver,NA",
			"c26": "dmap,1",
			"dd": "",
			"hrd": "",
			"wkd": "",
			"c35": "adrsid,",
			"c36": "cref1,",
			"c37": "cref2,",
			"c11": "agg,1",
			"c12": "apv,",
			"c51": "adl,0",
			"c52": "noad,0",
			"sd": "600",
			"devtypid": "",
			"pc": "NA",
			"c53": "fef,n",
			"c54": "oad,",
			"c55": "cref3,",
			"c57": "adldf,2",
			"ai": "204558915992",
			"c3": "st,c",
			"c64": "starttm,1585855521",
			"adid": "204558915992",
			"c58": "isLive,false",
			"c59": "sesid,gFXySQwP6oUZ2yAmG8j9R8DEBWcLx1585855509",
			"c61": "createtm,1585855520",
			"c63": "pipMode,",
			"c60": "agfall,~~~~~~~~~~~~~~~~~~~~p10,~~~~~~~~~~~~~~content~~~~",
			"c17": "stnid,defaultStationId",
			"c19": "stntype,",
			"c68": "bndlid,",
			"nodeTM": "",
			"logTM": "",
			"c73": "phtype,",
			"c74": "dvcnm,",
			"c76": "adbsnid,",
			"c77": "adsuprt,2",
			"uoo": "",
			"evdata": "",
			"c71": "ottflg,0",
			"c72": "otttyp,none",
			"c44": "progen,",
			"davty": "0",
			"si": "http%3A%2F%2Fengtestsite.com%2Fbsdk%2Ftestsuite%2Ftestharness%2Fsingle%2Findex_eugenia.html%3Fenv%3Dqat4%26file%3DPauseTimeout_GGPM_DCRVideo_PrerollContentNOPauseTimeout.xml%26cdn%3Dstatic-staging1%26nsdkv%3D600_rc%26configEnv%3Dstatic-staging2%26ggcmbVersion%3Dbundled600",
			"c66": "mediaurl,",
			"c62": "sendTime,1585855520",
			"rnd": "905330"
		},
		{
			"_baseurl": "https://secure-qat4.imrworldwide.com/cgi-bin/gn",
			"_sentAt": "2020-04-02T19:26:31.942Z",
			"prd": "dcr",
			"ci": "us-506843",
			"ch": "us-506843_b01_P",
			"asn": "ProgramAsset8",
			"sessionId": "xhCjksnvpvqEeJIiywD2UK1tPjQUN1585855507",
			"tl": "Skydiving%20Across%20Europe",
			"prv": "1",
			"c6": "vc,b01",
			"ca": "us-506843_b01_204558915992",
			"cg": "latacg",
			"c13": "asid,DHG163HR-BH45-JKY6-BKH7-67GJKY68GJK7",
			"c32": "segA,S07E04%3ANBC",
			"c33": "segB,teams",
			"c34": "segC,AtlanataFalcons",
			"c15": "apn,",
			"plugv": "",
			"playerv": "",
			"sup": "0",
			"segment2": "",
			"segment1": "",
			"forward": "1",
			"ad": "0",
			"cr": "4_00_99_D1_10000",
			"c9": "devid,",
			"enc": "true",
			"c1": "nuid,H1BhTZGZvGCcPNuIJOyhKvkSU5U1S1585855507",
			"at": "timer",
			"rt": "video",
			"c16": "sdkv,bj.6.0.0",
			"c27": "cln,40",
			"crs": "",
			"lat": "",
			"lon": "",
			"c29": "plid,15858555071299378",
			"c30": "bldv,6.0.0.494",
			"st": "dcr",
			"c7": "osgrp,",
			"c8": "devgrp,",
			"c10": "plt,",
			"c40": "adbid,",
			"c14": "osver,NA",
			"c26": "dmap,1",
			"dd": "",
			"hrd": "",
			"wkd": "",
			"c35": "adrsid,",
			"c36": "cref1,",
			"c37": "cref2,",
			"c11": "agg,1",
			"c12": "apv,",
			"c51": "adl,10",
			"c52": "noad,1",
			"sd": "600",
			"devtypid": "",
			"pc": "NA",
			"c53": "fef,n",
			"c54": "oad,",
			"c55": "cref3,",
			"c57": "adldf,2",
			"ai": "204558915992",
			"c3": "st,c",
			"c64": "starttm,1585855521",
			"adid": "204558915992",
			"c58": "isLive,false",
			"c59": "sesid,gFXySQwP6oUZ2yAmG8j9R8DEBWcLx1585855509",
			"c61": "createtm,1585855590",
			"c63": "pipMode,",
			"c60": "agfall,~~~~~~~~~~~~~~~~~~~~p10,~~~~~~~~~~~~~~content~~~~",
			"c17": "stnid,defaultStationId",
			"c19": "stntype,",
			"c68": "bndlid,",
			"nodeTM": "",
			"logTM": "",
			"c73": "phtype,",
			"c74": "dvcnm,",
			"c76": "adbsnid,",
			"c77": "adsuprt,2",
			"uoo": "",
			"evdata": "PL%3A1585855510%3A0~PU%3A1585855531%3A10~RE%3A1585855562%3A11~ST%3A1585855592%3A40",
			"c71": "ottflg,0",
			"c72": "otttyp,none",
			"c44": "progen,",
			"davty": "2",
			"si": "http%3A%2F%2Fengtestsite.com%2Fbsdk%2Ftestsuite%2Ftestharness%2Fsingle%2Findex_eugenia.html%3Fenv%3Dqat4%26file%3DPauseTimeout_GGPM_DCRVideo_PrerollContentNOPauseTimeout.xml%26cdn%3Dstatic-staging1%26nsdkv%3D600_rc%26configEnv%3Dstatic-staging2%26ggcmbVersion%3Dbundled600",
			"c66": "mediaurl,",
			"c62": "sendTime,1585855590",
			"rnd": "305351"
		}
	]
}