{
	"testCaseName": "PauseTimeout_GGPM_DCRVideo_PrerollContentPauseTimeoutEvent7.xml",
	"baselineGeneratedDate": "2020-04-02T19:31:38.822Z",
	"testUrl": "http://engtestsite.com/bsdk/testsuite/testharness/single/index_eugenia.html?env=qat4&file=PauseTimeout_GGPM_DCRVideo_PrerollContentPauseTimeoutEvent7.xml&cdn=static-staging1&nsdkv=600_rc&configEnv=static-staging2&ggcmbVersion=bundled600",
	"results": [
		{
			"_baseurl": "https://secure-qat4.imrworldwide.com/cgi-bin/gn",
			"_sentAt": "2020-04-02T19:29:56.721Z",
			"prd": "session",
			"c9": "devid,",
			"c13": "asid,DHG163HR-BH45-JKY6-BKH7-67GJKY68GJK7",
			"sessionId": "iggkXuUx7Nr3ra19BtH1PJg4BaX2P1585855796",
			"c16": "sdkv,bj.6.0.0",
			"uoo": "",
			"retry": "0"
		},
		{
			"_baseurl": "https://secure-qat4.imrworldwide.com/cgi-bin/gn",
			"_sentAt": "2020-04-02T19:30:09.983Z",
			"prd": "dcr",
			"ci": "us-506843",
			"ch": "us-506843_b01_P",
			"asn": "ProgramAsset8",
			"sessionId": "iggkXuUx7Nr3ra19BtH1PJg4BaX2P1585855796",
			"tl": "",
			"prv": "1",
			"c6": "vc,b01",
			"ca": "us-506843_b01_preroll123",
			"cg": "latacg",
			"c13": "asid,DHG163HR-BH45-JKY6-BKH7-67GJKY68GJK7",
			"c32": "segA,S07E04%3ANBC",
			"c33": "segB,teams",
			"c34": "segC,AtlanataFalcons",
			"c15": "apn,",
			"plugv": "",
			"playerv": "",
			"sup": "0",
			"segment2": "",
			"segment1": "",
			"forward": "1",
			"ad": "0",
			"cr": "4_00_99_D1_00000",
			"c9": "devid,",
			"enc": "true",
			"c1": "nuid,dyIN4YBsevgu0UCdPDxhBNjA9AMBG1585855796",
			"at": "timer",
			"rt": "video",
			"c16": "sdkv,bj.6.0.0",
			"c27": "cln,10",
			"crs": "",
			"lat": "",
			"lon": "",
			"c29": "plid,15858557963503304",
			"c30": "bldv,6.0.0.494",
			"st": "dcr",
			"c7": "osgrp,",
			"c8": "devgrp,",
			"c10": "plt,",
			"c40": "adbid,",
			"c14": "osver,NA",
			"c26": "dmap,1",
			"dd": "",
			"hrd": "",
			"wkd": "",
			"c35": "adrsid,",
			"c36": "cref1,",
			"c37": "cref2,",
			"c11": "agg,1",
			"c12": "apv,",
			"c51": "adl,10",
			"c52": "noad,1",
			"sd": "20",
			"devtypid": "",
			"pc": "NA",
			"c53": "fef,n",
			"c54": "oad,",
			"c55": "cref3,",
			"c57": "adldf,2",
			"ai": "preroll123",
			"c3": "st,a",
			"c64": "starttm,1585855799",
			"adid": "preroll123",
			"c58": "isLive,false",
			"c59": "sesid,KYsERvOpeYZVllW19RUg184opmrgm1585855798",
			"c61": "createtm,1585855808",
			"c63": "pipMode,",
			"c60": "agfall,~~~~~~~~~~~~~~~~~~~~p10,~~~~~~~~~~~~~~preroll~~~~",
			"c17": "stnid,defaultStationId",
			"c19": "stntype,",
			"c68": "bndlid,",
			"c69": "cvw,0",
			"nodeTM": "",
			"logTM": "",
			"c73": "phtype,",
			"c74": "dvcnm,",
			"c76": "adbsnid,",
			"uoo": "",
			"c44": "progen,",
			"davty": "1",
			"si": "http%3A%2F%2Fengtestsite.com%2Fbsdk%2Ftestsuite%2Ftestharness%2Fsingle%2Findex_eugenia.html%3Fenv%3Dqat4%26file%3DPauseTimeout_GGPM_DCRVideo_PrerollContentPauseTimeoutEvent7.xml%26cdn%3Dstatic-staging1%26nsdkv%3D600_rc%26configEnv%3Dstatic-staging2%26ggcmbVersion%3Dbundled600",
			"c66": "mediaurl,",
			"c62": "sendTime,1585855808",
			"rnd": "117274"
		},
		{
			"_baseurl": "https://secure-qat4.imrworldwide.com/cgi-bin/gn",
			"_sentAt": "2020-04-02T19:30:11.019Z",
			"prd": "dcr",
			"ci": "us-506843",
			"ch": "us-506843_b01_P",
			"asn": "ProgramAsset8",
			"sessionId": "iggkXuUx7Nr3ra19BtH1PJg4BaX2P1585855796",
			"tl": "Skydiving%20Across%20Europe",
			"prv": "1",
			"c6": "vc,b01",
			"ca": "us-506843_b01_204558915992",
			"cg": "latacg",
			"c13": "asid,DHG163HR-BH45-JKY6-BKH7-67GJKY68GJK7",
			"c32": "segA,S07E04%3ANBC",
			"c33": "segB,teams",
			"c34": "segC,AtlanataFalcons",
			"c15": "apn,",
			"plugv": "",
			"playerv": "",
			"sup": "0",
			"segment2": "",
			"segment1": "",
			"forward": "1",
			"ad": "0",
			"cr": "4_00_99_V1_00000",
			"c9": "devid,",
			"enc": "true",
			"c1": "nuid,dyIN4YBsevgu0UCdPDxhBNjA9AMBG1585855796",
			"at": "view",
			"rt": "video",
			"c16": "sdkv,bj.6.0.0",
			"c27": "cln,0",
			"crs": "",
			"lat": "",
			"lon": "",
			"c29": "plid,15858557963503304",
			"c30": "bldv,6.0.0.494",
			"st": "dcr",
			"c7": "osgrp,",
			"c8": "devgrp,",
			"c10": "plt,",
			"c40": "adbid,",
			"c14": "osver,NA",
			"c26": "dmap,1",
			"dd": "",
			"hrd": "",
			"wkd": "",
			"c35": "adrsid,",
			"c36": "cref1,",
			"c37": "cref2,",
			"c11": "agg,1",
			"c12": "apv,",
			"c51": "adl,0",
			"c52": "noad,0",
			"sd": "600",
			"devtypid": "",
			"pc": "NA",
			"c53": "fef,n",
			"c54": "oad,",
			"c55": "cref3,",
			"c57": "adldf,2",
			"ai": "204558915992",
			"c3": "st,c",
			"c64": "starttm,1585855810",
			"adid": "204558915992",
			"c58": "isLive,false",
			"c59": "sesid,KYsERvOpeYZVllW19RUg184opmrgm1585855798",
			"c61": "createtm,1585855809",
			"c63": "pipMode,",
			"c60": "agfall,~~~~~~~~~~~~~~~~~~~~p10,~~~~~~~~~~~~~~content~~~~",
			"c17": "stnid,defaultStationId",
			"c19": "stntype,",
			"c68": "bndlid,",
			"nodeTM": "",
			"logTM": "",
			"c73": "phtype,",
			"c74": "dvcnm,",
			"c76": "adbsnid,",
			"c77": "adsuprt,2",
			"uoo": "",
			"evdata": "",
			"c71": "ottflg,0",
			"c72": "otttyp,none",
			"c44": "progen,",
			"davty": "0",
			"si": "http%3A%2F%2Fengtestsite.com%2Fbsdk%2Ftestsuite%2Ftestharness%2Fsingle%2Findex_eugenia.html%3Fenv%3Dqat4%26file%3DPauseTimeout_GGPM_DCRVideo_PrerollContentPauseTimeoutEvent7.xml%26cdn%3Dstatic-staging1%26nsdkv%3D600_rc%26configEnv%3Dstatic-staging2%26ggcmbVersion%3Dbundled600",
			"c66": "mediaurl,",
			"c62": "sendTime,1585855810",
			"rnd": "232591"
		},
		{
			"_baseurl": "https://secure-qat4.imrworldwide.com/cgi-bin/gn",
			"_sentAt": "2020-04-02T19:30:21.015Z",
			"prd": "dcr",
			"ci": "us-506843",
			"ch": "us-506843_b01_P",
			"asn": "ProgramAsset8",
			"sessionId": "iggkXuUx7Nr3ra19BtH1PJg4BaX2P1585855796",
			"tl": "Skydiving%20Across%20Europe",
			"prv": "1",
			"c6": "vc,b01",
			"ca": "us-506843_b01_204558915992",
			"cg": "latacg",
			"c13": "asid,DHG163HR-BH45-JKY6-BKH7-67GJKY68GJK7",
			"c32": "segA,S07E04%3ANBC",
			"c33": "segB,teams",
			"c34": "segC,AtlanataFalcons",
			"c15": "apn,",
			"plugv": "",
			"playerv": "",
			"sup": "0",
			"segment2": "",
			"segment1": "",
			"forward": "1",
			"ad": "0",
			"cr": "4_00_99_D1_00000",
			"c9": "devid,",
			"enc": "true",
			"c1": "nuid,dyIN4YBsevgu0UCdPDxhBNjA9AMBG1585855796",
			"at": "timer",
			"rt": "video",
			"c16": "sdkv,bj.6.0.0",
			"c27": "cln,10",
			"crs": "",
			"lat": "",
			"lon": "",
			"c29": "plid,15858557963503304",
			"c30": "bldv,6.0.0.494",
			"st": "dcr",
			"c7": "osgrp,",
			"c8": "devgrp,",
			"c10": "plt,",
			"c40": "adbid,",
			"c14": "osver,NA",
			"c26": "dmap,1",
			"dd": "",
			"hrd": "",
			"wkd": "",
			"c35": "adrsid,",
			"c36": "cref1,",
			"c37": "cref2,",
			"c11": "agg,1",
			"c12": "apv,",
			"c51": "adl,10",
			"c52": "noad,1",
			"sd": "600",
			"devtypid": "",
			"pc": "NA",
			"c53": "fef,n",
			"c54": "oad,",
			"c55": "cref3,",
			"c57": "adldf,2",
			"ai": "204558915992",
			"c3": "st,c",
			"c64": "starttm,1585855810",
			"adid": "204558915992",
			"c58": "isLive,false",
			"c59": "sesid,KYsERvOpeYZVllW19RUg184opmrgm1585855798",
			"c61": "createtm,1585855819",
			"c63": "pipMode,",
			"c60": "agfall,~~~~~~~~~~~~~~~~~~~~p10,~~~~~~~~~~~~~~content~~~~",
			"c17": "stnid,defaultStationId",
			"c19": "stntype,",
			"c68": "bndlid,",
			"nodeTM": "",
			"logTM": "",
			"c73": "phtype,",
			"c74": "dvcnm,",
			"c76": "adbsnid,",
			"c77": "adsuprt,2",
			"uoo": "",
			"evdata": "PL%3A1585855799%3A0",
			"c71": "ottflg,0",
			"c72": "otttyp,none",
			"c44": "progen,",
			"davty": "1",
			"si": "http%3A%2F%2Fengtestsite.com%2Fbsdk%2Ftestsuite%2Ftestharness%2Fsingle%2Findex_eugenia.html%3Fenv%3Dqat4%26file%3DPauseTimeout_GGPM_DCRVideo_PrerollContentPauseTimeoutEvent7.xml%26cdn%3Dstatic-staging1%26nsdkv%3D600_rc%26configEnv%3Dstatic-staging2%26ggcmbVersion%3Dbundled600",
			"c66": "mediaurl,",
			"c62": "sendTime,1585855819",
			"rnd": "103514"
		},
		{
			"_baseurl": "https://secure-qat4.imrworldwide.com/cgi-bin/gn",
			"_sentAt": "2020-04-02T19:30:51.369Z",
			"prd": "dcr",
			"ci": "us-506843",
			"ch": "us-506843_b01_P",
			"asn": "ProgramAsset8",
			"sessionId": "iggkXuUx7Nr3ra19BtH1PJg4BaX2P1585855796",
			"tl": "Skydiving%20Across%20Europe",
			"prv": "1",
			"c6": "vc,b01",
			"ca": "us-506843_b01_204558915992",
			"cg": "latacg",
			"c13": "asid,DHG163HR-BH45-JKY6-BKH7-67GJKY68GJK7",
			"c32": "segA,S07E04%3ANBC",
			"c33": "segB,teams",
			"c34": "segC,AtlanataFalcons",
			"c15": "apn,",
			"plugv": "",
			"playerv": "",
			"sup": "0",
			"segment2": "",
			"segment1": "",
			"forward": "1",
			"ad": "0",
			"cr": "4_00_99_D1_00000",
			"c9": "devid,",
			"enc": "true",
			"c1": "nuid,dyIN4YBsevgu0UCdPDxhBNjA9AMBG1585855796",
			"at": "timer",
			"rt": "video",
			"c16": "sdkv,bj.6.0.0",
			"c27": "cln,0",
			"crs": "",
			"lat": "",
			"lon": "",
			"c29": "plid,15858557963503304",
			"c30": "bldv,6.0.0.494",
			"st": "dcr",
			"c7": "osgrp,",
			"c8": "devgrp,",
			"c10": "plt,",
			"c40": "adbid,",
			"c14": "osver,NA",
			"c26": "dmap,1",
			"dd": "",
			"hrd": "",
			"wkd": "",
			"c35": "adrsid,",
			"c36": "cref1,",
			"c37": "cref2,",
			"c11": "agg,1",
			"c12": "apv,",
			"c51": "adl,0",
			"c52": "noad,0",
			"sd": "600",
			"devtypid": "",
			"pc": "NA",
			"c53": "fef,n",
			"c54": "oad,",
			"c55": "cref3,",
			"c57": "adldf,2",
			"ai": "204558915992",
			"c3": "st,c",
			"c64": "starttm,1585855821",
			"adid": "204558915992",
			"c58": "isLive,false",
			"c59": "sesid,KYsERvOpeYZVllW19RUg184opmrgm1585855798",
			"c61": "createtm,1585855850",
			"c63": "pipMode,",
			"c60": "agfall,~~~~~~~~~~~~~~~~~~~~p10,~~~~~~~~~~~~~~content~~~~",
			"c17": "stnid,defaultStationId",
			"c19": "stntype,",
			"c68": "bndlid,",
			"nodeTM": "",
			"logTM": "",
			"c73": "phtype,",
			"c74": "dvcnm,",
			"c76": "adbsnid,",
			"c77": "adsuprt,2",
			"uoo": "",
			"evdata": "PU%3A1585855820%3A10~ST%3A1585855851%3A10",
			"c71": "ottflg,0",
			"c72": "otttyp,none",
			"c44": "progen,",
			"davty": "2",
			"si": "http%3A%2F%2Fengtestsite.com%2Fbsdk%2Ftestsuite%2Ftestharness%2Fsingle%2Findex_eugenia.html%3Fenv%3Dqat4%26file%3DPauseTimeout_GGPM_DCRVideo_PrerollContentPauseTimeoutEvent7.xml%26cdn%3Dstatic-staging1%26nsdkv%3D600_rc%26configEnv%3Dstatic-staging2%26ggcmbVersion%3Dbundled600",
			"c66": "mediaurl,",
			"c62": "sendTime,1585855850",
			"rnd": "54366"
		},
		{
			"_baseurl": "https://secure-qat4.imrworldwide.com/cgi-bin/gn",
			"_sentAt": "2020-04-02T19:31:02.140Z",
			"prd": "dcr",
			"ci": "us-506843",
			"ch": "us-506843_b01_P",
			"asn": "ProgramAsset8",
			"sessionId": "iggkXuUx7Nr3ra19BtH1PJg4BaX2P1585855796",
			"tl": "Skydiving%20Across%20Europe",
			"prv": "1",
			"c6": "vc,b01",
			"ca": "us-506843_b01_204558915992",
			"cg": "latacg",
			"c13": "asid,DHG163HR-BH45-JKY6-BKH7-67GJKY68GJK7",
			"c32": "segA,S07E04%3ANBC",
			"c33": "segB,teams",
			"c34": "segC,AtlanataFalcons",
			"c15": "apn,",
			"plugv": "",
			"playerv": "",
			"sup": "0",
			"segment2": "",
			"segment1": "",
			"forward": "1",
			"ad": "0",
			"cr": "4_00_99_V1_00000",
			"c9": "devid,",
			"enc": "true",
			"c1": "nuid,dyIN4YBsevgu0UCdPDxhBNjA9AMBG1585855796",
			"at": "view",
			"rt": "video",
			"c16": "sdkv,bj.6.0.0",
			"c27": "cln,0",
			"crs": "",
			"lat": "",
			"lon": "",
			"c29": "plid,15858557963503304",
			"c30": "bldv,6.0.0.494",
			"st": "dcr",
			"c7": "osgrp,",
			"c8": "devgrp,",
			"c10": "plt,",
			"c40": "adbid,",
			"c14": "osver,NA",
			"c26": "dmap,1",
			"dd": "",
			"hrd": "",
			"wkd": "",
			"c35": "adrsid,",
			"c36": "cref1,",
			"c37": "cref2,",
			"c11": "agg,1",
			"c12": "apv,",
			"c51": "adl,0",
			"c52": "noad,0",
			"sd": "600",
			"devtypid": "",
			"pc": "NA",
			"c53": "fef,n",
			"c54": "oad,",
			"c55": "cref3,",
			"c57": "adldf,2",
			"ai": "204558915992",
			"c3": "st,c",
			"c64": "starttm,1585855862",
			"adid": "204558915992",
			"c58": "isLive,false",
			"c59": "sesid,QU9Eayua82jX7axqy9ApFo6PtMT0r1585855862",
			"c61": "createtm,1585855861",
			"c63": "pipMode,",
			"c60": "agfall,~~~~~~~~~~~~~~~~~~~~p10,~~~~~~~~~~~~~~content~~~~",
			"c17": "stnid,defaultStationId",
			"c19": "stntype,",
			"c68": "bndlid,",
			"nodeTM": "",
			"logTM": "",
			"c73": "phtype,",
			"c74": "dvcnm,",
			"c76": "adbsnid,",
			"c77": "adsuprt,2",
			"uoo": "",
			"evdata": "",
			"c71": "ottflg,0",
			"c72": "otttyp,none",
			"c44": "progen,",
			"davty": "0",
			"si": "http%3A%2F%2Fengtestsite.com%2Fbsdk%2Ftestsuite%2Ftestharness%2Fsingle%2Findex_eugenia.html%3Fenv%3Dqat4%26file%3DPauseTimeout_GGPM_DCRVideo_PrerollContentPauseTimeoutEvent7.xml%26cdn%3Dstatic-staging1%26nsdkv%3D600_rc%26configEnv%3Dstatic-staging2%26ggcmbVersion%3Dbundled600",
			"c66": "mediaurl,",
			"c62": "sendTime,1585855861",
			"rnd": "867467"
		},
		{
			"_baseurl": "https://secure-qat4.imrworldwide.com/cgi-bin/gn",
			"_sentAt": "2020-04-02T19:31:32.054Z",
			"prd": "dcr",
			"ci": "us-506843",
			"ch": "us-506843_b01_P",
			"asn": "ProgramAsset8",
			"sessionId": "iggkXuUx7Nr3ra19BtH1PJg4BaX2P1585855796",
			"tl": "Skydiving%20Across%20Europe",
			"prv": "1",
			"c6": "vc,b01",
			"ca": "us-506843_b01_204558915992",
			"cg": "latacg",
			"c13": "asid,DHG163HR-BH45-JKY6-BKH7-67GJKY68GJK7",
			"c32": "segA,S07E04%3ANBC",
			"c33": "segB,teams",
			"c34": "segC,AtlanataFalcons",
			"c15": "apn,",
			"plugv": "",
			"playerv": "",
			"sup": "0",
			"segment2": "",
			"segment1": "",
			"forward": "1",
			"ad": "0",
			"cr": "4_00_99_D1_10000",
			"c9": "devid,",
			"enc": "true",
			"c1": "nuid,dyIN4YBsevgu0UCdPDxhBNjA9AMBG1585855796",
			"at": "timer",
			"rt": "video",
			"c16": "sdkv,bj.6.0.0",
			"c27": "cln,30",
			"crs": "",
			"lat": "",
			"lon": "",
			"c29": "plid,15858557963503304",
			"c30": "bldv,6.0.0.494",
			"st": "dcr",
			"c7": "osgrp,",
			"c8": "devgrp,",
			"c10": "plt,",
			"c40": "adbid,",
			"c14": "osver,NA",
			"c26": "dmap,1",
			"dd": "",
			"hrd": "",
			"wkd": "",
			"c35": "adrsid,",
			"c36": "cref1,",
			"c37": "cref2,",
			"c11": "agg,1",
			"c12": "apv,",
			"c51": "adl,0",
			"c52": "noad,0",
			"sd": "600",
			"devtypid": "",
			"pc": "NA",
			"c53": "fef,n",
			"c54": "oad,",
			"c55": "cref3,",
			"c57": "adldf,2",
			"ai": "204558915992",
			"c3": "st,c",
			"c64": "starttm,1585855862",
			"adid": "204558915992",
			"c58": "isLive,false",
			"c59": "sesid,QU9Eayua82jX7axqy9ApFo6PtMT0r1585855862",
			"c61": "createtm,1585855891",
			"c63": "pipMode,",
			"c60": "agfall,~~~~~~~~~~~~~~~~~~~~p10,~~~~~~~~~~~~~~content~~~~",
			"c17": "stnid,defaultStationId",
			"c19": "stntype,",
			"c68": "bndlid,",
			"nodeTM": "",
			"logTM": "",
			"c73": "phtype,",
			"c74": "dvcnm,",
			"c76": "adbsnid,",
			"c77": "adsuprt,2",
			"uoo": "",
			"evdata": "PL%3A1585855862%3A0~ST%3A1585855892%3A30",
			"c71": "ottflg,0",
			"c72": "otttyp,none",
			"c44": "progen,",
			"davty": "2",
			"si": "http%3A%2F%2Fengtestsite.com%2Fbsdk%2Ftestsuite%2Ftestharness%2Fsingle%2Findex_eugenia.html%3Fenv%3Dqat4%26file%3DPauseTimeout_GGPM_DCRVideo_PrerollContentPauseTimeoutEvent7.xml%26cdn%3Dstatic-staging1%26nsdkv%3D600_rc%26configEnv%3Dstatic-staging2%26ggcmbVersion%3Dbundled600",
			"c66": "mediaurl,",
			"c62": "sendTime,1585855891",
			"rnd": "551720"
		}
	]
}