{
	"testCaseName": "trackEvent_BSDK_DCR_Content_2Mins_rewind.xml",
	"baselineGeneratedDate": "2020-04-10T19:26:16.953Z",
	"testUrl": "http://engtestsite.com/bsdk/testsuite/testharness/single/index_eugenia.html?env=qat4&file=trackEvent_BSDK_DCR_Content_2Mins_rewind.xml&cdn=cdn-gl&nsdkv=600&configEnv=static-staging1&ggcmbVersion=bundled600",
	"results": [
		{
			"_baseurl": "https://secure-qat4.imrworldwide.com/cgi-bin/gn",
			"_sentAt": "2020-04-10T19:22:05.570Z",
			"prd": "session",
			"c9": "devid,",
			"c13": "asid,T84C549E7-300C-4856-814D-C3C0474B7DFB",
			"sessionId": "YEW8LjMqu0cXjLf2TOMSKiiT4BgsM1586546525",
			"c16": "sdkv,bj.6.0.0",
			"uoo": "",
			"retry": "0"
		},
		{
			"_baseurl": "https://secure-qat4.imrworldwide.com/cgi-bin/gn",
			"_sentAt": "2020-04-10T19:22:09.029Z",
			"prd": "dcr",
			"ci": "us-506843",
			"ch": "us-506843_b01_P",
			"asn": "ProgramAsset8",
			"sessionId": "YEW8LjMqu0cXjLf2TOMSKiiT4BgsM1586546525",
			"tl": "Skydiving%20Across%20Europe",
			"prv": "1",
			"c6": "vc,b01",
			"ca": "us-506843_b01_204558915992",
			"cg": "latacg",
			"c13": "asid,T84C549E7-300C-4856-814D-C3C0474B7DFB",
			"c32": "segA,S07E04%3ANBC",
			"c33": "segB,teams",
			"c34": "segC,AtlanataFalcons",
			"c15": "apn,",
			"plugv": "",
			"playerv": "",
			"sup": "1",
			"segment2": "",
			"segment1": "",
			"forward": "0",
			"ad": "0",
			"cr": "4_00_99_V1_00000",
			"c9": "devid,",
			"enc": "true",
			"c1": "nuid,QODY04hxyL8mmXosTRfY2rSqEEkI01586546525",
			"at": "view",
			"rt": "video",
			"c16": "sdkv,bj.6.0.0",
			"c27": "cln,0",
			"crs": "",
			"lat": "",
			"lon": "",
			"c29": "plid,15865465254525277",
			"c30": "bldv,6.0.0.474",
			"st": "dcragf",
			"c7": "osgrp,",
			"c8": "devgrp,",
			"c10": "plt,",
			"c40": "adbid,",
			"c14": "osver,NA",
			"c26": "dmap,1",
			"dd": "",
			"hrd": "",
			"wkd": "",
			"c35": "adrsid,",
			"c36": "cref1,",
			"c37": "cref2,",
			"c11": "agg,1",
			"c12": "apv,",
			"c51": "adl,0",
			"c52": "noad,0",
			"sd": "150",
			"devtypid": "",
			"pc": "NA",
			"c53": "fef,n",
			"c54": "oad,",
			"c55": "cref3,",
			"c57": "adldf,2",
			"ai": "204558915992",
			"c3": "st,c",
			"c64": "starttm,1586546528",
			"adid": "204558915992",
			"c58": "isLive,false",
			"c59": "sesid,72AijX8b1nyn92A7UlROxFcrdiHRA1586546528",
			"c61": "createtm,1586546527",
			"c63": "pipMode,",
			"c68": "bndlid,",
			"nodeTM": "",
			"logTM": "",
			"c73": "phtype,",
			"c74": "dvcnm,",
			"c76": "adbsnid,",
			"c77": "adsuprt,2",
			"uoo": "",
			"evdata": "",
			"c71": "ottflg,0",
			"c72": "otttyp,none",
			"c44": "progen,",
			"davty": "0",
			"si": "http%3A%2F%2Fengtestsite.com%2Fbsdk%2Ftestsuite%2Ftestharness%2Fsingle%2Findex_eugenia.html%3Fenv%3Dqat4%26file%3DtrackEvent_BSDK_DCR_Content_2Mins_rewind.xml%26cdn%3Dcdn-gl%26nsdkv%3D600%26configEnv%3Dstatic-staging1%26ggcmbVersion%3Dbundled600",
			"c66": "mediaurl,",
			"c62": "sendTime,1586546528",
			"rnd": "471014"
		},
		{
			"_baseurl": "https://secure-qat4.imrworldwide.com/cgi-bin/gn",
			"_sentAt": "2020-04-10T19:24:11.016Z",
			"prd": "dcr",
			"ci": "us-506843",
			"ch": "us-506843_b01_P",
			"asn": "ProgramAsset8",
			"sessionId": "YEW8LjMqu0cXjLf2TOMSKiiT4BgsM1586546525",
			"tl": "Skydiving%20Across%20Europe",
			"prv": "1",
			"c6": "vc,b01",
			"ca": "us-506843_b01_204558915992",
			"cg": "latacg",
			"c13": "asid,T84C549E7-300C-4856-814D-C3C0474B7DFB",
			"c32": "segA,S07E04%3ANBC",
			"c33": "segB,teams",
			"c34": "segC,AtlanataFalcons",
			"c15": "apn,",
			"plugv": "",
			"playerv": "",
			"sup": "1",
			"segment2": "",
			"segment1": "",
			"forward": "0",
			"ad": "0",
			"cr": "4_00_99_D1_11000",
			"c9": "devid,",
			"enc": "true",
			"c1": "nuid,QODY04hxyL8mmXosTRfY2rSqEEkI01586546525",
			"at": "timer",
			"rt": "video",
			"c16": "sdkv,bj.6.0.0",
			"c27": "cln,121",
			"crs": "",
			"lat": "",
			"lon": "",
			"c29": "plid,15865465254525277",
			"c30": "bldv,6.0.0.474",
			"st": "dcragf",
			"c7": "osgrp,",
			"c8": "devgrp,",
			"c10": "plt,",
			"c40": "adbid,",
			"c14": "osver,NA",
			"c26": "dmap,1",
			"dd": "",
			"hrd": "",
			"wkd": "",
			"c35": "adrsid,",
			"c36": "cref1,",
			"c37": "cref2,",
			"c11": "agg,1",
			"c12": "apv,",
			"c51": "adl,0",
			"c52": "noad,0",
			"sd": "150",
			"devtypid": "",
			"pc": "NA",
			"c53": "fef,n",
			"c54": "oad,",
			"c55": "cref3,",
			"c57": "adldf,2",
			"ai": "204558915992",
			"c3": "st,c",
			"c64": "starttm,1586546528",
			"adid": "204558915992",
			"c58": "isLive,false",
			"c59": "sesid,72AijX8b1nyn92A7UlROxFcrdiHRA1586546528",
			"c61": "createtm,1586546649",
			"c63": "pipMode,",
			"c68": "bndlid,",
			"nodeTM": "",
			"logTM": "",
			"c73": "phtype,",
			"c74": "dvcnm,",
			"c76": "adbsnid,",
			"c77": "adsuprt,2",
			"uoo": "",
			"evdata": "PL%3A1586546528%3A0~RW%3A1586546650%3A1%3A120%3A119",
			"c71": "ottflg,0",
			"c72": "otttyp,none",
			"c44": "progen,",
			"davty": "1",
			"si": "http%3A%2F%2Fengtestsite.com%2Fbsdk%2Ftestsuite%2Ftestharness%2Fsingle%2Findex_eugenia.html%3Fenv%3Dqat4%26file%3DtrackEvent_BSDK_DCR_Content_2Mins_rewind.xml%26cdn%3Dcdn-gl%26nsdkv%3D600%26configEnv%3Dstatic-staging1%26ggcmbVersion%3Dbundled600",
			"c66": "mediaurl,",
			"c62": "sendTime,1586546649",
			"rnd": "435244"
		},
		{
			"_baseurl": "https://secure-qat4.imrworldwide.com/cgi-bin/gn",
			"_sentAt": "2020-04-10T19:26:10.022Z",
			"prd": "dcr",
			"ci": "us-506843",
			"ch": "us-506843_b01_P",
			"asn": "ProgramAsset8",
			"sessionId": "YEW8LjMqu0cXjLf2TOMSKiiT4BgsM1586546525",
			"tl": "Skydiving%20Across%20Europe",
			"prv": "1",
			"c6": "vc,b01",
			"ca": "us-506843_b01_204558915992",
			"cg": "latacg",
			"c13": "asid,T84C549E7-300C-4856-814D-C3C0474B7DFB",
			"c32": "segA,S07E04%3ANBC",
			"c33": "segB,teams",
			"c34": "segC,AtlanataFalcons",
			"c15": "apn,",
			"plugv": "",
			"playerv": "",
			"sup": "1",
			"segment2": "",
			"segment1": "",
			"forward": "0",
			"ad": "0",
			"cr": "4_00_99_D1_11000",
			"c9": "devid,",
			"enc": "true",
			"c1": "nuid,QODY04hxyL8mmXosTRfY2rSqEEkI01586546525",
			"at": "timer",
			"rt": "video",
			"c16": "sdkv,bj.6.0.0",
			"c27": "cln,119",
			"crs": "",
			"lat": "",
			"lon": "",
			"c29": "plid,15865465254525277",
			"c30": "bldv,6.0.0.474",
			"st": "dcragf",
			"c7": "osgrp,",
			"c8": "devgrp,",
			"c10": "plt,",
			"c40": "adbid,",
			"c14": "osver,NA",
			"c26": "dmap,1",
			"dd": "",
			"hrd": "",
			"wkd": "",
			"c35": "adrsid,",
			"c36": "cref1,",
			"c37": "cref2,",
			"c11": "agg,1",
			"c12": "apv,",
			"c51": "adl,0",
			"c52": "noad,0",
			"sd": "150",
			"devtypid": "",
			"pc": "NA",
			"c53": "fef,n",
			"c54": "oad,",
			"c55": "cref3,",
			"c57": "adldf,2",
			"ai": "204558915992",
			"c3": "st,c",
			"c64": "starttm,1586546651",
			"adid": "204558915992",
			"c58": "isLive,false",
			"c59": "sesid,72AijX8b1nyn92A7UlROxFcrdiHRA1586546528",
			"c61": "createtm,1586546768",
			"c63": "pipMode,",
			"c68": "bndlid,",
			"nodeTM": "",
			"logTM": "",
			"c73": "phtype,",
			"c74": "dvcnm,",
			"c76": "adbsnid,",
			"c77": "adsuprt,2",
			"uoo": "",
			"evdata": "ST%3A1586546770%3A120",
			"c71": "ottflg,0",
			"c72": "otttyp,none",
			"c44": "progen,",
			"davty": "2",
			"si": "http%3A%2F%2Fengtestsite.com%2Fbsdk%2Ftestsuite%2Ftestharness%2Fsingle%2Findex_eugenia.html%3Fenv%3Dqat4%26file%3DtrackEvent_BSDK_DCR_Content_2Mins_rewind.xml%26cdn%3Dcdn-gl%26nsdkv%3D600%26configEnv%3Dstatic-staging1%26ggcmbVersion%3Dbundled600",
			"c66": "mediaurl,",
			"c62": "sendTime,1586546768",
			"rnd": "373157"
		}
	]
}