{
	"testCaseName": "PauseTimeout_GGPM_DCRVideo_PrerollPostroll_PauseTimeoutEvent7GreaterthenPTO.xml",
	"baselineGeneratedDate": "2020-04-02T19:21:52.895Z",
	"testUrl": "http://engtestsite.com/bsdk/testsuite/testharness/single/index_eugenia.html?env=qat4&file=PauseTimeout_GGPM_DCRVideo_PrerollPostroll_PauseTimeoutEvent7GreaterthenPTO.xml&cdn=static-staging1&nsdkv=600_rc&configEnv=static-staging2&ggcmbVersion=bundled600",
	"results": [
		{
			"_baseurl": "https://secure-qat4.imrworldwide.com/cgi-bin/gn",
			"_sentAt": "2020-04-02T19:20:09.887Z",
			"prd": "session",
			"c9": "devid,",
			"c13": "asid,DHG163HR-BH45-JKY6-BKH7-67GJKY68GJK7",
			"sessionId": "2QiKCSQbxPDPdsN4F06e7PUy3nVIL1585855209",
			"c16": "sdkv,bj.6.0.0",
			"uoo": "",
			"retry": "0"
		},
		{
			"_baseurl": "https://secure-qat4.imrworldwide.com/cgi-bin/gn",
			"_sentAt": "2020-04-02T19:20:23.180Z",
			"prd": "dcr",
			"ci": "us-506843",
			"ch": "us-506843_b01_P",
			"asn": "ProgramAsset8",
			"sessionId": "2QiKCSQbxPDPdsN4F06e7PUy3nVIL1585855209",
			"tl": "",
			"prv": "1",
			"c6": "vc,b01",
			"ca": "us-506843_b01_Preroll",
			"cg": "latacg",
			"c13": "asid,DHG163HR-BH45-JKY6-BKH7-67GJKY68GJK7",
			"c32": "segA,S07E04%3ANBC",
			"c33": "segB,teams",
			"c34": "segC,AtlanataFalcons",
			"c15": "apn,",
			"plugv": "",
			"playerv": "",
			"sup": "0",
			"segment2": "",
			"segment1": "",
			"forward": "1",
			"ad": "0",
			"cr": "4_00_99_D1_00000",
			"c9": "devid,",
			"enc": "true",
			"c1": "nuid,AvhBBvtbwwQCf2OqZNJyAdvebrgiz1585855209",
			"at": "timer",
			"rt": "video",
			"c16": "sdkv,bj.6.0.0",
			"c27": "cln,10",
			"crs": "",
			"lat": "",
			"lon": "",
			"c29": "plid,15858552095184500",
			"c30": "bldv,6.0.0.494",
			"st": "dcr",
			"c7": "osgrp,",
			"c8": "devgrp,",
			"c10": "plt,",
			"c40": "adbid,",
			"c14": "osver,NA",
			"c26": "dmap,1",
			"dd": "",
			"hrd": "",
			"wkd": "",
			"c35": "adrsid,",
			"c36": "cref1,",
			"c37": "cref2,",
			"c11": "agg,1",
			"c12": "apv,",
			"c51": "adl,10",
			"c52": "noad,1",
			"sd": "20",
			"devtypid": "",
			"pc": "NA",
			"c53": "fef,n",
			"c54": "oad,",
			"c55": "cref3,",
			"c57": "adldf,2",
			"ai": "Preroll",
			"c3": "st,a",
			"c64": "starttm,1585855212",
			"adid": "Preroll",
			"c58": "isLive,false",
			"c59": "sesid,UCRG4QETNBPmW832lViDrfcfftB6S1585855212",
			"c61": "createtm,1585855222",
			"c63": "pipMode,",
			"c60": "agfall,~~~~~~~~~~~~~~~~~~~~p10,~~~~~~~~~~~~~~preroll~~~~",
			"c17": "stnid,defaultStationId",
			"c19": "stntype,",
			"c68": "bndlid,",
			"c69": "cvw,0",
			"nodeTM": "",
			"logTM": "",
			"c73": "phtype,",
			"c74": "dvcnm,",
			"c76": "adbsnid,",
			"uoo": "",
			"c44": "progen,",
			"davty": "1",
			"si": "http%3A%2F%2Fengtestsite.com%2Fbsdk%2Ftestsuite%2Ftestharness%2Fsingle%2Findex_eugenia.html%3Fenv%3Dqat4%26file%3DPauseTimeout_GGPM_DCRVideo_PrerollPostroll_PauseTimeoutEvent7GreaterthenPTO.xml%26cdn%3Dstatic-staging1%26nsdkv%3D600_rc%26configEnv%3Dstatic-staging2%26ggcmbVersion%3Dbundled600",
			"c66": "mediaurl,",
			"c62": "sendTime,1585855222",
			"rnd": "921404"
		},
		{
			"_baseurl": "https://secure-qat4.imrworldwide.com/cgi-bin/gn",
			"_sentAt": "2020-04-02T19:20:24.200Z",
			"prd": "dcr",
			"ci": "us-506843",
			"ch": "us-506843_b01_P",
			"asn": "ProgramAsset8",
			"sessionId": "2QiKCSQbxPDPdsN4F06e7PUy3nVIL1585855209",
			"tl": "Skydiving%20Across%20Europe",
			"prv": "1",
			"c6": "vc,b01",
			"ca": "us-506843_b01_204558915992",
			"cg": "latacg",
			"c13": "asid,DHG163HR-BH45-JKY6-BKH7-67GJKY68GJK7",
			"c32": "segA,S07E04%3ANBC",
			"c33": "segB,teams",
			"c34": "segC,AtlanataFalcons",
			"c15": "apn,",
			"plugv": "",
			"playerv": "",
			"sup": "0",
			"segment2": "",
			"segment1": "",
			"forward": "1",
			"ad": "0",
			"cr": "4_00_99_V1_00000",
			"c9": "devid,",
			"enc": "true",
			"c1": "nuid,AvhBBvtbwwQCf2OqZNJyAdvebrgiz1585855209",
			"at": "view",
			"rt": "video",
			"c16": "sdkv,bj.6.0.0",
			"c27": "cln,0",
			"crs": "",
			"lat": "",
			"lon": "",
			"c29": "plid,15858552095184500",
			"c30": "bldv,6.0.0.494",
			"st": "dcr",
			"c7": "osgrp,",
			"c8": "devgrp,",
			"c10": "plt,",
			"c40": "adbid,",
			"c14": "osver,NA",
			"c26": "dmap,1",
			"dd": "",
			"hrd": "",
			"wkd": "",
			"c35": "adrsid,",
			"c36": "cref1,",
			"c37": "cref2,",
			"c11": "agg,1",
			"c12": "apv,",
			"c51": "adl,0",
			"c52": "noad,0",
			"sd": "600",
			"devtypid": "",
			"pc": "NA",
			"c53": "fef,n",
			"c54": "oad,",
			"c55": "cref3,",
			"c57": "adldf,2",
			"ai": "204558915992",
			"c3": "st,c",
			"c64": "starttm,1585855223",
			"adid": "204558915992",
			"c58": "isLive,false",
			"c59": "sesid,UCRG4QETNBPmW832lViDrfcfftB6S1585855212",
			"c61": "createtm,1585855223",
			"c63": "pipMode,",
			"c60": "agfall,~~~~~~~~~~~~~~~~~~~~p10,~~~~~~~~~~~~~~content~~~~",
			"c17": "stnid,defaultStationId",
			"c19": "stntype,",
			"c68": "bndlid,",
			"nodeTM": "",
			"logTM": "",
			"c73": "phtype,",
			"c74": "dvcnm,",
			"c76": "adbsnid,",
			"c77": "adsuprt,2",
			"uoo": "",
			"evdata": "",
			"c71": "ottflg,0",
			"c72": "otttyp,none",
			"c44": "progen,",
			"davty": "0",
			"si": "http%3A%2F%2Fengtestsite.com%2Fbsdk%2Ftestsuite%2Ftestharness%2Fsingle%2Findex_eugenia.html%3Fenv%3Dqat4%26file%3DPauseTimeout_GGPM_DCRVideo_PrerollPostroll_PauseTimeoutEvent7GreaterthenPTO.xml%26cdn%3Dstatic-staging1%26nsdkv%3D600_rc%26configEnv%3Dstatic-staging2%26ggcmbVersion%3Dbundled600",
			"c66": "mediaurl,",
			"c62": "sendTime,1585855223",
			"rnd": "474498"
		},
		{
			"_baseurl": "https://secure-qat4.imrworldwide.com/cgi-bin/gn",
			"_sentAt": "2020-04-02T19:20:54.270Z",
			"prd": "dcr",
			"ci": "us-506843",
			"ch": "us-506843_b01_P",
			"asn": "ProgramAsset8",
			"sessionId": "2QiKCSQbxPDPdsN4F06e7PUy3nVIL1585855209",
			"tl": "Skydiving%20Across%20Europe",
			"prv": "1",
			"c6": "vc,b01",
			"ca": "us-506843_b01_204558915992",
			"cg": "latacg",
			"c13": "asid,DHG163HR-BH45-JKY6-BKH7-67GJKY68GJK7",
			"c32": "segA,S07E04%3ANBC",
			"c33": "segB,teams",
			"c34": "segC,AtlanataFalcons",
			"c15": "apn,",
			"plugv": "",
			"playerv": "",
			"sup": "0",
			"segment2": "",
			"segment1": "",
			"forward": "1",
			"ad": "0",
			"cr": "4_00_99_D1_10000",
			"c9": "devid,",
			"enc": "true",
			"c1": "nuid,AvhBBvtbwwQCf2OqZNJyAdvebrgiz1585855209",
			"at": "timer",
			"rt": "video",
			"c16": "sdkv,bj.6.0.0",
			"c27": "cln,30",
			"crs": "",
			"lat": "",
			"lon": "",
			"c29": "plid,15858552095184500",
			"c30": "bldv,6.0.0.494",
			"st": "dcr",
			"c7": "osgrp,",
			"c8": "devgrp,",
			"c10": "plt,",
			"c40": "adbid,",
			"c14": "osver,NA",
			"c26": "dmap,1",
			"dd": "",
			"hrd": "",
			"wkd": "",
			"c35": "adrsid,",
			"c36": "cref1,",
			"c37": "cref2,",
			"c11": "agg,1",
			"c12": "apv,",
			"c51": "adl,10",
			"c52": "noad,1",
			"sd": "600",
			"devtypid": "",
			"pc": "NA",
			"c53": "fef,n",
			"c54": "oad,",
			"c55": "cref3,",
			"c57": "adldf,2",
			"ai": "204558915992",
			"c3": "st,c",
			"c64": "starttm,1585855223",
			"adid": "204558915992",
			"c58": "isLive,false",
			"c59": "sesid,UCRG4QETNBPmW832lViDrfcfftB6S1585855212",
			"c61": "createtm,1585855253",
			"c63": "pipMode,",
			"c60": "agfall,~~~~~~~~~~~~~~~~~~~~p10,~~~~~~~~~~~~~~content~~~~",
			"c17": "stnid,defaultStationId",
			"c19": "stntype,",
			"c68": "bndlid,",
			"nodeTM": "",
			"logTM": "",
			"c73": "phtype,",
			"c74": "dvcnm,",
			"c76": "adbsnid,",
			"c77": "adsuprt,2",
			"uoo": "",
			"evdata": "PL%3A1585855212%3A0~ST%3A1585855254%3A30",
			"c71": "ottflg,0",
			"c72": "otttyp,none",
			"c44": "progen,",
			"davty": "2",
			"si": "http%3A%2F%2Fengtestsite.com%2Fbsdk%2Ftestsuite%2Ftestharness%2Fsingle%2Findex_eugenia.html%3Fenv%3Dqat4%26file%3DPauseTimeout_GGPM_DCRVideo_PrerollPostroll_PauseTimeoutEvent7GreaterthenPTO.xml%26cdn%3Dstatic-staging1%26nsdkv%3D600_rc%26configEnv%3Dstatic-staging2%26ggcmbVersion%3Dbundled600",
			"c66": "mediaurl,",
			"c62": "sendTime,1585855253",
			"rnd": "552967"
		},
		{
			"_baseurl": "https://secure-qat4.imrworldwide.com/cgi-bin/gn",
			"_sentAt": "2020-04-02T19:21:00.328Z",
			"prd": "dcr",
			"ci": "us-506843",
			"ch": "us-506843_b01_P",
			"asn": "ProgramAsset8",
			"sessionId": "2QiKCSQbxPDPdsN4F06e7PUy3nVIL1585855209",
			"tl": "Skydiving%20Across%20Europe",
			"prv": "1",
			"c6": "vc,b01",
			"ca": "us-506843_b01_204558915992",
			"cg": "latacg",
			"c13": "asid,DHG163HR-BH45-JKY6-BKH7-67GJKY68GJK7",
			"c32": "segA,S07E04%3ANBC",
			"c33": "segB,teams",
			"c34": "segC,AtlanataFalcons",
			"c15": "apn,",
			"plugv": "",
			"playerv": "",
			"sup": "0",
			"segment2": "",
			"segment1": "",
			"forward": "1",
			"ad": "0",
			"cr": "4_00_99_D1_00000",
			"c9": "devid,",
			"enc": "true",
			"c1": "nuid,AvhBBvtbwwQCf2OqZNJyAdvebrgiz1585855209",
			"at": "timer",
			"rt": "video",
			"c16": "sdkv,bj.6.0.0",
			"c27": "cln,0",
			"crs": "",
			"lat": "",
			"lon": "",
			"c29": "plid,15858552095184500",
			"c30": "bldv,6.0.0.494",
			"st": "dcr",
			"c7": "osgrp,",
			"c8": "devgrp,",
			"c10": "plt,",
			"c40": "adbid,",
			"c14": "osver,NA",
			"c26": "dmap,1",
			"dd": "",
			"hrd": "",
			"wkd": "",
			"c35": "adrsid,",
			"c36": "cref1,",
			"c37": "cref2,",
			"c11": "agg,1",
			"c12": "apv,",
			"c51": "adl,5",
			"c52": "noad,1",
			"sd": "600",
			"devtypid": "",
			"pc": "NA",
			"c53": "fef,n",
			"c54": "oad,",
			"c55": "cref3,",
			"c57": "adldf,2",
			"ai": "204558915992",
			"c3": "st,c",
			"c64": "starttm,1585855254",
			"adid": "204558915992",
			"c58": "isLive,false",
			"c59": "sesid,UCRG4QETNBPmW832lViDrfcfftB6S1585855212",
			"c61": "createtm,1585855259",
			"c63": "pipMode,",
			"c60": "agfall,~~~~~~~~~~~~~~~~~~~~p10,~~~~~~~~~~~~~~postroll~~~~",
			"c17": "stnid,defaultStationId",
			"c19": "stntype,",
			"c68": "bndlid,",
			"nodeTM": "",
			"logTM": "",
			"c73": "phtype,",
			"c74": "dvcnm,",
			"c76": "adbsnid,",
			"c77": "adsuprt,2",
			"uoo": "",
			"evdata": "",
			"c71": "ottflg,0",
			"c72": "otttyp,none",
			"c44": "progen,",
			"davty": "2",
			"si": "http%3A%2F%2Fengtestsite.com%2Fbsdk%2Ftestsuite%2Ftestharness%2Fsingle%2Findex_eugenia.html%3Fenv%3Dqat4%26file%3DPauseTimeout_GGPM_DCRVideo_PrerollPostroll_PauseTimeoutEvent7GreaterthenPTO.xml%26cdn%3Dstatic-staging1%26nsdkv%3D600_rc%26configEnv%3Dstatic-staging2%26ggcmbVersion%3Dbundled600",
			"c66": "mediaurl,",
			"c62": "sendTime,1585855259",
			"rnd": "6550"
		},
		{
			"_baseurl": "https://secure-qat4.imrworldwide.com/cgi-bin/gn",
			"_sentAt": "2020-04-02T19:21:00.330Z",
			"prd": "dcr",
			"ci": "us-506843",
			"ch": "us-506843_b01_P",
			"asn": "ProgramAsset8",
			"sessionId": "2QiKCSQbxPDPdsN4F06e7PUy3nVIL1585855209",
			"tl": "",
			"prv": "1",
			"c6": "vc,b01",
			"ca": "us-506843_b01_PostrollAdId1",
			"cg": "latacg",
			"c13": "asid,DHG163HR-BH45-JKY6-BKH7-67GJKY68GJK7",
			"c32": "segA,S07E04%3ANBC",
			"c33": "segB,teams",
			"c34": "segC,AtlanataFalcons",
			"c15": "apn,",
			"plugv": "",
			"playerv": "",
			"sup": "0",
			"segment2": "",
			"segment1": "",
			"forward": "1",
			"ad": "0",
			"cr": "4_00_99_D1_00000",
			"c9": "devid,",
			"enc": "true",
			"c1": "nuid,AvhBBvtbwwQCf2OqZNJyAdvebrgiz1585855209",
			"at": "timer",
			"rt": "video",
			"c16": "sdkv,bj.6.0.0",
			"c27": "cln,5",
			"crs": "",
			"lat": "",
			"lon": "",
			"c29": "plid,15858552095184500",
			"c30": "bldv,6.0.0.494",
			"st": "dcr",
			"c7": "osgrp,",
			"c8": "devgrp,",
			"c10": "plt,",
			"c40": "adbid,",
			"c14": "osver,NA",
			"c26": "dmap,1",
			"dd": "",
			"hrd": "",
			"wkd": "",
			"c35": "adrsid,",
			"c36": "cref1,",
			"c37": "cref2,",
			"c11": "agg,1",
			"c12": "apv,",
			"c51": "adl,5",
			"c52": "noad,1",
			"sd": "20",
			"devtypid": "",
			"pc": "NA",
			"c53": "fef,n",
			"c54": "oad,",
			"c55": "cref3,",
			"c57": "adldf,2",
			"ai": "PostrollAdId1",
			"c3": "st,a",
			"c64": "starttm,1585855254",
			"adid": "PostrollAdId1",
			"c58": "isLive,false",
			"c59": "sesid,UCRG4QETNBPmW832lViDrfcfftB6S1585855212",
			"c61": "createtm,1585855259",
			"c63": "pipMode,",
			"c60": "agfall,~~~~~~~~~~~~~~~~~~~~p10,~~~~~~~~~~~~~~postroll~~~~",
			"c17": "stnid,defaultStationId",
			"c19": "stntype,",
			"c68": "bndlid,",
			"c69": "cvw,0",
			"nodeTM": "",
			"logTM": "",
			"c73": "phtype,",
			"c74": "dvcnm,",
			"c76": "adbsnid,",
			"uoo": "",
			"c44": "progen,",
			"davty": "1",
			"si": "http%3A%2F%2Fengtestsite.com%2Fbsdk%2Ftestsuite%2Ftestharness%2Fsingle%2Findex_eugenia.html%3Fenv%3Dqat4%26file%3DPauseTimeout_GGPM_DCRVideo_PrerollPostroll_PauseTimeoutEvent7GreaterthenPTO.xml%26cdn%3Dstatic-staging1%26nsdkv%3D600_rc%26configEnv%3Dstatic-staging2%26ggcmbVersion%3Dbundled600",
			"c66": "mediaurl,",
			"c62": "sendTime,1585855259",
			"rnd": "959937"
		},
		{
			"_baseurl": "https://secure-qat4.imrworldwide.com/cgi-bin/gn",
			"_sentAt": "2020-04-02T19:21:49.375Z",
			"prd": "dcr",
			"ci": "us-506843",
			"ch": "us-506843_b01_P",
			"asn": "ProgramAsset8",
			"sessionId": "2QiKCSQbxPDPdsN4F06e7PUy3nVIL1585855209",
			"tl": "Skydiving%20Across%20Europe",
			"prv": "1",
			"c6": "vc,b01",
			"ca": "us-506843_b01_204558915992",
			"cg": "latacg",
			"c13": "asid,DHG163HR-BH45-JKY6-BKH7-67GJKY68GJK7",
			"c32": "segA,S07E04%3ANBC",
			"c33": "segB,teams",
			"c34": "segC,AtlanataFalcons",
			"c15": "apn,",
			"plugv": "",
			"playerv": "",
			"sup": "0",
			"segment2": "",
			"segment1": "",
			"forward": "1",
			"ad": "0",
			"cr": "4_00_99_D1_00000",
			"c9": "devid,",
			"enc": "true",
			"c1": "nuid,AvhBBvtbwwQCf2OqZNJyAdvebrgiz1585855209",
			"at": "timer",
			"rt": "video",
			"c16": "sdkv,bj.6.0.0",
			"c27": "cln,0",
			"crs": "",
			"lat": "",
			"lon": "",
			"c29": "plid,15858552095184500",
			"c30": "bldv,6.0.0.494",
			"st": "dcr",
			"c7": "osgrp,",
			"c8": "devgrp,",
			"c10": "plt,",
			"c40": "adbid,",
			"c14": "osver,NA",
			"c26": "dmap,1",
			"dd": "",
			"hrd": "",
			"wkd": "",
			"c35": "adrsid,",
			"c36": "cref1,",
			"c37": "cref2,",
			"c11": "agg,1",
			"c12": "apv,",
			"c51": "adl,5",
			"c52": "noad,0",
			"sd": "600",
			"devtypid": "",
			"pc": "NA",
			"c53": "fef,n",
			"c54": "oad,",
			"c55": "cref3,",
			"c57": "adldf,2",
			"ai": "204558915992",
			"c3": "st,c",
			"c64": "starttm,1585855260",
			"adid": "204558915992",
			"c58": "isLive,false",
			"c59": "sesid,UCRG4QETNBPmW832lViDrfcfftB6S1585855212",
			"c61": "createtm,1585855308",
			"c63": "pipMode,",
			"c60": "agfall,~~~~~~~~~~~~~~~~~~~~p10,~~~~~~~~~~~~~~postroll~~~~",
			"c17": "stnid,defaultStationId",
			"c19": "stntype,",
			"c68": "bndlid,",
			"nodeTM": "",
			"logTM": "",
			"c73": "phtype,",
			"c74": "dvcnm,",
			"c76": "adbsnid,",
			"c77": "adsuprt,2",
			"uoo": "",
			"evdata": "",
			"c71": "ottflg,0",
			"c72": "otttyp,none",
			"c44": "progen,",
			"davty": "2",
			"si": "http%3A%2F%2Fengtestsite.com%2Fbsdk%2Ftestsuite%2Ftestharness%2Fsingle%2Findex_eugenia.html%3Fenv%3Dqat4%26file%3DPauseTimeout_GGPM_DCRVideo_PrerollPostroll_PauseTimeoutEvent7GreaterthenPTO.xml%26cdn%3Dstatic-staging1%26nsdkv%3D600_rc%26configEnv%3Dstatic-staging2%26ggcmbVersion%3Dbundled600",
			"c66": "mediaurl,",
			"c62": "sendTime,1585855308",
			"rnd": "833323"
		},
		{
			"_baseurl": "https://secure-qat4.imrworldwide.com/cgi-bin/gn",
			"_sentAt": "2020-04-02T19:21:49.380Z",
			"prd": "dcr",
			"ci": "us-506843",
			"ch": "us-506843_b01_P",
			"asn": "ProgramAsset8",
			"sessionId": "2QiKCSQbxPDPdsN4F06e7PUy3nVIL1585855209",
			"tl": "",
			"prv": "1",
			"c6": "vc,b01",
			"ca": "us-506843_b01_PostrollAdId1",
			"cg": "latacg",
			"c13": "asid,DHG163HR-BH45-JKY6-BKH7-67GJKY68GJK7",
			"c32": "segA,S07E04%3ANBC",
			"c33": "segB,teams",
			"c34": "segC,AtlanataFalcons",
			"c15": "apn,",
			"plugv": "",
			"playerv": "",
			"sup": "0",
			"segment2": "",
			"segment1": "",
			"forward": "1",
			"ad": "0",
			"cr": "4_00_99_D1_00000",
			"c9": "devid,",
			"enc": "true",
			"c1": "nuid,AvhBBvtbwwQCf2OqZNJyAdvebrgiz1585855209",
			"at": "timer",
			"rt": "video",
			"c16": "sdkv,bj.6.0.0",
			"c27": "cln,5",
			"crs": "",
			"lat": "",
			"lon": "",
			"c29": "plid,15858552095184500",
			"c30": "bldv,6.0.0.494",
			"st": "dcr",
			"c7": "osgrp,",
			"c8": "devgrp,",
			"c10": "plt,",
			"c40": "adbid,",
			"c14": "osver,NA",
			"c26": "dmap,1",
			"dd": "",
			"hrd": "",
			"wkd": "",
			"c35": "adrsid,",
			"c36": "cref1,",
			"c37": "cref2,",
			"c11": "agg,1",
			"c12": "apv,",
			"c51": "adl,5",
			"c52": "noad,0",
			"sd": "20",
			"devtypid": "",
			"pc": "NA",
			"c53": "fef,n",
			"c54": "oad,",
			"c55": "cref3,",
			"c57": "adldf,2",
			"ai": "PostrollAdId1",
			"c3": "st,a",
			"c64": "starttm,1585855260",
			"adid": "PostrollAdId1",
			"c58": "isLive,false",
			"c59": "sesid,UCRG4QETNBPmW832lViDrfcfftB6S1585855212",
			"c61": "createtm,1585855308",
			"c63": "pipMode,",
			"c60": "agfall,~~~~~~~~~~~~~~~~~~~~p10,~~~~~~~~~~~~~~postroll~~~~",
			"c17": "stnid,defaultStationId",
			"c19": "stntype,",
			"c68": "bndlid,",
			"c69": "cvw,0",
			"nodeTM": "",
			"logTM": "",
			"c73": "phtype,",
			"c74": "dvcnm,",
			"c76": "adbsnid,",
			"uoo": "",
			"c44": "progen,",
			"davty": "2",
			"si": "http%3A%2F%2Fengtestsite.com%2Fbsdk%2Ftestsuite%2Ftestharness%2Fsingle%2Findex_eugenia.html%3Fenv%3Dqat4%26file%3DPauseTimeout_GGPM_DCRVideo_PrerollPostroll_PauseTimeoutEvent7GreaterthenPTO.xml%26cdn%3Dstatic-staging1%26nsdkv%3D600_rc%26configEnv%3Dstatic-staging2%26ggcmbVersion%3Dbundled600",
			"c66": "mediaurl,",
			"c62": "sendTime,1585855308",
			"rnd": "815376"
		}
	]
}