{
	"testCaseName": "DV15963_GGPM_DCRVideo_PauseTimeoutNOEvent7.xml",
	"baselineGeneratedDate": "2020-03-11T15:38:36.686Z",
	"testUrl": "http://engtestsite.com/bsdk/testsuite/testharness/single/index_eugenia.html?env=qat4&file=DV15963_GGPM_DCRVideo_PauseTimeoutNOEvent7.xml&cdn=cdn-gl&nsdkv=600&configEnv=static-staging2&ggcmbVersion=bundled600",
	"results": [
		{
			"_baseurl": "https://secure-qat4.imrworldwide.com/cgi-bin/gn",
			"_sentAt": "2020-03-11T15:37:30.074Z",
			"prd": "session",
			"c9": "devid,",
			"c13": "asid,DHG163HR-BH45-JKY6-BKH7-67GJKY68GJK7",
			"sessionId": "N7vZS7cJXIWaYUT2tbNT3w2R83N6F1583941048",
			"c16": "sdkv,bj.6.0.0",
			"uoo": "",
			"retry": "0"
		},
		{
			"_baseurl": "https://secure-qat4.imrworldwide.com/cgi-bin/gn",
			"_sentAt": "2020-03-11T15:37:32.186Z",
			"prd": "dcr",
			"ci": "us-506843",
			"ch": "us-506843_b01_P",
			"asn": "ProgramAsset8",
			"sessionId": "N7vZS7cJXIWaYUT2tbNT3w2R83N6F1583941048",
			"tl": "Skydiving%20Across%20Europe",
			"prv": "1",
			"c6": "vc,b01",
			"ca": "us-506843_b01_204558915992",
			"cg": "latacg",
			"c13": "asid,DHG163HR-BH45-JKY6-BKH7-67GJKY68GJK7",
			"c32": "segA,S07E04%3ANBC",
			"c33": "segB,teams",
			"c34": "segC,AtlanataFalcons",
			"c15": "apn,",
			"plugv": "",
			"playerv": "",
			"sup": "0",
			"segment2": "",
			"segment1": "",
			"forward": "1",
			"ad": "0",
			"cr": "4_00_99_V1_00000",
			"c9": "devid,",
			"enc": "true",
			"c1": "nuid,XqTWnXcwYiLM4eoDL0MvRZIfnHUGS1583941050",
			"at": "view",
			"rt": "video",
			"c16": "sdkv,bj.6.0.0",
			"c27": "cln,0",
			"crs": "",
			"lat": "",
			"lon": "",
			"c29": "plid,15839410485094655",
			"c30": "bldv,6.0.0.474",
			"st": "dcr",
			"c7": "osgrp,",
			"c8": "devgrp,",
			"c10": "plt,",
			"c40": "adbid,",
			"c14": "osver,NA",
			"c26": "dmap,1",
			"dd": "",
			"hrd": "",
			"wkd": "",
			"c35": "adrsid,",
			"c36": "cref1,",
			"c37": "cref2,",
			"c11": "agg,1",
			"c12": "apv,",
			"c51": "adl,0",
			"c52": "noad,0",
			"sd": "600",
			"devtypid": "",
			"pc": "NA",
			"c53": "fef,n",
			"c54": "oad,",
			"c55": "cref3,",
			"c57": "adldf,2",
			"ai": "204558915992",
			"c3": "st,c",
			"c64": "starttm,1583941051",
			"adid": "204558915992",
			"c58": "isLive,false",
			"c59": "sesid,QEL4degzBjZ6aOuDbnAZQrIjt3hdJ1583941052",
			"c61": "createtm,1583941052",
			"c63": "pipMode,",
			"c60": "agfall,~~~~~~~~~~~~~~~~~~~~p10,~~~~~~~~~~~~~~content~~~~",
			"c17": "stnid,defaultStationId",
			"c19": "stntype,",
			"c68": "bndlid,",
			"nodeTM": "",
			"logTM": "",
			"c73": "phtype,",
			"c74": "dvcnm,",
			"c76": "adbsnid,",
			"c77": "adsuprt,2",
			"uoo": "",
			"evdata": "",
			"c71": "ottflg,0",
			"c72": "otttyp,none",
			"c44": "progen,",
			"davty": "0",
			"si": "http%3A%2F%2Fengtestsite.com%2Fbsdk%2Ftestsuite%2Ftestharness%2Fsingle%2Findex_eugenia.html%3Fenv%3Dqat4%26file%3DDV15963_GGPM_DCRVideo_PauseTimeoutNOEvent7.xml%26cdn%3Dcdn-gl%26nsdkv%3D600%26configEnv%3Dstatic-staging2%26ggcmbVersion%3Dbundled600",
			"c66": "mediaurl,",
			"c62": "sendTime,1583941052",
			"rnd": "678326"
		},
		{
			"_baseurl": "https://secure-qat4.imrworldwide.com/cgi-bin/gn",
			"_sentAt": "2020-03-11T15:37:33.217Z",
			"prd": "session",
			"c9": "devid,",
			"c13": "asid,DHG163HR-BH45-JKY6-BKH7-67GJKY68GJK7",
			"sessionId": "N7vZS7cJXIWaYUT2tbNT3w2R83N6F1583941048",
			"c16": "sdkv,bj.6.0.0",
			"uoo": "",
			"retry": "1"
		},
		{
			"_baseurl": "https://secure-qat4.imrworldwide.com/cgi-bin/gn",
			"_sentAt": "2020-03-11T15:37:37.166Z",
			"prd": "dcr",
			"ci": "us-506843",
			"ch": "us-506843_b01_P",
			"asn": "ProgramAsset8",
			"sessionId": "N7vZS7cJXIWaYUT2tbNT3w2R83N6F1583941048",
			"tl": "Skydiving%20Across%20Europe",
			"prv": "1",
			"c6": "vc,b01",
			"ca": "us-506843_b01_204558915992",
			"cg": "latacg",
			"c13": "asid,DHG163HR-BH45-JKY6-BKH7-67GJKY68GJK7",
			"c32": "segA,S07E04%3ANBC",
			"c33": "segB,teams",
			"c34": "segC,AtlanataFalcons",
			"c15": "apn,",
			"plugv": "",
			"playerv": "",
			"sup": "0",
			"segment2": "",
			"segment1": "",
			"forward": "1",
			"ad": "0",
			"cr": "4_00_99_D1_00000",
			"c9": "devid,",
			"enc": "true",
			"c1": "nuid,XqTWnXcwYiLM4eoDL0MvRZIfnHUGS1583941050",
			"at": "timer",
			"rt": "video",
			"c16": "sdkv,bj.6.0.0",
			"c27": "cln,5",
			"crs": "",
			"lat": "",
			"lon": "",
			"c29": "plid,15839410485094655",
			"c30": "bldv,6.0.0.474",
			"st": "dcr",
			"c7": "osgrp,",
			"c8": "devgrp,",
			"c10": "plt,",
			"c40": "adbid,",
			"c14": "osver,NA",
			"c26": "dmap,1",
			"dd": "",
			"hrd": "",
			"wkd": "",
			"c35": "adrsid,",
			"c36": "cref1,",
			"c37": "cref2,",
			"c11": "agg,1",
			"c12": "apv,",
			"c51": "adl,0",
			"c52": "noad,0",
			"sd": "600",
			"devtypid": "",
			"pc": "NA",
			"c53": "fef,n",
			"c54": "oad,",
			"c55": "cref3,",
			"c57": "adldf,2",
			"ai": "204558915992",
			"c3": "st,c",
			"c64": "starttm,1583941051",
			"adid": "204558915992",
			"c58": "isLive,false",
			"c59": "sesid,QEL4degzBjZ6aOuDbnAZQrIjt3hdJ1583941052",
			"c61": "createtm,1583941057",
			"c63": "pipMode,",
			"c60": "agfall,~~~~~~~~~~~~~~~~~~~~p10,~~~~~~~~~~~~~~content~~~~",
			"c17": "stnid,defaultStationId",
			"c19": "stntype,",
			"c68": "bndlid,",
			"nodeTM": "",
			"logTM": "",
			"c73": "phtype,",
			"c74": "dvcnm,",
			"c76": "adbsnid,",
			"c77": "adsuprt,2",
			"uoo": "",
			"evdata": "PL%3A1583941051%3A0",
			"c71": "ottflg,0",
			"c72": "otttyp,none",
			"c44": "progen,",
			"davty": "1",
			"si": "http%3A%2F%2Fengtestsite.com%2Fbsdk%2Ftestsuite%2Ftestharness%2Fsingle%2Findex_eugenia.html%3Fenv%3Dqat4%26file%3DDV15963_GGPM_DCRVideo_PauseTimeoutNOEvent7.xml%26cdn%3Dcdn-gl%26nsdkv%3D600%26configEnv%3Dstatic-staging2%26ggcmbVersion%3Dbundled600",
			"c66": "mediaurl,",
			"c62": "sendTime,1583941057",
			"rnd": "606197"
		},
		{
			"_baseurl": "https://secure-qat4.imrworldwide.com/cgi-bin/gn",
			"_sentAt": "2020-03-11T15:38:07.530Z",
			"prd": "dcr",
			"ci": "us-506843",
			"ch": "us-506843_b01_P",
			"asn": "ProgramAsset8",
			"sessionId": "N7vZS7cJXIWaYUT2tbNT3w2R83N6F1583941048",
			"tl": "Skydiving%20Across%20Europe",
			"prv": "1",
			"c6": "vc,b01",
			"ca": "us-506843_b01_204558915992",
			"cg": "latacg",
			"c13": "asid,DHG163HR-BH45-JKY6-BKH7-67GJKY68GJK7",
			"c32": "segA,S07E04%3ANBC",
			"c33": "segB,teams",
			"c34": "segC,AtlanataFalcons",
			"c15": "apn,",
			"plugv": "",
			"playerv": "",
			"sup": "0",
			"segment2": "",
			"segment1": "",
			"forward": "1",
			"ad": "0",
			"cr": "4_00_99_D1_00000",
			"c9": "devid,",
			"enc": "true",
			"c1": "nuid,XqTWnXcwYiLM4eoDL0MvRZIfnHUGS1583941050",
			"at": "timer",
			"rt": "video",
			"c16": "sdkv,bj.6.0.0",
			"c27": "cln,0",
			"crs": "",
			"lat": "",
			"lon": "",
			"c29": "plid,15839410485094655",
			"c30": "bldv,6.0.0.474",
			"st": "dcr",
			"c7": "osgrp,",
			"c8": "devgrp,",
			"c10": "plt,",
			"c40": "adbid,",
			"c14": "osver,NA",
			"c26": "dmap,1",
			"dd": "",
			"hrd": "",
			"wkd": "",
			"c35": "adrsid,",
			"c36": "cref1,",
			"c37": "cref2,",
			"c11": "agg,1",
			"c12": "apv,",
			"c51": "adl,0",
			"c52": "noad,0",
			"sd": "600",
			"devtypid": "",
			"pc": "NA",
			"c53": "fef,n",
			"c54": "oad,",
			"c55": "cref3,",
			"c57": "adldf,2",
			"ai": "204558915992",
			"c3": "st,c",
			"c64": "starttm,1583941057",
			"adid": "204558915992",
			"c58": "isLive,false",
			"c59": "sesid,QEL4degzBjZ6aOuDbnAZQrIjt3hdJ1583941052",
			"c61": "createtm,1583941087",
			"c63": "pipMode,",
			"c60": "agfall,~~~~~~~~~~~~~~~~~~~~p10,~~~~~~~~~~~~~~content~~~~",
			"c17": "stnid,defaultStationId",
			"c19": "stntype,",
			"c68": "bndlid,",
			"nodeTM": "",
			"logTM": "",
			"c73": "phtype,",
			"c74": "dvcnm,",
			"c76": "adbsnid,",
			"c77": "adsuprt,2",
			"uoo": "",
			"evdata": "PU%3A1583941056%3A5~ST%3A1583941088%3A5",
			"c71": "ottflg,0",
			"c72": "otttyp,none",
			"c44": "progen,",
			"davty": "2",
			"si": "http%3A%2F%2Fengtestsite.com%2Fbsdk%2Ftestsuite%2Ftestharness%2Fsingle%2Findex_eugenia.html%3Fenv%3Dqat4%26file%3DDV15963_GGPM_DCRVideo_PauseTimeoutNOEvent7.xml%26cdn%3Dcdn-gl%26nsdkv%3D600%26configEnv%3Dstatic-staging2%26ggcmbVersion%3Dbundled600",
			"c66": "mediaurl,",
			"c62": "sendTime,1583941087",
			"rnd": "404252"
		},
		{
			"_baseurl": "https://secure-qat4.imrworldwide.com/cgi-bin/gn",
			"_sentAt": "2020-03-11T15:38:17.578Z",
			"prd": "dcr",
			"ci": "us-506843",
			"ch": "us-506843_b01_P",
			"asn": "ProgramAsset8",
			"sessionId": "N7vZS7cJXIWaYUT2tbNT3w2R83N6F1583941048",
			"tl": "Skydiving%20Across%20Europe",
			"prv": "1",
			"c6": "vc,b01",
			"ca": "us-506843_b01_204558915992",
			"cg": "latacg",
			"c13": "asid,DHG163HR-BH45-JKY6-BKH7-67GJKY68GJK7",
			"c32": "segA,S07E04%3ANBC",
			"c33": "segB,teams",
			"c34": "segC,AtlanataFalcons",
			"c15": "apn,",
			"plugv": "",
			"playerv": "",
			"sup": "0",
			"segment2": "",
			"segment1": "",
			"forward": "1",
			"ad": "0",
			"cr": "4_00_99_V1_00000",
			"c9": "devid,",
			"enc": "true",
			"c1": "nuid,XqTWnXcwYiLM4eoDL0MvRZIfnHUGS1583941050",
			"at": "view",
			"rt": "video",
			"c16": "sdkv,bj.6.0.0",
			"c27": "cln,0",
			"crs": "",
			"lat": "",
			"lon": "",
			"c29": "plid,15839410485094655",
			"c30": "bldv,6.0.0.474",
			"st": "dcr",
			"c7": "osgrp,",
			"c8": "devgrp,",
			"c10": "plt,",
			"c40": "adbid,",
			"c14": "osver,NA",
			"c26": "dmap,1",
			"dd": "",
			"hrd": "",
			"wkd": "",
			"c35": "adrsid,",
			"c36": "cref1,",
			"c37": "cref2,",
			"c11": "agg,1",
			"c12": "apv,",
			"c51": "adl,0",
			"c52": "noad,0",
			"sd": "600",
			"devtypid": "",
			"pc": "NA",
			"c53": "fef,n",
			"c54": "oad,",
			"c55": "cref3,",
			"c57": "adldf,2",
			"ai": "204558915992",
			"c3": "st,c",
			"c64": "starttm,1583941098",
			"adid": "204558915992",
			"c58": "isLive,false",
			"c59": "sesid,H7swlV3nFu9LGL6rDgqqmC034wlyb1583941097",
			"c61": "createtm,1583941097",
			"c63": "pipMode,",
			"c60": "agfall,~~~~~~~~~~~~~~~~~~~~p10,~~~~~~~~~~~~~~content~~~~",
			"c17": "stnid,defaultStationId",
			"c19": "stntype,",
			"c68": "bndlid,",
			"nodeTM": "",
			"logTM": "",
			"c73": "phtype,",
			"c74": "dvcnm,",
			"c76": "adbsnid,",
			"c77": "adsuprt,2",
			"uoo": "",
			"evdata": "",
			"c71": "ottflg,0",
			"c72": "otttyp,none",
			"c44": "progen,",
			"davty": "0",
			"si": "http%3A%2F%2Fengtestsite.com%2Fbsdk%2Ftestsuite%2Ftestharness%2Fsingle%2Findex_eugenia.html%3Fenv%3Dqat4%26file%3DDV15963_GGPM_DCRVideo_PauseTimeoutNOEvent7.xml%26cdn%3Dcdn-gl%26nsdkv%3D600%26configEnv%3Dstatic-staging2%26ggcmbVersion%3Dbundled600",
			"c66": "mediaurl,",
			"c62": "sendTime,1583941097",
			"rnd": "545910"
		},
		{
			"_baseurl": "https://secure-qat4.imrworldwide.com/cgi-bin/gn",
			"_sentAt": "2020-03-11T15:38:30.558Z",
			"prd": "dcr",
			"ci": "us-506843",
			"ch": "us-506843_b01_P",
			"asn": "ProgramAsset8",
			"sessionId": "N7vZS7cJXIWaYUT2tbNT3w2R83N6F1583941048",
			"tl": "Skydiving%20Across%20Europe",
			"prv": "1",
			"c6": "vc,b01",
			"ca": "us-506843_b01_204558915992",
			"cg": "latacg",
			"c13": "asid,DHG163HR-BH45-JKY6-BKH7-67GJKY68GJK7",
			"c32": "segA,S07E04%3ANBC",
			"c33": "segB,teams",
			"c34": "segC,AtlanataFalcons",
			"c15": "apn,",
			"plugv": "",
			"playerv": "",
			"sup": "0",
			"segment2": "",
			"segment1": "",
			"forward": "1",
			"ad": "0",
			"cr": "4_00_99_D1_00000",
			"c9": "devid,",
			"enc": "true",
			"c1": "nuid,XqTWnXcwYiLM4eoDL0MvRZIfnHUGS1583941050",
			"at": "timer",
			"rt": "video",
			"c16": "sdkv,bj.6.0.0",
			"c27": "cln,10",
			"crs": "",
			"lat": "",
			"lon": "",
			"c29": "plid,15839410485094655",
			"c30": "bldv,6.0.0.474",
			"st": "dcr",
			"c7": "osgrp,",
			"c8": "devgrp,",
			"c10": "plt,",
			"c40": "adbid,",
			"c14": "osver,NA",
			"c26": "dmap,1",
			"dd": "",
			"hrd": "",
			"wkd": "",
			"c35": "adrsid,",
			"c36": "cref1,",
			"c37": "cref2,",
			"c11": "agg,1",
			"c12": "apv,",
			"c51": "adl,0",
			"c52": "noad,0",
			"sd": "600",
			"devtypid": "",
			"pc": "NA",
			"c53": "fef,n",
			"c54": "oad,",
			"c55": "cref3,",
			"c57": "adldf,2",
			"ai": "204558915992",
			"c3": "st,c",
			"c64": "starttm,1583941098",
			"adid": "204558915992",
			"c58": "isLive,false",
			"c59": "sesid,H7swlV3nFu9LGL6rDgqqmC034wlyb1583941097",
			"c61": "createtm,1583941110",
			"c63": "pipMode,",
			"c60": "agfall,~~~~~~~~~~~~~~~~~~~~p10,~~~~~~~~~~~~~~content~~~~",
			"c17": "stnid,defaultStationId",
			"c19": "stntype,",
			"c68": "bndlid,",
			"nodeTM": "",
			"logTM": "",
			"c73": "phtype,",
			"c74": "dvcnm,",
			"c76": "adbsnid,",
			"c77": "adsuprt,2",
			"uoo": "",
			"evdata": "PL%3A1583941098%3A6",
			"c71": "ottflg,0",
			"c72": "otttyp,none",
			"c44": "progen,",
			"davty": "2",
			"si": "http%3A%2F%2Fengtestsite.com%2Fbsdk%2Ftestsuite%2Ftestharness%2Fsingle%2Findex_eugenia.html%3Fenv%3Dqat4%26file%3DDV15963_GGPM_DCRVideo_PauseTimeoutNOEvent7.xml%26cdn%3Dcdn-gl%26nsdkv%3D600%26configEnv%3Dstatic-staging2%26ggcmbVersion%3Dbundled600",
			"c66": "mediaurl,",
			"c62": "sendTime,1583941110",
			"rnd": "655902"
		}
	]
}