{
	"testCaseName": "GGpm_mTVR_AQH_fast_forward_within_Quater.xml",
	"baselineGeneratedDate": "2020-04-17T21:41:47.483Z",
	"testUrl": "http://engtestsite.com/bsdk/testsuite/testharness/single/index_eugenia.html?env=qat4&file=GGpm_mTVR_AQH_fast_forward_within_Quater.xml&cdn=cdn-gl&nsdkv=600&configEnv=static-staging2&ggcmbVersion=bundled600",
	"results": [
		{
			"_baseurl": "https://secure-qat4.imrworldwide.com/cgi-bin/gn",
			"_sentAt": "2020-04-17T21:35:35.035Z",
			"prd": "session",
			"c9": "devid,",
			"c13": "asid,DHG163HR-BH45-JKY6-BKH7-67GJKY68GJK7",
			"sessionId": "kjqLSaDCvUNMvIQkQDeNnRnhuKVFE1587159334",
			"c16": "sdkv,bj.6.0.0",
			"uoo": "",
			"retry": "0"
		},
		{
			"_baseurl": "https://secure-qat4.imrworldwide.com/cgi-bin/tsv",
			"_sentAt": "2020-04-17T21:35:38.865Z",
			"id3": "www.nielsen.com/X100zdCIGeIlgZnkYj6UvQ",
			"fmt": "json",
			"pli": "15871593348059134",
			"segment1": "",
			"segment2": "",
			"tsvevt": "tsvupdate",
			"nmspc": "NOLBUNDLE"
		},
		{
			"_baseurl": "https://secure-qat4.imrworldwide.com/cgi-bin/d",
			"_sentAt": "2020-04-17T21:35:39.036Z",
			"ci": "us-506843",
			"sessionId": "kjqLSaDCvUNMvIQkQDeNnRnhuKVFE1587159334",
			"c29": "plid,15871593348059134",
			"c30": "bldv,6.0.0.474",
			"davty": "0",
			"forward": "1",
			"c6": "mtvr,b01",
			"ca": "FD_LL-La28siY_RNousaZvt0Q",
			"pc": "DHG163HR-BH45-JKY6-BKH7-67GJKY68GJK7",
			"cr": "2_00_90_I1_00000_0",
			"segment1": "",
			"segment2": "",
			"c9": "devid,",
			"c8": "devgrp,",
			"c7": "osgrp,",
			"c1": "nuid,BZQMhnIV76Vw90Fipw5J4HRq6bAUM1587159335",
			"c10": "plt,",
			"plugv": "",
			"playerv": "",
			"c11": "agg,1",
			"c12": "apv,",
			"c13": "asid,DHG163HR-BH45-JKY6-BKH7-67GJKY68GJK7",
			"c15": "apn,",
			"c16": "sdkv,bj.6.0.0",
			"c14": "osver,NA",
			"h33": "2",
			"c26": "dmap,3",
			"c27": "cln,0",
			"at": "start",
			"rt": "video",
			"st": "mtvr",
			"vn": "1",
			"c24": "zip,99",
			"dd": "",
			"hrd": "",
			"wkd": "",
			"uoo": "",
			"c68": "bndlid,",
			"c61": "createtm,1587159339",
			"nodeTM": "",
			"logTM": "",
			"c73": "phtype,",
			"c74": "dvcnm,",
			"c62": "sendTime,1587159339",
			"rnd": "432111"
		},
		{
			"_baseurl": "https://secure-qat4.imrworldwide.com/cgi-bin/tsv",
			"_sentAt": "2020-04-17T21:36:07.828Z",
			"id3": "www.nielsen.com/X100zdCIGeIlgZnkYj6UvQ",
			"fmt": "json",
			"pli": "15871593348059134",
			"segment1": "",
			"segment2": "",
			"tsvevt": "tsvupdate",
			"nmspc": "NOLBUNDLE"
		},
		{
			"_baseurl": "https://secure-qat4.imrworldwide.com/cgi-bin/d",
			"_sentAt": "2020-04-17T21:36:07.883Z",
			"ci": "us-506843",
			"sessionId": "kjqLSaDCvUNMvIQkQDeNnRnhuKVFE1587159334",
			"c29": "plid,15871593348059134",
			"c30": "bldv,6.0.0.474",
			"davty": "1",
			"forward": "1",
			"c6": "mtvr,b01",
			"ca": "FD_LL-La28siY_RNousaZvt0Q",
			"pc": "DHG163HR-BH45-JKY6-BKH7-67GJKY68GJK7",
			"cr": "2_00_90_V1_00000_0",
			"segment1": "",
			"segment2": "",
			"c9": "devid,",
			"c8": "devgrp,",
			"c7": "osgrp,",
			"c1": "nuid,BZQMhnIV76Vw90Fipw5J4HRq6bAUM1587159335",
			"c10": "plt,",
			"plugv": "",
			"playerv": "",
			"c11": "agg,1",
			"c12": "apv,",
			"c13": "asid,DHG163HR-BH45-JKY6-BKH7-67GJKY68GJK7",
			"c15": "apn,",
			"c16": "sdkv,bj.6.0.0",
			"c14": "osver,NA",
			"h33": "2",
			"c26": "dmap,3",
			"c27": "cln,30",
			"at": "view",
			"rt": "video",
			"st": "mtvr",
			"vn": "1",
			"c24": "zip,99",
			"dd": "",
			"hrd": "",
			"wkd": "",
			"uoo": "",
			"c68": "bndlid,",
			"c61": "createtm,1587159367",
			"nodeTM": "",
			"logTM": "",
			"c73": "phtype,",
			"c74": "dvcnm,",
			"c62": "sendTime,1587159367",
			"rnd": "907417"
		},
		{
			"_baseurl": "https://secure-qat4.imrworldwide.com/cgi-bin/d",
			"_sentAt": "2020-04-17T21:36:07.893Z",
			"ci": "us-506843",
			"sessionId": "kjqLSaDCvUNMvIQkQDeNnRnhuKVFE1587159334",
			"c29": "plid,15871593348059134",
			"c30": "bldv,6.0.0.474",
			"davty": "1",
			"forward": "1",
			"c6": "mtvr,b01",
			"ca": "FD_LL-La28siY_RNousaZvt0Q",
			"pc": "DHG163HR-BH45-JKY6-BKH7-67GJKY68GJK7",
			"cr": "2_00_98_D1_10000_0",
			"segment1": "",
			"segment2": "",
			"c9": "devid,",
			"c8": "devgrp,",
			"c7": "osgrp,",
			"c1": "nuid,BZQMhnIV76Vw90Fipw5J4HRq6bAUM1587159335",
			"c10": "plt,",
			"plugv": "",
			"playerv": "",
			"c11": "agg,1",
			"c12": "apv,",
			"c13": "asid,DHG163HR-BH45-JKY6-BKH7-67GJKY68GJK7",
			"c15": "apn,",
			"c16": "sdkv,bj.6.0.0",
			"c14": "osver,NA",
			"h33": "2",
			"c26": "dmap,3",
			"c27": "cln,30",
			"at": "timer",
			"rt": "video",
			"st": "mtvr",
			"vn": "1",
			"c24": "zip,99",
			"dd": "",
			"hrd": "",
			"wkd": "",
			"uoo": "",
			"c68": "bndlid,",
			"c61": "createtm,1587159367",
			"nodeTM": "",
			"logTM": "",
			"c73": "phtype,",
			"c74": "dvcnm,",
			"c62": "sendTime,1587159367",
			"rnd": "580520"
		},
		{
			"_baseurl": "https://secure-qat4.imrworldwide.com/cgi-bin/trans",
			"_sentAt": "2020-04-17T21:36:27.851Z",
			"ci": "us-506843",
			"sessionId": "kjqLSaDCvUNMvIQkQDeNnRnhuKVFE1587159334",
			"forward": "1",
			"pc": "DHG163HR-BH45-JKY6-BKH7-67GJKY68GJK7",
			"c6": "id3,b01",
			"segment1": "",
			"segment2": "",
			"c9": "devid,",
			"c8": "devgrp,",
			"c7": "osgrp,",
			"c1": "nuid,BZQMhnIV76Vw90Fipw5J4HRq6bAUM1587159335",
			"c10": "plt,",
			"c14": "osver,NA",
			"tp": "0:S:99:1587159339,www.nielsen.com/X100zdCIGeIlgZnkYj6UvQ",
			"channame": "defaultChannelName",
			"h33": "2",
			"c26": "dmap,3",
			"uoo": "",
			"c68": "bndlid,",
			"c61": "createtm,1587159387",
			"plugv": "",
			"playerv": "",
			"nodeTM": "",
			"logTM": "",
			"c73": "phtype,",
			"c74": "dvcnm,",
			"c62": "sendTime,1587159387",
			"rnd": "963110"
		},
		{
			"_baseurl": "https://secure-qat4.imrworldwide.com/cgi-bin/trans",
			"_sentAt": "2020-04-17T21:37:27.864Z",
			"ci": "us-506843",
			"sessionId": "kjqLSaDCvUNMvIQkQDeNnRnhuKVFE1587159334",
			"forward": "1",
			"pc": "DHG163HR-BH45-JKY6-BKH7-67GJKY68GJK7",
			"c6": "id3,b01",
			"segment1": "",
			"segment2": "",
			"c9": "devid,",
			"c8": "devgrp,",
			"c7": "osgrp,",
			"c1": "nuid,BZQMhnIV76Vw90Fipw5J4HRq6bAUM1587159335",
			"c10": "plt,",
			"c14": "osver,NA",
			"tp": "1:S:90:1587159398,www.nielsen.com/X100zdCIGeIlgZnkYj6UvQ",
			"channame": "defaultChannelName",
			"h33": "2",
			"c26": "dmap,3",
			"uoo": "",
			"c68": "bndlid,",
			"c61": "createtm,1587159447",
			"plugv": "",
			"playerv": "",
			"nodeTM": "",
			"logTM": "",
			"c73": "phtype,",
			"c74": "dvcnm,",
			"c62": "sendTime,1587159447",
			"rnd": "125828"
		},
		{
			"_baseurl": "https://secure-qat4.imrworldwide.com/cgi-bin/trans",
			"_sentAt": "2020-04-17T21:38:27.873Z",
			"ci": "us-506843",
			"sessionId": "kjqLSaDCvUNMvIQkQDeNnRnhuKVFE1587159334",
			"forward": "1",
			"pc": "DHG163HR-BH45-JKY6-BKH7-67GJKY68GJK7",
			"c6": "id3,b01",
			"segment1": "",
			"segment2": "",
			"c9": "devid,",
			"c8": "devgrp,",
			"c7": "osgrp,",
			"c1": "nuid,BZQMhnIV76Vw90Fipw5J4HRq6bAUM1587159335",
			"c10": "plt,",
			"c14": "osver,NA",
			"tp": "2:S:90:1587159458,www.nielsen.com/X100zdCIGeIlgZnkYj6UvQ",
			"channame": "defaultChannelName",
			"h33": "2",
			"c26": "dmap,3",
			"uoo": "",
			"c68": "bndlid,",
			"c61": "createtm,1587159507",
			"plugv": "",
			"playerv": "",
			"nodeTM": "",
			"logTM": "",
			"c73": "phtype,",
			"c74": "dvcnm,",
			"c62": "sendTime,1587159507",
			"rnd": "487129"
		},
		{
			"_baseurl": "https://secure-qat4.imrworldwide.com/cgi-bin/tsv",
			"_sentAt": "2020-04-17T21:38:47.825Z",
			"id3": "www.nielsen.com/X100zdCIGeIlgZnkYj6UvQ",
			"fmt": "json",
			"pli": "15871593348059134",
			"segment1": "",
			"segment2": "",
			"tsvevt": "tsvupdate",
			"nmspc": "NOLBUNDLE"
		},
		{
			"_baseurl": "https://secure-qat4.imrworldwide.com/cgi-bin/d",
			"_sentAt": "2020-04-17T21:38:48.240Z",
			"ci": "us-506843",
			"sessionId": "kjqLSaDCvUNMvIQkQDeNnRnhuKVFE1587159334",
			"c29": "plid,15871593348059134",
			"c30": "bldv,6.0.0.474",
			"davty": "1",
			"forward": "1",
			"c6": "mtvr,b01",
			"ca": "FD_LL-La28siY_RNousaZvt0Q",
			"pc": "DHG163HR-BH45-JKY6-BKH7-67GJKY68GJK7",
			"cr": "2_00_98_D1_01100_0",
			"segment1": "",
			"segment2": "",
			"c9": "devid,",
			"c8": "devgrp,",
			"c7": "osgrp,",
			"c1": "nuid,BZQMhnIV76Vw90Fipw5J4HRq6bAUM1587159335",
			"c10": "plt,",
			"plugv": "",
			"playerv": "",
			"c11": "agg,1",
			"c12": "apv,",
			"c13": "asid,DHG163HR-BH45-JKY6-BKH7-67GJKY68GJK7",
			"c15": "apn,",
			"c16": "sdkv,bj.6.0.0",
			"c14": "osver,NA",
			"h33": "2",
			"c26": "dmap,3",
			"c27": "cln,150",
			"at": "timer",
			"rt": "video",
			"st": "mtvr",
			"vn": "1",
			"c24": "zip,99",
			"dd": "",
			"hrd": "",
			"wkd": "",
			"uoo": "",
			"c68": "bndlid,",
			"c61": "createtm,1587159528",
			"nodeTM": "",
			"logTM": "",
			"c73": "phtype,",
			"c74": "dvcnm,",
			"c62": "sendTime,1587159528",
			"rnd": "460080"
		},
		{
			"_baseurl": "https://secure-qat4.imrworldwide.com/cgi-bin/trans",
			"_sentAt": "2020-04-17T21:39:08.881Z",
			"ci": "us-506843",
			"sessionId": "kjqLSaDCvUNMvIQkQDeNnRnhuKVFE1587159334",
			"forward": "1",
			"pc": "DHG163HR-BH45-JKY6-BKH7-67GJKY68GJK7",
			"c6": "id3,b01",
			"segment1": "",
			"segment2": "",
			"c9": "devid,",
			"c8": "devgrp,",
			"c7": "osgrp,",
			"c1": "nuid,BZQMhnIV76Vw90Fipw5J4HRq6bAUM1587159335",
			"c10": "plt,",
			"c14": "osver,NA",
			"tp": "3:S:90:1587159518,www.nielsen.com/X100zdCIGeIlgZnkYj6UvQ",
			"channame": "defaultChannelName",
			"h33": "2",
			"c26": "dmap,3",
			"uoo": "",
			"c68": "bndlid,",
			"c61": "createtm,1587159548",
			"plugv": "",
			"playerv": "",
			"nodeTM": "",
			"logTM": "",
			"c73": "phtype,",
			"c74": "dvcnm,",
			"c62": "sendTime,1587159548",
			"rnd": "787919"
		},
		{
			"_baseurl": "https://secure-qat4.imrworldwide.com/cgi-bin/trans",
			"_sentAt": "2020-04-17T21:40:07.889Z",
			"ci": "us-506843",
			"sessionId": "kjqLSaDCvUNMvIQkQDeNnRnhuKVFE1587159334",
			"forward": "1",
			"pc": "DHG163HR-BH45-JKY6-BKH7-67GJKY68GJK7",
			"c6": "id3,b01",
			"segment1": "",
			"segment2": "",
			"c9": "devid,",
			"c8": "devgrp,",
			"c7": "osgrp,",
			"c1": "nuid,BZQMhnIV76Vw90Fipw5J4HRq6bAUM1587159335",
			"c10": "plt,",
			"c14": "osver,NA",
			"tp": "4:S:90:1587159558,www.nielsen.com/X100zdCIGeIlgZnkYj6UvQ",
			"channame": "defaultChannelName",
			"h33": "2",
			"c26": "dmap,3",
			"uoo": "",
			"c68": "bndlid,",
			"c61": "createtm,1587159607",
			"plugv": "",
			"playerv": "",
			"nodeTM": "",
			"logTM": "",
			"c73": "phtype,",
			"c74": "dvcnm,",
			"c62": "sendTime,1587159607",
			"rnd": "900855"
		},
		{
			"_baseurl": "https://secure-qat4.imrworldwide.com/cgi-bin/tsv",
			"_sentAt": "2020-04-17T21:41:07.807Z",
			"id3": "www.nielsen.com/X100zdCIGeIlgZnkYj6UvQ",
			"fmt": "json",
			"pli": "15871593348059134",
			"segment1": "",
			"segment2": "",
			"tsvevt": "tsvupdate",
			"nmspc": "NOLBUNDLE"
		},
		{
			"_baseurl": "https://secure-qat4.imrworldwide.com/cgi-bin/trans",
			"_sentAt": "2020-04-17T21:41:07.827Z",
			"ci": "us-506843",
			"sessionId": "kjqLSaDCvUNMvIQkQDeNnRnhuKVFE1587159334",
			"forward": "1",
			"pc": "DHG163HR-BH45-JKY6-BKH7-67GJKY68GJK7",
			"c6": "id3,b01",
			"segment1": "",
			"segment2": "",
			"c9": "devid,",
			"c8": "devgrp,",
			"c7": "osgrp,",
			"c1": "nuid,BZQMhnIV76Vw90Fipw5J4HRq6bAUM1587159335",
			"c10": "plt,",
			"c14": "osver,NA",
			"tp": "5:S:90:1587159618,www.nielsen.com/X100zdCIGeIlgZnkYj6UvQ",
			"channame": "defaultChannelName",
			"h33": "2",
			"c26": "dmap,3",
			"uoo": "",
			"c68": "bndlid,",
			"c61": "createtm,1587159667",
			"plugv": "",
			"playerv": "",
			"nodeTM": "",
			"logTM": "",
			"c73": "phtype,",
			"c74": "dvcnm,",
			"c62": "sendTime,1587159667",
			"rnd": "274513"
		},
		{
			"_baseurl": "https://secure-qat4.imrworldwide.com/cgi-bin/d",
			"_sentAt": "2020-04-17T21:41:08.096Z",
			"ci": "us-506843",
			"sessionId": "kjqLSaDCvUNMvIQkQDeNnRnhuKVFE1587159334",
			"c29": "plid,15871593348059134",
			"c30": "bldv,6.0.0.474",
			"davty": "1",
			"forward": "1",
			"c6": "mtvr,b01",
			"ca": "FD_LL-La28siY_RNousaZvt0Q",
			"pc": "DHG163HR-BH45-JKY6-BKH7-67GJKY68GJK7",
			"cr": "2_00_98_D1_00011_0",
			"segment1": "",
			"segment2": "",
			"c9": "devid,",
			"c8": "devgrp,",
			"c7": "osgrp,",
			"c1": "nuid,BZQMhnIV76Vw90Fipw5J4HRq6bAUM1587159335",
			"c10": "plt,",
			"plugv": "",
			"playerv": "",
			"c11": "agg,1",
			"c12": "apv,",
			"c13": "asid,DHG163HR-BH45-JKY6-BKH7-67GJKY68GJK7",
			"c15": "apn,",
			"c16": "sdkv,bj.6.0.0",
			"c14": "osver,NA",
			"h33": "2",
			"c26": "dmap,3",
			"c27": "cln,149",
			"at": "timer",
			"rt": "video",
			"st": "mtvr",
			"vn": "1",
			"c24": "zip,99",
			"dd": "",
			"hrd": "",
			"wkd": "",
			"uoo": "",
			"c68": "bndlid,",
			"c61": "createtm,1587159668",
			"nodeTM": "",
			"logTM": "",
			"c73": "phtype,",
			"c74": "dvcnm,",
			"c62": "sendTime,1587159668",
			"rnd": "524196"
		},
		{
			"_baseurl": "https://secure-qat4.imrworldwide.com/cgi-bin/d",
			"_sentAt": "2020-04-17T21:41:41.850Z",
			"ci": "us-506843",
			"sessionId": "kjqLSaDCvUNMvIQkQDeNnRnhuKVFE1587159334",
			"c29": "plid,15871593348059134",
			"c30": "bldv,6.0.0.474",
			"davty": "2",
			"forward": "1",
			"c6": "mtvr,b01",
			"ca": "FD_LL-La28siY_RNousaZvt0Q",
			"pc": "DHG163HR-BH45-JKY6-BKH7-67GJKY68GJK7",
			"cr": "2_00_98_D2_10000_0",
			"segment1": "",
			"segment2": "",
			"c9": "devid,",
			"c8": "devgrp,",
			"c7": "osgrp,",
			"c1": "nuid,BZQMhnIV76Vw90Fipw5J4HRq6bAUM1587159335",
			"c10": "plt,",
			"plugv": "",
			"playerv": "",
			"c11": "agg,1",
			"c12": "apv,",
			"c13": "asid,DHG163HR-BH45-JKY6-BKH7-67GJKY68GJK7",
			"c15": "apn,",
			"c16": "sdkv,bj.6.0.0",
			"c14": "osver,NA",
			"h33": "2",
			"c26": "dmap,3",
			"c27": "cln,31",
			"at": "timer",
			"rt": "video",
			"st": "mtvr",
			"vn": "1",
			"c24": "zip,99",
			"dd": "",
			"hrd": "",
			"wkd": "",
			"uoo": "",
			"c68": "bndlid,",
			"c61": "createtm,1587159701",
			"nodeTM": "",
			"logTM": "",
			"c73": "phtype,",
			"c74": "dvcnm,",
			"c62": "sendTime,1587159701",
			"rnd": "206731"
		},
		{
			"_baseurl": "https://secure-qat4.imrworldwide.com/cgi-bin/trans",
			"_sentAt": "2020-04-17T21:41:41.853Z",
			"ci": "us-506843",
			"sessionId": "kjqLSaDCvUNMvIQkQDeNnRnhuKVFE1587159334",
			"forward": "1",
			"pc": "DHG163HR-BH45-JKY6-BKH7-67GJKY68GJK7",
			"c6": "id3,b01",
			"segment1": "",
			"segment2": "",
			"c9": "devid,",
			"c8": "devgrp,",
			"c7": "osgrp,",
			"c1": "nuid,BZQMhnIV76Vw90Fipw5J4HRq6bAUM1587159335",
			"c10": "plt,",
			"c14": "osver,NA",
			"tp": "6:S:90:1587159678,www.nielsen.com/X100zdCIGeIlgZnkYj6UvQ",
			"channame": "defaultChannelName",
			"h33": "2",
			"c26": "dmap,3",
			"uoo": "",
			"c68": "bndlid,",
			"c61": "createtm,1587159701",
			"plugv": "",
			"playerv": "",
			"nodeTM": "",
			"logTM": "",
			"c73": "phtype,",
			"c74": "dvcnm,",
			"c62": "sendTime,1587159701",
			"rnd": "711935"
		},
		{
			"_baseurl": "https://secure-qat4.imrworldwide.com/cgi-bin/trans",
			"_sentAt": "2020-04-17T21:41:42.511Z",
			"ci": "us-506843",
			"sessionId": "kjqLSaDCvUNMvIQkQDeNnRnhuKVFE1587159334",
			"forward": "1",
			"pc": "DHG163HR-BH45-JKY6-BKH7-67GJKY68GJK7",
			"c6": "id3,b01",
			"segment1": "",
			"segment2": "",
			"c9": "devid,",
			"c8": "devgrp,",
			"c7": "osgrp,",
			"c1": "nuid,BZQMhnIV76Vw90Fipw5J4HRq6bAUM1587159335",
			"c10": "plt,",
			"c14": "osver,NA",
			"tp": "false",
			"channame": "defaultChannelName",
			"h33": "2",
			"c26": "dmap,3",
			"uoo": "",
			"c68": "bndlid,",
			"c61": "createtm,1587159702",
			"plugv": "",
			"playerv": "",
			"nodeTM": "",
			"logTM": "",
			"c73": "phtype,",
			"c74": "dvcnm,",
			"c62": "sendTime,1587159702",
			"rnd": "561184"
		}
	]
}