{
	"testCaseName": "REGRESSION_BSDK_GGPM_DTVR_RTVOD_Midstream_PCFD07_rewindSameSegment.xml",
	"baselineGeneratedDate": "2020-02-19T20:05:42.357Z",
	"testUrl": "http://engtestsite.com/bsdk/testsuite/testharness/single/index_eugenia.html?env=qat4&file=REGRESSION_BSDK_GGPM_DTVR_RTVOD_Midstream_PCFD07_rewindSameSegment.xml&cdn=cdn-gl&nsdkv=600&configEnv=static-staging2&ggcmbVersion=bundled600",
	"results": [
		{
			"_baseurl": "https://secure-qat4.imrworldwide.com/cgi-bin/gn",
			"_sentAt": "2020-02-19T19:58:00.685Z",
			"prd": "session",
			"c9": "devid,",
			"c13": "asid,DHG163HR-BH45-JKY6-BKH7-67GJKY68GJK7",
			"sessionId": "NwbyK9BWQDsgzXCPtKSRsZ8qnkCHa1582142280",
			"c16": "sdkv,bj.6.0.0",
			"uoo": "",
			"retry": "0"
		},
		{
			"_baseurl": "https://secure-qat4.imrworldwide.com/cgi-bin/tsv",
			"_sentAt": "2020-02-19T19:58:04.528Z",
			"id3": "www.nielsen.com/sLK6sS1v0IKGqf3n2TRNwA",
			"fmt": "json",
			"pli": "15821422804608886",
			"segment1": "",
			"segment2": "",
			"tsvevt": "tsvupdate",
			"nmspc": "NOLBUNDLE"
		},
		{
			"_baseurl": "https://secure-qat4.imrworldwide.com/cgi-bin/d",
			"_sentAt": "2020-02-19T19:58:04.639Z",
			"ci": "us-506843",
			"sessionId": "NwbyK9BWQDsgzXCPtKSRsZ8qnkCHa1582142280",
			"c29": "plid,15821422804608886",
			"c30": "bldv,6.0.0.474",
			"davty": "0",
			"forward": "0",
			"c6": "mtvr,b01",
			"ca": "PC_sLK6sS1v0IKGqf3n2TRNwA",
			"pc": "DHG163HR-BH45-JKY6-BKH7-67GJKY68GJK7",
			"cr": "2_00_99_I121_00000_0",
			"segment1": "",
			"segment2": "",
			"c9": "devid,",
			"c8": "devgrp,",
			"c7": "osgrp,",
			"c1": "nuid,Ey2e9AvCHu9pxfch73TpIit2fBh0Z1582142280",
			"c10": "plt,",
			"plugv": "",
			"playerv": "",
			"c11": "agg,0",
			"c12": "apv,",
			"c13": "asid,DHG163HR-BH45-JKY6-BKH7-67GJKY68GJK7",
			"c15": "apn,",
			"c16": "sdkv,bj.6.0.0",
			"c14": "osver,NA",
			"h33": "2",
			"c26": "dmap,3",
			"c27": "cln,0",
			"at": "start",
			"rt": "video",
			"st": "mtvr",
			"vn": "1",
			"c24": "zip,99",
			"dd": "",
			"hrd": "",
			"wkd": "",
			"uoo": "",
			"c68": "bndlid,",
			"c61": "createtm,1582142283",
			"nodeTM": "",
			"logTM": "",
			"c73": "phtype,",
			"c74": "dvcnm,",
			"c62": "sendTime,1582142283",
			"rnd": "336513"
		},
		{
			"_baseurl": "https://secure-qat4.imrworldwide.com/cgi-bin/d",
			"_sentAt": "2020-02-19T19:58:04.697Z",
			"ci": "us-506843",
			"sessionId": "NwbyK9BWQDsgzXCPtKSRsZ8qnkCHa1582142280",
			"c29": "plid,15821422804608886",
			"c30": "bldv,6.0.0.474",
			"davty": "0",
			"forward": "1",
			"c6": "mtvr,b01",
			"ca": "FD_UvQ9HSNOcTOL2ZobsXtIBQ",
			"pc": "DHG163HR-BH45-JKY6-BKH7-67GJKY68GJK7",
			"cr": "2_00_90_I121_00000_0",
			"segment1": "",
			"segment2": "",
			"c9": "devid,",
			"c8": "devgrp,",
			"c7": "osgrp,",
			"c1": "nuid,Ey2e9AvCHu9pxfch73TpIit2fBh0Z1582142280",
			"c10": "plt,",
			"plugv": "",
			"playerv": "",
			"c11": "agg,1",
			"c12": "apv,",
			"c13": "asid,DHG163HR-BH45-JKY6-BKH7-67GJKY68GJK7",
			"c15": "apn,",
			"c16": "sdkv,bj.6.0.0",
			"c14": "osver,NA",
			"h33": "2",
			"c26": "dmap,3",
			"c27": "cln,0",
			"at": "start",
			"rt": "video",
			"st": "mtvr",
			"vn": "1",
			"c24": "zip,99",
			"dd": "",
			"hrd": "",
			"wkd": "",
			"uoo": "",
			"c68": "bndlid,",
			"c61": "createtm,1582142283",
			"nodeTM": "",
			"logTM": "",
			"c73": "phtype,",
			"c74": "dvcnm,",
			"c62": "sendTime,1582142283",
			"rnd": "836448"
		},
		{
			"_baseurl": "https://secure-qat4.imrworldwide.com/cgi-bin/tsv",
			"_sentAt": "2020-02-19T19:58:33.490Z",
			"id3": "www.nielsen.com/sLK6sS1v0IKGqf3n2TRNwA",
			"fmt": "json",
			"pli": "15821422804608886",
			"segment1": "",
			"segment2": "",
			"tsvevt": "tsvupdate",
			"nmspc": "NOLBUNDLE"
		},
		{
			"_baseurl": "https://secure-qat4.imrworldwide.com/cgi-bin/d",
			"_sentAt": "2020-02-19T19:58:33.580Z",
			"ci": "us-506843",
			"sessionId": "NwbyK9BWQDsgzXCPtKSRsZ8qnkCHa1582142280",
			"c29": "plid,15821422804608886",
			"c30": "bldv,6.0.0.474",
			"davty": "1",
			"forward": "1",
			"c6": "mtvr,b01",
			"ca": "FD_UvQ9HSNOcTOL2ZobsXtIBQ",
			"pc": "DHG163HR-BH45-JKY6-BKH7-67GJKY68GJK7",
			"cr": "2_00_90_V121_00000_0",
			"segment1": "",
			"segment2": "",
			"c9": "devid,",
			"c8": "devgrp,",
			"c7": "osgrp,",
			"c1": "nuid,Ey2e9AvCHu9pxfch73TpIit2fBh0Z1582142280",
			"c10": "plt,",
			"plugv": "",
			"playerv": "",
			"c11": "agg,1",
			"c12": "apv,",
			"c13": "asid,DHG163HR-BH45-JKY6-BKH7-67GJKY68GJK7",
			"c15": "apn,",
			"c16": "sdkv,bj.6.0.0",
			"c14": "osver,NA",
			"h33": "2",
			"c26": "dmap,3",
			"c27": "cln,30",
			"at": "view",
			"rt": "video",
			"st": "mtvr",
			"vn": "1",
			"c24": "zip,99",
			"dd": "",
			"hrd": "",
			"wkd": "",
			"uoo": "",
			"c68": "bndlid,",
			"c61": "createtm,1582142312",
			"nodeTM": "",
			"logTM": "",
			"c73": "phtype,",
			"c74": "dvcnm,",
			"c62": "sendTime,1582142312",
			"rnd": "300258"
		},
		{
			"_baseurl": "https://secure-qat4.imrworldwide.com/cgi-bin/d",
			"_sentAt": "2020-02-19T19:58:33.582Z",
			"ci": "us-506843",
			"sessionId": "NwbyK9BWQDsgzXCPtKSRsZ8qnkCHa1582142280",
			"c29": "plid,15821422804608886",
			"c30": "bldv,6.0.0.474",
			"davty": "1",
			"forward": "0",
			"c6": "mtvr,b01",
			"ca": "PC_sLK6sS1v0IKGqf3n2TRNwA",
			"pc": "DHG163HR-BH45-JKY6-BKH7-67GJKY68GJK7",
			"cr": "2_00_90_V121_00000_0",
			"segment1": "",
			"segment2": "",
			"c9": "devid,",
			"c8": "devgrp,",
			"c7": "osgrp,",
			"c1": "nuid,Ey2e9AvCHu9pxfch73TpIit2fBh0Z1582142280",
			"c10": "plt,",
			"plugv": "",
			"playerv": "",
			"c11": "agg,0",
			"c12": "apv,",
			"c13": "asid,DHG163HR-BH45-JKY6-BKH7-67GJKY68GJK7",
			"c15": "apn,",
			"c16": "sdkv,bj.6.0.0",
			"c14": "osver,NA",
			"h33": "2",
			"c26": "dmap,3",
			"c27": "cln,30",
			"at": "view",
			"rt": "video",
			"st": "mtvr",
			"vn": "1",
			"c24": "zip,99",
			"dd": "",
			"hrd": "",
			"wkd": "",
			"uoo": "",
			"c68": "bndlid,",
			"c61": "createtm,1582142312",
			"nodeTM": "",
			"logTM": "",
			"c73": "phtype,",
			"c74": "dvcnm,",
			"c62": "sendTime,1582142312",
			"rnd": "36187"
		},
		{
			"_baseurl": "https://secure-qat4.imrworldwide.com/cgi-bin/d",
			"_sentAt": "2020-02-19T19:58:33.609Z",
			"ci": "us-506843",
			"sessionId": "NwbyK9BWQDsgzXCPtKSRsZ8qnkCHa1582142280",
			"c29": "plid,15821422804608886",
			"c30": "bldv,6.0.0.474",
			"davty": "1",
			"forward": "1",
			"c6": "mtvr,b01",
			"ca": "FD_UvQ9HSNOcTOL2ZobsXtIBQ",
			"pc": "DHG163HR-BH45-JKY6-BKH7-67GJKY68GJK7",
			"cr": "2_00_90_D121_10000_0",
			"segment1": "",
			"segment2": "",
			"c9": "devid,",
			"c8": "devgrp,",
			"c7": "osgrp,",
			"c1": "nuid,Ey2e9AvCHu9pxfch73TpIit2fBh0Z1582142280",
			"c10": "plt,",
			"plugv": "",
			"playerv": "",
			"c11": "agg,1",
			"c12": "apv,",
			"c13": "asid,DHG163HR-BH45-JKY6-BKH7-67GJKY68GJK7",
			"c15": "apn,",
			"c16": "sdkv,bj.6.0.0",
			"c14": "osver,NA",
			"h33": "2",
			"c26": "dmap,3",
			"c27": "cln,30",
			"at": "timer",
			"rt": "video",
			"st": "mtvr",
			"vn": "1",
			"c24": "zip,99",
			"dd": "",
			"hrd": "",
			"wkd": "",
			"uoo": "",
			"c68": "bndlid,",
			"c61": "createtm,1582142312",
			"nodeTM": "",
			"logTM": "",
			"c73": "phtype,",
			"c74": "dvcnm,",
			"c62": "sendTime,1582142312",
			"rnd": "348257"
		},
		{
			"_baseurl": "https://secure-qat4.imrworldwide.com/cgi-bin/d",
			"_sentAt": "2020-02-19T19:58:33.610Z",
			"ci": "us-506843",
			"sessionId": "NwbyK9BWQDsgzXCPtKSRsZ8qnkCHa1582142280",
			"c29": "plid,15821422804608886",
			"c30": "bldv,6.0.0.474",
			"davty": "1",
			"forward": "0",
			"c6": "mtvr,b01",
			"ca": "PC_sLK6sS1v0IKGqf3n2TRNwA",
			"pc": "DHG163HR-BH45-JKY6-BKH7-67GJKY68GJK7",
			"cr": "2_00_90_D121_10000_0",
			"segment1": "",
			"segment2": "",
			"c9": "devid,",
			"c8": "devgrp,",
			"c7": "osgrp,",
			"c1": "nuid,Ey2e9AvCHu9pxfch73TpIit2fBh0Z1582142280",
			"c10": "plt,",
			"plugv": "",
			"playerv": "",
			"c11": "agg,0",
			"c12": "apv,",
			"c13": "asid,DHG163HR-BH45-JKY6-BKH7-67GJKY68GJK7",
			"c15": "apn,",
			"c16": "sdkv,bj.6.0.0",
			"c14": "osver,NA",
			"h33": "2",
			"c26": "dmap,3",
			"c27": "cln,30",
			"at": "timer",
			"rt": "video",
			"st": "mtvr",
			"vn": "1",
			"c24": "zip,99",
			"dd": "",
			"hrd": "",
			"wkd": "",
			"uoo": "",
			"c68": "bndlid,",
			"c61": "createtm,1582142312",
			"nodeTM": "",
			"logTM": "",
			"c73": "phtype,",
			"c74": "dvcnm,",
			"c62": "sendTime,1582142312",
			"rnd": "565845"
		},
		{
			"_baseurl": "https://secure-qat4.imrworldwide.com/cgi-bin/trans",
			"_sentAt": "2020-02-19T19:58:53.566Z",
			"ci": "us-506843",
			"sessionId": "NwbyK9BWQDsgzXCPtKSRsZ8qnkCHa1582142280",
			"forward": "1",
			"pc": "DHG163HR-BH45-JKY6-BKH7-67GJKY68GJK7",
			"c6": "id3,b01",
			"segment1": "",
			"segment2": "",
			"c9": "devid,",
			"c8": "devgrp,",
			"c7": "osgrp,",
			"c1": "nuid,Ey2e9AvCHu9pxfch73TpIit2fBh0Z1582142280",
			"c10": "plt,",
			"c14": "osver,NA",
			"tp": "0:S:99:1582142284,www.nielsen.com/sLK6sS1v0IKGqf3n2TRNwA",
			"channame": "defaultChannelName",
			"h33": "2",
			"c26": "dmap,3",
			"uoo": "",
			"c68": "bndlid,",
			"c61": "createtm,1582142332",
			"plugv": "",
			"playerv": "",
			"nodeTM": "",
			"logTM": "",
			"c73": "phtype,",
			"c74": "dvcnm,",
			"c62": "sendTime,1582142332",
			"rnd": "292087"
		},
		{
			"_baseurl": "https://secure-qat4.imrworldwide.com/cgi-bin/trans",
			"_sentAt": "2020-02-19T19:59:53.532Z",
			"ci": "us-506843",
			"sessionId": "NwbyK9BWQDsgzXCPtKSRsZ8qnkCHa1582142280",
			"forward": "1",
			"pc": "DHG163HR-BH45-JKY6-BKH7-67GJKY68GJK7",
			"c6": "id3,b01",
			"segment1": "",
			"segment2": "",
			"c9": "devid,",
			"c8": "devgrp,",
			"c7": "osgrp,",
			"c1": "nuid,Ey2e9AvCHu9pxfch73TpIit2fBh0Z1582142280",
			"c10": "plt,",
			"c14": "osver,NA",
			"tp": "1:S:90:1582142343,www.nielsen.com/sLK6sS1v0IKGqf3n2TRNwA",
			"channame": "defaultChannelName",
			"h33": "2",
			"c26": "dmap,3",
			"uoo": "",
			"c68": "bndlid,",
			"c61": "createtm,1582142392",
			"plugv": "",
			"playerv": "",
			"nodeTM": "",
			"logTM": "",
			"c73": "phtype,",
			"c74": "dvcnm,",
			"c62": "sendTime,1582142392",
			"rnd": "324474"
		},
		{
			"_baseurl": "https://secure-qat4.imrworldwide.com/cgi-bin/tsv",
			"_sentAt": "2020-02-19T20:00:34.496Z",
			"id3": "www.nielsen.com/sLK6sS1v0IKGqf3n2TRNwA",
			"fmt": "json",
			"pli": "15821422804608886",
			"segment1": "",
			"segment2": "",
			"tsvevt": "tsvupdate",
			"nmspc": "NOLBUNDLE"
		},
		{
			"_baseurl": "https://secure-qat4.imrworldwide.com/cgi-bin/d",
			"_sentAt": "2020-02-19T20:00:34.750Z",
			"ci": "us-506843",
			"sessionId": "NwbyK9BWQDsgzXCPtKSRsZ8qnkCHa1582142280",
			"c29": "plid,15821422804608886",
			"c30": "bldv,6.0.0.474",
			"davty": "1",
			"forward": "1",
			"c6": "mtvr,b01",
			"ca": "FD_UvQ9HSNOcTOL2ZobsXtIBQ",
			"pc": "DHG163HR-BH45-JKY6-BKH7-67GJKY68GJK7",
			"cr": "2_07_90_D121_01100_0",
			"segment1": "",
			"segment2": "",
			"c9": "devid,",
			"c8": "devgrp,",
			"c7": "osgrp,",
			"c1": "nuid,Ey2e9AvCHu9pxfch73TpIit2fBh0Z1582142280",
			"c10": "plt,",
			"plugv": "",
			"playerv": "",
			"c11": "agg,1",
			"c12": "apv,",
			"c13": "asid,DHG163HR-BH45-JKY6-BKH7-67GJKY68GJK7",
			"c15": "apn,",
			"c16": "sdkv,bj.6.0.0",
			"c14": "osver,NA",
			"h33": "2",
			"c26": "dmap,3",
			"c27": "cln,120",
			"at": "timer",
			"rt": "video",
			"st": "mtvr",
			"vn": "1",
			"c24": "zip,99",
			"dd": "",
			"hrd": "",
			"wkd": "",
			"uoo": "",
			"c68": "bndlid,",
			"c61": "createtm,1582142433",
			"nodeTM": "",
			"logTM": "",
			"c73": "phtype,",
			"c74": "dvcnm,",
			"c62": "sendTime,1582142433",
			"rnd": "779602"
		},
		{
			"_baseurl": "https://secure-qat4.imrworldwide.com/cgi-bin/d",
			"_sentAt": "2020-02-19T20:00:34.751Z",
			"ci": "us-506843",
			"sessionId": "NwbyK9BWQDsgzXCPtKSRsZ8qnkCHa1582142280",
			"c29": "plid,15821422804608886",
			"c30": "bldv,6.0.0.474",
			"davty": "1",
			"forward": "0",
			"c6": "mtvr,b01",
			"ca": "PC_sLK6sS1v0IKGqf3n2TRNwA",
			"pc": "DHG163HR-BH45-JKY6-BKH7-67GJKY68GJK7",
			"cr": "2_07_90_D121_01100_0",
			"segment1": "",
			"segment2": "",
			"c9": "devid,",
			"c8": "devgrp,",
			"c7": "osgrp,",
			"c1": "nuid,Ey2e9AvCHu9pxfch73TpIit2fBh0Z1582142280",
			"c10": "plt,",
			"plugv": "",
			"playerv": "",
			"c11": "agg,0",
			"c12": "apv,",
			"c13": "asid,DHG163HR-BH45-JKY6-BKH7-67GJKY68GJK7",
			"c15": "apn,",
			"c16": "sdkv,bj.6.0.0",
			"c14": "osver,NA",
			"h33": "2",
			"c26": "dmap,3",
			"c27": "cln,120",
			"at": "timer",
			"rt": "video",
			"st": "mtvr",
			"vn": "1",
			"c24": "zip,99",
			"dd": "",
			"hrd": "",
			"wkd": "",
			"uoo": "",
			"c68": "bndlid,",
			"c61": "createtm,1582142433",
			"nodeTM": "",
			"logTM": "",
			"c73": "phtype,",
			"c74": "dvcnm,",
			"c62": "sendTime,1582142433",
			"rnd": "560478"
		},
		{
			"_baseurl": "https://secure-qat4.imrworldwide.com/cgi-bin/trans",
			"_sentAt": "2020-02-19T20:00:43.541Z",
			"ci": "us-506843",
			"sessionId": "NwbyK9BWQDsgzXCPtKSRsZ8qnkCHa1582142280",
			"forward": "1",
			"pc": "DHG163HR-BH45-JKY6-BKH7-67GJKY68GJK7",
			"c6": "id3,b01",
			"segment1": "",
			"segment2": "",
			"c9": "devid,",
			"c8": "devgrp,",
			"c7": "osgrp,",
			"c1": "nuid,Ey2e9AvCHu9pxfch73TpIit2fBh0Z1582142280",
			"c10": "plt,",
			"c14": "osver,NA",
			"tp": "2:S:90:1582142403,www.nielsen.com/sLK6sS1v0IKGqf3n2TRNwA",
			"channame": "defaultChannelName",
			"h33": "2",
			"c26": "dmap,3",
			"uoo": "",
			"c68": "bndlid,",
			"c61": "createtm,1582142442",
			"plugv": "",
			"playerv": "",
			"nodeTM": "",
			"logTM": "",
			"c73": "phtype,",
			"c74": "dvcnm,",
			"c62": "sendTime,1582142442",
			"rnd": "511555"
		},
		{
			"_baseurl": "https://secure-qat4.imrworldwide.com/cgi-bin/trans",
			"_sentAt": "2020-02-19T20:01:43.502Z",
			"ci": "us-506843",
			"sessionId": "NwbyK9BWQDsgzXCPtKSRsZ8qnkCHa1582142280",
			"forward": "1",
			"pc": "DHG163HR-BH45-JKY6-BKH7-67GJKY68GJK7",
			"c6": "id3,b01",
			"segment1": "",
			"segment2": "",
			"c9": "devid,",
			"c8": "devgrp,",
			"c7": "osgrp,",
			"c1": "nuid,Ey2e9AvCHu9pxfch73TpIit2fBh0Z1582142280",
			"c10": "plt,",
			"c14": "osver,NA",
			"tp": "3:S:90:1582142453,www.nielsen.com/sLK6sS1v0IKGqf3n2TRNwA",
			"channame": "defaultChannelName",
			"h33": "2",
			"c26": "dmap,3",
			"uoo": "",
			"c68": "bndlid,",
			"c61": "createtm,1582142502",
			"plugv": "",
			"playerv": "",
			"nodeTM": "",
			"logTM": "",
			"c73": "phtype,",
			"c74": "dvcnm,",
			"c62": "sendTime,1582142502",
			"rnd": "733434"
		},
		{
			"_baseurl": "https://secure-qat4.imrworldwide.com/cgi-bin/trans",
			"_sentAt": "2020-02-19T20:02:43.532Z",
			"ci": "us-506843",
			"sessionId": "NwbyK9BWQDsgzXCPtKSRsZ8qnkCHa1582142280",
			"forward": "1",
			"pc": "DHG163HR-BH45-JKY6-BKH7-67GJKY68GJK7",
			"c6": "id3,b01",
			"segment1": "",
			"segment2": "",
			"c9": "devid,",
			"c8": "devgrp,",
			"c7": "osgrp,",
			"c1": "nuid,Ey2e9AvCHu9pxfch73TpIit2fBh0Z1582142280",
			"c10": "plt,",
			"c14": "osver,NA",
			"tp": "4:S:90:1582142512,www.nielsen.com/sLK6sS1v0IKGqf3n2TRNwA",
			"channame": "defaultChannelName",
			"h33": "2",
			"c26": "dmap,3",
			"uoo": "",
			"c68": "bndlid,",
			"c61": "createtm,1582142562",
			"plugv": "",
			"playerv": "",
			"nodeTM": "",
			"logTM": "",
			"c73": "phtype,",
			"c74": "dvcnm,",
			"c62": "sendTime,1582142562",
			"rnd": "281775"
		},
		{
			"_baseurl": "https://secure-qat4.imrworldwide.com/cgi-bin/trans",
			"_sentAt": "2020-02-19T20:03:43.520Z",
			"ci": "us-506843",
			"sessionId": "NwbyK9BWQDsgzXCPtKSRsZ8qnkCHa1582142280",
			"forward": "1",
			"pc": "DHG163HR-BH45-JKY6-BKH7-67GJKY68GJK7",
			"c6": "id3,b01",
			"segment1": "",
			"segment2": "",
			"c9": "devid,",
			"c8": "devgrp,",
			"c7": "osgrp,",
			"c1": "nuid,Ey2e9AvCHu9pxfch73TpIit2fBh0Z1582142280",
			"c10": "plt,",
			"c14": "osver,NA",
			"tp": "5:S:90:1582142573,www.nielsen.com/sLK6sS1v0IKGqf3n2TRNwA",
			"channame": "defaultChannelName",
			"h33": "2",
			"c26": "dmap,3",
			"uoo": "",
			"c68": "bndlid,",
			"c61": "createtm,1582142622",
			"plugv": "",
			"playerv": "",
			"nodeTM": "",
			"logTM": "",
			"c73": "phtype,",
			"c74": "dvcnm,",
			"c62": "sendTime,1582142622",
			"rnd": "633944"
		},
		{
			"_baseurl": "https://secure-qat4.imrworldwide.com/cgi-bin/d",
			"_sentAt": "2020-02-19T20:04:13.584Z",
			"ci": "us-506843",
			"sessionId": "NwbyK9BWQDsgzXCPtKSRsZ8qnkCHa1582142280",
			"c29": "plid,15821422804608886",
			"c30": "bldv,6.0.0.474",
			"davty": "1",
			"forward": "1",
			"c6": "mtvr,b01",
			"ca": "FD_UvQ9HSNOcTOL2ZobsXtIBQ",
			"pc": "DHG163HR-BH45-JKY6-BKH7-67GJKY68GJK7",
			"cr": "2_07_90_D121_01111_0",
			"segment1": "",
			"segment2": "",
			"c9": "devid,",
			"c8": "devgrp,",
			"c7": "osgrp,",
			"c1": "nuid,Ey2e9AvCHu9pxfch73TpIit2fBh0Z1582142280",
			"c10": "plt,",
			"plugv": "",
			"playerv": "",
			"c11": "agg,1",
			"c12": "apv,",
			"c13": "asid,DHG163HR-BH45-JKY6-BKH7-67GJKY68GJK7",
			"c15": "apn,",
			"c16": "sdkv,bj.6.0.0",
			"c14": "osver,NA",
			"h33": "2",
			"c26": "dmap,3",
			"c27": "cln,211",
			"at": "timer",
			"rt": "video",
			"st": "mtvr",
			"vn": "1",
			"c24": "zip,99",
			"dd": "",
			"hrd": "",
			"wkd": "",
			"uoo": "",
			"c68": "bndlid,",
			"c61": "createtm,1582142652",
			"nodeTM": "",
			"logTM": "",
			"c73": "phtype,",
			"c74": "dvcnm,",
			"c62": "sendTime,1582142652",
			"rnd": "410218"
		},
		{
			"_baseurl": "https://secure-qat4.imrworldwide.com/cgi-bin/d",
			"_sentAt": "2020-02-19T20:04:13.588Z",
			"ci": "us-506843",
			"sessionId": "NwbyK9BWQDsgzXCPtKSRsZ8qnkCHa1582142280",
			"c29": "plid,15821422804608886",
			"c30": "bldv,6.0.0.474",
			"davty": "1",
			"forward": "0",
			"c6": "mtvr,b01",
			"ca": "PC_sLK6sS1v0IKGqf3n2TRNwA",
			"pc": "DHG163HR-BH45-JKY6-BKH7-67GJKY68GJK7",
			"cr": "2_07_90_D121_01111_0",
			"segment1": "",
			"segment2": "",
			"c9": "devid,",
			"c8": "devgrp,",
			"c7": "osgrp,",
			"c1": "nuid,Ey2e9AvCHu9pxfch73TpIit2fBh0Z1582142280",
			"c10": "plt,",
			"plugv": "",
			"playerv": "",
			"c11": "agg,0",
			"c12": "apv,",
			"c13": "asid,DHG163HR-BH45-JKY6-BKH7-67GJKY68GJK7",
			"c15": "apn,",
			"c16": "sdkv,bj.6.0.0",
			"c14": "osver,NA",
			"h33": "2",
			"c26": "dmap,3",
			"c27": "cln,219",
			"at": "timer",
			"rt": "video",
			"st": "mtvr",
			"vn": "1",
			"c24": "zip,99",
			"dd": "",
			"hrd": "",
			"wkd": "",
			"uoo": "",
			"c68": "bndlid,",
			"c61": "createtm,1582142652",
			"nodeTM": "",
			"logTM": "",
			"c73": "phtype,",
			"c74": "dvcnm,",
			"c62": "sendTime,1582142652",
			"rnd": "908006"
		},
		{
			"_baseurl": "https://secure-qat4.imrworldwide.com/cgi-bin/d",
			"_sentAt": "2020-02-19T20:04:43.533Z",
			"ci": "us-506843",
			"sessionId": "NwbyK9BWQDsgzXCPtKSRsZ8qnkCHa1582142280",
			"c29": "plid,15821422804608886",
			"c30": "bldv,6.0.0.474",
			"davty": "1",
			"forward": "1",
			"c6": "mtvr,b01",
			"ca": "FD_UvQ9HSNOcTOL2ZobsXtIBQ",
			"pc": "DHG163HR-BH45-JKY6-BKH7-67GJKY68GJK7",
			"aqhflg": "1",
			"cr": "2_00_90_Q69_17711_0",
			"segment1": "",
			"segment2": "",
			"c9": "devid,",
			"plugv": "",
			"playerv": "",
			"c8": "devgrp,",
			"c7": "osgrp,",
			"c1": "nuid,Ey2e9AvCHu9pxfch73TpIit2fBh0Z1582142280",
			"c10": "plt,",
			"c11": "agg,1",
			"c12": "apv,",
			"c13": "asid,DHG163HR-BH45-JKY6-BKH7-67GJKY68GJK7",
			"c14": "osver,NA",
			"c16": "sdkv,bj.6.0.0",
			"h33": "2",
			"c26": "dmap,3",
			"at": "view",
			"rt": "video",
			"st": "mtvr",
			"vn": "1",
			"c15": "apn,",
			"c24": "zip,99",
			"dd": "",
			"hrd": "",
			"wkd": "",
			"uoo": "",
			"c68": "bndlid,",
			"c61": "createtm,1582142682",
			"nodeTM": "",
			"logTM": "",
			"c73": "phtype,",
			"c74": "dvcnm,",
			"c62": "sendTime,1582142682",
			"rnd": "167896"
		},
		{
			"_baseurl": "https://secure-qat4.imrworldwide.com/cgi-bin/trans",
			"_sentAt": "2020-02-19T20:04:43.534Z",
			"ci": "us-506843",
			"sessionId": "NwbyK9BWQDsgzXCPtKSRsZ8qnkCHa1582142280",
			"forward": "1",
			"pc": "DHG163HR-BH45-JKY6-BKH7-67GJKY68GJK7",
			"c6": "id3,b01",
			"segment1": "",
			"segment2": "",
			"c9": "devid,",
			"c8": "devgrp,",
			"c7": "osgrp,",
			"c1": "nuid,Ey2e9AvCHu9pxfch73TpIit2fBh0Z1582142280",
			"c10": "plt,",
			"c14": "osver,NA",
			"tp": "6:S:90:1582142632,www.nielsen.com/sLK6sS1v0IKGqf3n2TRNwA",
			"channame": "defaultChannelName",
			"h33": "2",
			"c26": "dmap,3",
			"uoo": "",
			"c68": "bndlid,",
			"c61": "createtm,1582142682",
			"plugv": "",
			"playerv": "",
			"nodeTM": "",
			"logTM": "",
			"c73": "phtype,",
			"c74": "dvcnm,",
			"c62": "sendTime,1582142682",
			"rnd": "634752"
		},
		{
			"_baseurl": "https://secure-qat4.imrworldwide.com/cgi-bin/d",
			"_sentAt": "2020-02-19T20:05:37.522Z",
			"ci": "us-506843",
			"sessionId": "NwbyK9BWQDsgzXCPtKSRsZ8qnkCHa1582142280",
			"c29": "plid,15821422804608886",
			"c30": "bldv,6.0.0.474",
			"davty": "2",
			"forward": "1",
			"c6": "mtvr,b01",
			"ca": "FD_UvQ9HSNOcTOL2ZobsXtIBQ",
			"pc": "DHG163HR-BH45-JKY6-BKH7-67GJKY68GJK7",
			"cr": "2_07_90_D122_10000_0",
			"segment1": "",
			"segment2": "",
			"c9": "devid,",
			"c8": "devgrp,",
			"c7": "osgrp,",
			"c1": "nuid,Ey2e9AvCHu9pxfch73TpIit2fBh0Z1582142280",
			"c10": "plt,",
			"plugv": "",
			"playerv": "",
			"c11": "agg,1",
			"c12": "apv,",
			"c13": "asid,DHG163HR-BH45-JKY6-BKH7-67GJKY68GJK7",
			"c15": "apn,",
			"c16": "sdkv,bj.6.0.0",
			"c14": "osver,NA",
			"h33": "2",
			"c26": "dmap,3",
			"c27": "cln,89",
			"at": "timer",
			"rt": "video",
			"st": "mtvr",
			"vn": "1",
			"c24": "zip,99",
			"dd": "",
			"hrd": "",
			"wkd": "",
			"uoo": "",
			"c68": "bndlid,",
			"c61": "createtm,1582142736",
			"nodeTM": "",
			"logTM": "",
			"c73": "phtype,",
			"c74": "dvcnm,",
			"c62": "sendTime,1582142736",
			"rnd": "388859"
		},
		{
			"_baseurl": "https://secure-qat4.imrworldwide.com/cgi-bin/d",
			"_sentAt": "2020-02-19T20:05:37.526Z",
			"ci": "us-506843",
			"sessionId": "NwbyK9BWQDsgzXCPtKSRsZ8qnkCHa1582142280",
			"c29": "plid,15821422804608886",
			"c30": "bldv,6.0.0.474",
			"davty": "2",
			"forward": "0",
			"c6": "mtvr,b01",
			"ca": "PC_sLK6sS1v0IKGqf3n2TRNwA",
			"pc": "DHG163HR-BH45-JKY6-BKH7-67GJKY68GJK7",
			"cr": "2_07_90_D122_10000_0",
			"segment1": "",
			"segment2": "",
			"c9": "devid,",
			"c8": "devgrp,",
			"c7": "osgrp,",
			"c1": "nuid,Ey2e9AvCHu9pxfch73TpIit2fBh0Z1582142280",
			"c10": "plt,",
			"plugv": "",
			"playerv": "",
			"c11": "agg,0",
			"c12": "apv,",
			"c13": "asid,DHG163HR-BH45-JKY6-BKH7-67GJKY68GJK7",
			"c15": "apn,",
			"c16": "sdkv,bj.6.0.0",
			"c14": "osver,NA",
			"h33": "2",
			"c26": "dmap,3",
			"c27": "cln,81",
			"at": "timer",
			"rt": "video",
			"st": "mtvr",
			"vn": "1",
			"c24": "zip,99",
			"dd": "",
			"hrd": "",
			"wkd": "",
			"uoo": "",
			"c68": "bndlid,",
			"c61": "createtm,1582142736",
			"nodeTM": "",
			"logTM": "",
			"c73": "phtype,",
			"c74": "dvcnm,",
			"c62": "sendTime,1582142736",
			"rnd": "882651"
		},
		{
			"_baseurl": "https://secure-qat4.imrworldwide.com/cgi-bin/trans",
			"_sentAt": "2020-02-19T20:05:37.529Z",
			"ci": "us-506843",
			"sessionId": "NwbyK9BWQDsgzXCPtKSRsZ8qnkCHa1582142280",
			"forward": "1",
			"pc": "DHG163HR-BH45-JKY6-BKH7-67GJKY68GJK7",
			"c6": "id3,b01",
			"segment1": "",
			"segment2": "",
			"c9": "devid,",
			"c8": "devgrp,",
			"c7": "osgrp,",
			"c1": "nuid,Ey2e9AvCHu9pxfch73TpIit2fBh0Z1582142280",
			"c10": "plt,",
			"c14": "osver,NA",
			"tp": "7:S:90:1582142692,www.nielsen.com/sLK6sS1v0IKGqf3n2TRNwA",
			"channame": "defaultChannelName",
			"h33": "2",
			"c26": "dmap,3",
			"uoo": "",
			"c68": "bndlid,",
			"c61": "createtm,1582142736",
			"plugv": "",
			"playerv": "",
			"nodeTM": "",
			"logTM": "",
			"c73": "phtype,",
			"c74": "dvcnm,",
			"c62": "sendTime,1582142736",
			"rnd": "298967"
		},
		{
			"_baseurl": "https://secure-qat4.imrworldwide.com/cgi-bin/trans",
			"_sentAt": "2020-02-19T20:05:37.695Z",
			"ci": "us-506843",
			"sessionId": "NwbyK9BWQDsgzXCPtKSRsZ8qnkCHa1582142280",
			"forward": "1",
			"pc": "DHG163HR-BH45-JKY6-BKH7-67GJKY68GJK7",
			"c6": "id3,b01",
			"segment1": "",
			"segment2": "",
			"c9": "devid,",
			"c8": "devgrp,",
			"c7": "osgrp,",
			"c1": "nuid,Ey2e9AvCHu9pxfch73TpIit2fBh0Z1582142280",
			"c10": "plt,",
			"c14": "osver,NA",
			"tp": "false",
			"channame": "defaultChannelName",
			"h33": "2",
			"c26": "dmap,3",
			"uoo": "",
			"c68": "bndlid,",
			"c61": "createtm,1582142736",
			"plugv": "",
			"playerv": "",
			"nodeTM": "",
			"logTM": "",
			"c73": "phtype,",
			"c74": "dvcnm,",
			"c62": "sendTime,1582142736",
			"rnd": "227597"
		}
	]
}