{
	"testCaseName": "AQH_GGPM_DTVR_PC1FD1_PC2FD1_event57.xml",
	"baselineGeneratedDate": "2020-04-17T21:30:17.175Z",
	"testUrl": "http://engtestsite.com/bsdk/testsuite/testharness/single/index_eugenia.html?env=qat4&file=AQH_GGPM_DTVR_PC1FD1_PC2FD1_event57.xml&cdn=cdn-gl&nsdkv=600&configEnv=static-staging2&ggcmbVersion=bundled600",
	"results": [
		{
			"_baseurl": "https://secure-qat4.imrworldwide.com/cgi-bin/gn",
			"_sentAt": "2020-04-17T21:25:05.361Z",
			"prd": "session",
			"c9": "devid,",
			"c13": "asid,DHG163HR-BH45-JKY6-BKH7-67GJKY68GJK7",
			"sessionId": "62rvMH1UfXl33V99cvNitXlQCQXi41587158705",
			"c16": "sdkv,bj.6.0.0",
			"uoo": "",
			"retry": "0"
		},
		{
			"_baseurl": "https://secure-qat4.imrworldwide.com/cgi-bin/tsv",
			"_sentAt": "2020-04-17T21:25:07.810Z",
			"id3": "www.nielsen.com/LL-La28siY_RNousaZvt0Q",
			"fmt": "json",
			"pli": "15871587052349250",
			"segment1": "",
			"segment2": "",
			"tsvevt": "tsvupdate",
			"nmspc": "NOLBUNDLE"
		},
		{
			"_baseurl": "https://secure-qat4.imrworldwide.com/cgi-bin/d",
			"_sentAt": "2020-04-17T21:25:07.893Z",
			"ci": "us-506843",
			"sessionId": "62rvMH1UfXl33V99cvNitXlQCQXi41587158705",
			"c29": "plid,15871587052349250",
			"c30": "bldv,6.0.0.474",
			"davty": "0",
			"forward": "0",
			"c6": "mtvr,b01",
			"ca": "PC_LL-La28siY_RNousaZvt0Q",
			"pc": "DHG163HR-BH45-JKY6-BKH7-67GJKY68GJK7",
			"cr": "2_00_99_I124_00000_0",
			"segment1": "",
			"segment2": "",
			"c9": "devid,",
			"c8": "devgrp,",
			"c7": "osgrp,",
			"c1": "nuid,83OH8pBvFl2X9KM5UyL28zvazvdke1587158705",
			"c10": "plt,",
			"plugv": "",
			"playerv": "",
			"c11": "agg,0",
			"c12": "apv,",
			"c13": "asid,DHG163HR-BH45-JKY6-BKH7-67GJKY68GJK7",
			"c15": "apn,",
			"c16": "sdkv,bj.6.0.0",
			"c14": "osver,NA",
			"h33": "2",
			"c26": "dmap,3",
			"c27": "cln,0",
			"at": "start",
			"rt": "video",
			"st": "mtvr",
			"vn": "1",
			"c24": "zip,99",
			"dd": "",
			"hrd": "",
			"wkd": "",
			"uoo": "",
			"c68": "bndlid,",
			"c61": "createtm,1587158707",
			"nodeTM": "",
			"logTM": "",
			"c73": "phtype,",
			"c74": "dvcnm,",
			"c62": "sendTime,1587158707",
			"rnd": "985282"
		},
		{
			"_baseurl": "https://secure-qat4.imrworldwide.com/cgi-bin/d",
			"_sentAt": "2020-04-17T21:25:07.959Z",
			"ci": "us-506843",
			"sessionId": "62rvMH1UfXl33V99cvNitXlQCQXi41587158705",
			"c29": "plid,15871587052349250",
			"c30": "bldv,6.0.0.474",
			"davty": "0",
			"forward": "1",
			"c6": "mtvr,b01",
			"ca": "FD_mI8OMaaM3ASJy4smaf9V7w",
			"pc": "DHG163HR-BH45-JKY6-BKH7-67GJKY68GJK7",
			"cr": "2_00_98_I124_00000_0",
			"segment1": "",
			"segment2": "",
			"c9": "devid,",
			"c8": "devgrp,",
			"c7": "osgrp,",
			"c1": "nuid,83OH8pBvFl2X9KM5UyL28zvazvdke1587158705",
			"c10": "plt,",
			"plugv": "",
			"playerv": "",
			"c11": "agg,1",
			"c12": "apv,",
			"c13": "asid,DHG163HR-BH45-JKY6-BKH7-67GJKY68GJK7",
			"c15": "apn,",
			"c16": "sdkv,bj.6.0.0",
			"c14": "osver,NA",
			"h33": "2",
			"c26": "dmap,3",
			"c27": "cln,0",
			"at": "start",
			"rt": "video",
			"st": "mtvr",
			"vn": "1",
			"c24": "zip,99",
			"dd": "",
			"hrd": "",
			"wkd": "",
			"uoo": "",
			"c68": "bndlid,",
			"c61": "createtm,1587158707",
			"nodeTM": "",
			"logTM": "",
			"c73": "phtype,",
			"c74": "dvcnm,",
			"c62": "sendTime,1587158707",
			"rnd": "355831"
		},
		{
			"_baseurl": "https://secure-qat4.imrworldwide.com/cgi-bin/tsv",
			"_sentAt": "2020-04-17T21:25:36.263Z",
			"id3": "www.nielsen.com/LL-La28siY_RNousaZvt0Q",
			"fmt": "json",
			"pli": "15871587052349250",
			"segment1": "",
			"segment2": "",
			"tsvevt": "tsvupdate",
			"nmspc": "NOLBUNDLE"
		},
		{
			"_baseurl": "https://secure-qat4.imrworldwide.com/cgi-bin/d",
			"_sentAt": "2020-04-17T21:25:36.313Z",
			"ci": "us-506843",
			"sessionId": "62rvMH1UfXl33V99cvNitXlQCQXi41587158705",
			"c29": "plid,15871587052349250",
			"c30": "bldv,6.0.0.474",
			"davty": "1",
			"forward": "1",
			"c6": "mtvr,b01",
			"ca": "FD_mI8OMaaM3ASJy4smaf9V7w",
			"pc": "DHG163HR-BH45-JKY6-BKH7-67GJKY68GJK7",
			"cr": "2_00_98_V124_00000_0",
			"segment1": "",
			"segment2": "",
			"c9": "devid,",
			"c8": "devgrp,",
			"c7": "osgrp,",
			"c1": "nuid,83OH8pBvFl2X9KM5UyL28zvazvdke1587158705",
			"c10": "plt,",
			"plugv": "",
			"playerv": "",
			"c11": "agg,1",
			"c12": "apv,",
			"c13": "asid,DHG163HR-BH45-JKY6-BKH7-67GJKY68GJK7",
			"c15": "apn,",
			"c16": "sdkv,bj.6.0.0",
			"c14": "osver,NA",
			"h33": "2",
			"c26": "dmap,3",
			"c27": "cln,30",
			"at": "view",
			"rt": "video",
			"st": "mtvr",
			"vn": "1",
			"c24": "zip,99",
			"dd": "",
			"hrd": "",
			"wkd": "",
			"uoo": "",
			"c68": "bndlid,",
			"c61": "createtm,1587158736",
			"nodeTM": "",
			"logTM": "",
			"c73": "phtype,",
			"c74": "dvcnm,",
			"c62": "sendTime,1587158736",
			"rnd": "195031"
		},
		{
			"_baseurl": "https://secure-qat4.imrworldwide.com/cgi-bin/d",
			"_sentAt": "2020-04-17T21:25:36.322Z",
			"ci": "us-506843",
			"sessionId": "62rvMH1UfXl33V99cvNitXlQCQXi41587158705",
			"c29": "plid,15871587052349250",
			"c30": "bldv,6.0.0.474",
			"davty": "1",
			"forward": "1",
			"c6": "mtvr,b01",
			"ca": "FD_mI8OMaaM3ASJy4smaf9V7w",
			"pc": "DHG163HR-BH45-JKY6-BKH7-67GJKY68GJK7",
			"cr": "2_00_98_D124_01000_0",
			"segment1": "",
			"segment2": "",
			"c9": "devid,",
			"c8": "devgrp,",
			"c7": "osgrp,",
			"c1": "nuid,83OH8pBvFl2X9KM5UyL28zvazvdke1587158705",
			"c10": "plt,",
			"plugv": "",
			"playerv": "",
			"c11": "agg,1",
			"c12": "apv,",
			"c13": "asid,DHG163HR-BH45-JKY6-BKH7-67GJKY68GJK7",
			"c15": "apn,",
			"c16": "sdkv,bj.6.0.0",
			"c14": "osver,NA",
			"h33": "2",
			"c26": "dmap,3",
			"c27": "cln,30",
			"at": "timer",
			"rt": "video",
			"st": "mtvr",
			"vn": "1",
			"c24": "zip,99",
			"dd": "",
			"hrd": "",
			"wkd": "",
			"uoo": "",
			"c68": "bndlid,",
			"c61": "createtm,1587158736",
			"nodeTM": "",
			"logTM": "",
			"c73": "phtype,",
			"c74": "dvcnm,",
			"c62": "sendTime,1587158736",
			"rnd": "608176"
		},
		{
			"_baseurl": "https://secure-qat4.imrworldwide.com/cgi-bin/trans",
			"_sentAt": "2020-04-17T21:25:56.288Z",
			"ci": "us-506843",
			"sessionId": "62rvMH1UfXl33V99cvNitXlQCQXi41587158705",
			"forward": "1",
			"pc": "DHG163HR-BH45-JKY6-BKH7-67GJKY68GJK7",
			"c6": "id3,b01",
			"segment1": "",
			"segment2": "",
			"c9": "devid,",
			"c8": "devgrp,",
			"c7": "osgrp,",
			"c1": "nuid,83OH8pBvFl2X9KM5UyL28zvazvdke1587158705",
			"c10": "plt,",
			"c14": "osver,NA",
			"tp": "0:S:99:1587158708,www.nielsen.com/LL-La28siY_RNousaZvt0Q",
			"channame": "defaultChannelName",
			"h33": "2",
			"c26": "dmap,3",
			"uoo": "",
			"c68": "bndlid,",
			"c61": "createtm,1587158756",
			"plugv": "",
			"playerv": "",
			"nodeTM": "",
			"logTM": "",
			"c73": "phtype,",
			"c74": "dvcnm,",
			"c62": "sendTime,1587158756",
			"rnd": "33029"
		},
		{
			"_baseurl": "https://secure-qat4.imrworldwide.com/cgi-bin/tsv",
			"_sentAt": "2020-04-17T21:26:06.261Z",
			"id3": "www.nielsen.com/LL-La28siY_RNousaZvt0Q",
			"fmt": "json",
			"pli": "15871587052349250",
			"segment1": "",
			"segment2": "",
			"tsvevt": "tsvupdate",
			"nmspc": "NOLBUNDLE"
		},
		{
			"_baseurl": "https://secure-qat4.imrworldwide.com/cgi-bin/d",
			"_sentAt": "2020-04-17T21:26:06.295Z",
			"ci": "us-506843",
			"sessionId": "62rvMH1UfXl33V99cvNitXlQCQXi41587158705",
			"c29": "plid,15871587052349250",
			"c30": "bldv,6.0.0.474",
			"davty": "1",
			"forward": "0",
			"c6": "mtvr,b01",
			"ca": "PC_LL-La28siY_RNousaZvt0Q",
			"pc": "DHG163HR-BH45-JKY6-BKH7-67GJKY68GJK7",
			"cr": "2_00_98_V124_00000_0",
			"segment1": "",
			"segment2": "",
			"c9": "devid,",
			"c8": "devgrp,",
			"c7": "osgrp,",
			"c1": "nuid,83OH8pBvFl2X9KM5UyL28zvazvdke1587158705",
			"c10": "plt,",
			"plugv": "",
			"playerv": "",
			"c11": "agg,0",
			"c12": "apv,",
			"c13": "asid,DHG163HR-BH45-JKY6-BKH7-67GJKY68GJK7",
			"c15": "apn,",
			"c16": "sdkv,bj.6.0.0",
			"c14": "osver,NA",
			"h33": "2",
			"c26": "dmap,3",
			"c27": "cln,53",
			"at": "view",
			"rt": "video",
			"st": "mtvr",
			"vn": "1",
			"c24": "zip,99",
			"dd": "",
			"hrd": "",
			"wkd": "",
			"uoo": "",
			"c68": "bndlid,",
			"c61": "createtm,1587158766",
			"nodeTM": "",
			"logTM": "",
			"c73": "phtype,",
			"c74": "dvcnm,",
			"c62": "sendTime,1587158766",
			"rnd": "841139"
		},
		{
			"_baseurl": "https://secure-qat4.imrworldwide.com/cgi-bin/d",
			"_sentAt": "2020-04-17T21:26:06.314Z",
			"ci": "us-506843",
			"sessionId": "62rvMH1UfXl33V99cvNitXlQCQXi41587158705",
			"c29": "plid,15871587052349250",
			"c30": "bldv,6.0.0.474",
			"davty": "1",
			"forward": "0",
			"c6": "mtvr,b01",
			"ca": "PC_LL-La28siY_RNousaZvt0Q",
			"pc": "DHG163HR-BH45-JKY6-BKH7-67GJKY68GJK7",
			"cr": "2_00_98_D124_00100_0",
			"segment1": "",
			"segment2": "",
			"c9": "devid,",
			"c8": "devgrp,",
			"c7": "osgrp,",
			"c1": "nuid,83OH8pBvFl2X9KM5UyL28zvazvdke1587158705",
			"c10": "plt,",
			"plugv": "",
			"playerv": "",
			"c11": "agg,0",
			"c12": "apv,",
			"c13": "asid,DHG163HR-BH45-JKY6-BKH7-67GJKY68GJK7",
			"c15": "apn,",
			"c16": "sdkv,bj.6.0.0",
			"c14": "osver,NA",
			"h33": "2",
			"c26": "dmap,3",
			"c27": "cln,53",
			"at": "timer",
			"rt": "video",
			"st": "mtvr",
			"vn": "1",
			"c24": "zip,99",
			"dd": "",
			"hrd": "",
			"wkd": "",
			"uoo": "",
			"c68": "bndlid,",
			"c61": "createtm,1587158766",
			"nodeTM": "",
			"logTM": "",
			"c73": "phtype,",
			"c74": "dvcnm,",
			"c62": "sendTime,1587158766",
			"rnd": "218342"
		},
		{
			"_baseurl": "https://secure-qat4.imrworldwide.com/cgi-bin/trans",
			"_sentAt": "2020-04-17T21:26:56.284Z",
			"ci": "us-506843",
			"sessionId": "62rvMH1UfXl33V99cvNitXlQCQXi41587158705",
			"forward": "1",
			"pc": "DHG163HR-BH45-JKY6-BKH7-67GJKY68GJK7",
			"c6": "id3,b01",
			"segment1": "",
			"segment2": "",
			"c9": "devid,",
			"c8": "devgrp,",
			"c7": "osgrp,",
			"c1": "nuid,83OH8pBvFl2X9KM5UyL28zvazvdke1587158705",
			"c10": "plt,",
			"c14": "osver,NA",
			"tp": "1:S:98:1587158766,www.nielsen.com/LL-La28siY_RNousaZvt0Q",
			"channame": "defaultChannelName",
			"h33": "2",
			"c26": "dmap,3",
			"uoo": "",
			"c68": "bndlid,",
			"c61": "createtm,1587158816",
			"plugv": "",
			"playerv": "",
			"nodeTM": "",
			"logTM": "",
			"c73": "phtype,",
			"c74": "dvcnm,",
			"c62": "sendTime,1587158816",
			"rnd": "519363"
		},
		{
			"_baseurl": "https://secure-qat4.imrworldwide.com/cgi-bin/trans",
			"_sentAt": "2020-04-17T21:27:07.385Z",
			"ci": "us-506843",
			"sessionId": "62rvMH1UfXl33V99cvNitXlQCQXi41587158705",
			"forward": "1",
			"pc": "DHG163HR-BH45-JKY6-BKH7-67GJKY68GJK7",
			"c6": "id3,b01",
			"segment1": "",
			"segment2": "",
			"c9": "devid,",
			"c8": "devgrp,",
			"c7": "osgrp,",
			"c1": "nuid,83OH8pBvFl2X9KM5UyL28zvazvdke1587158705",
			"c10": "plt,",
			"c14": "osver,NA",
			"tp": "2:S:98:1587158826,www.nielsen.com/LL-La28siY_RNousaZvt0Q",
			"channame": "defaultChannelName",
			"h33": "2",
			"c26": "dmap,3",
			"uoo": "",
			"c68": "bndlid,",
			"c61": "createtm,1587158827",
			"plugv": "",
			"playerv": "",
			"nodeTM": "",
			"logTM": "",
			"c73": "phtype,",
			"c74": "dvcnm,",
			"c62": "sendTime,1587158827",
			"rnd": "435614"
		},
		{
			"_baseurl": "https://secure-qat4.imrworldwide.com/cgi-bin/d",
			"_sentAt": "2020-04-17T21:27:07.386Z",
			"ci": "us-506843",
			"sessionId": "62rvMH1UfXl33V99cvNitXlQCQXi41587158705",
			"c29": "plid,15871587052349250",
			"c30": "bldv,6.0.0.474",
			"davty": "1",
			"forward": "1",
			"c6": "mtvr,b01",
			"ca": "FD_mI8OMaaM3ASJy4smaf9V7w",
			"pc": "DHG163HR-BH45-JKY6-BKH7-67GJKY68GJK7",
			"cr": "2_00_98_D124_00100_0",
			"segment1": "",
			"segment2": "",
			"c9": "devid,",
			"c8": "devgrp,",
			"c7": "osgrp,",
			"c1": "nuid,83OH8pBvFl2X9KM5UyL28zvazvdke1587158705",
			"c10": "plt,",
			"plugv": "",
			"playerv": "",
			"c11": "agg,1",
			"c12": "apv,",
			"c13": "asid,DHG163HR-BH45-JKY6-BKH7-67GJKY68GJK7",
			"c15": "apn,",
			"c16": "sdkv,bj.6.0.0",
			"c14": "osver,NA",
			"h33": "2",
			"c26": "dmap,3",
			"c27": "cln,90",
			"at": "timer",
			"rt": "video",
			"st": "mtvr",
			"vn": "1",
			"c24": "zip,99",
			"dd": "",
			"hrd": "",
			"wkd": "",
			"uoo": "",
			"c68": "bndlid,",
			"c61": "createtm,1587158827",
			"nodeTM": "",
			"logTM": "",
			"c73": "phtype,",
			"c74": "dvcnm,",
			"c62": "sendTime,1587158827",
			"rnd": "273956"
		},
		{
			"_baseurl": "https://secure-qat4.imrworldwide.com/cgi-bin/d",
			"_sentAt": "2020-04-17T21:27:07.387Z",
			"ci": "us-506843",
			"sessionId": "62rvMH1UfXl33V99cvNitXlQCQXi41587158705",
			"c29": "plid,15871587052349250",
			"c30": "bldv,6.0.0.474",
			"davty": "1",
			"forward": "0",
			"c6": "mtvr,b01",
			"ca": "PC_KG-La28siY_RNousaZvt0U",
			"pc": "DHG163HR-BH45-JKY6-BKH7-67GJKY68GJK7",
			"cr": "2_00_98_V124_00000_0",
			"segment1": "",
			"segment2": "",
			"c9": "devid,",
			"c8": "devgrp,",
			"c7": "osgrp,",
			"c1": "nuid,83OH8pBvFl2X9KM5UyL28zvazvdke1587158705",
			"c10": "plt,",
			"plugv": "",
			"playerv": "",
			"c11": "agg,0",
			"c12": "apv,",
			"c13": "asid,DHG163HR-BH45-JKY6-BKH7-67GJKY68GJK7",
			"c15": "apn,",
			"c16": "sdkv,bj.6.0.0",
			"c14": "osver,NA",
			"h33": "2",
			"c26": "dmap,3",
			"c27": "cln,60",
			"at": "view",
			"rt": "video",
			"st": "mtvr",
			"vn": "1",
			"c24": "zip,99",
			"dd": "",
			"hrd": "",
			"wkd": "",
			"uoo": "",
			"c68": "bndlid,",
			"c61": "createtm,1587158827",
			"nodeTM": "",
			"logTM": "",
			"c73": "phtype,",
			"c74": "dvcnm,",
			"c62": "sendTime,1587158827",
			"rnd": "268919"
		},
		{
			"_baseurl": "https://secure-qat4.imrworldwide.com/cgi-bin/d",
			"_sentAt": "2020-04-17T21:27:07.389Z",
			"ci": "us-506843",
			"sessionId": "62rvMH1UfXl33V99cvNitXlQCQXi41587158705",
			"c29": "plid,15871587052349250",
			"c30": "bldv,6.0.0.474",
			"davty": "1",
			"forward": "0",
			"c6": "mtvr,b01",
			"ca": "PC_LL-La28siY_RNousaZvt0Q",
			"pc": "DHG163HR-BH45-JKY6-BKH7-67GJKY68GJK7",
			"cr": "2_00_98_D124_00010_0",
			"segment1": "",
			"segment2": "",
			"c9": "devid,",
			"c8": "devgrp,",
			"c7": "osgrp,",
			"c1": "nuid,83OH8pBvFl2X9KM5UyL28zvazvdke1587158705",
			"c10": "plt,",
			"plugv": "",
			"playerv": "",
			"c11": "agg,0",
			"c12": "apv,",
			"c13": "asid,DHG163HR-BH45-JKY6-BKH7-67GJKY68GJK7",
			"c15": "apn,",
			"c16": "sdkv,bj.6.0.0",
			"c14": "osver,NA",
			"h33": "2",
			"c26": "dmap,3",
			"c27": "cln,67",
			"at": "timer",
			"rt": "video",
			"st": "mtvr",
			"vn": "1",
			"c24": "zip,99",
			"dd": "",
			"hrd": "",
			"wkd": "",
			"uoo": "",
			"c68": "bndlid,",
			"c61": "createtm,1587158827",
			"nodeTM": "",
			"logTM": "",
			"c73": "phtype,",
			"c74": "dvcnm,",
			"c62": "sendTime,1587158827",
			"rnd": "366411"
		},
		{
			"_baseurl": "https://secure-qat4.imrworldwide.com/cgi-bin/d",
			"_sentAt": "2020-04-17T21:27:07.390Z",
			"ci": "us-506843",
			"sessionId": "62rvMH1UfXl33V99cvNitXlQCQXi41587158705",
			"c29": "plid,15871587052349250",
			"c30": "bldv,6.0.0.474",
			"davty": "0",
			"forward": "0",
			"c6": "mtvr,b01",
			"ca": "PC_KG-La28siY_RNousaZvt0U",
			"pc": "DHG163HR-BH45-JKY6-BKH7-67GJKY68GJK7",
			"cr": "2_00_98_I124_00000_0",
			"segment1": "",
			"segment2": "",
			"c9": "devid,",
			"c8": "devgrp,",
			"c7": "osgrp,",
			"c1": "nuid,83OH8pBvFl2X9KM5UyL28zvazvdke1587158705",
			"c10": "plt,",
			"plugv": "",
			"playerv": "",
			"c11": "agg,0",
			"c12": "apv,",
			"c13": "asid,DHG163HR-BH45-JKY6-BKH7-67GJKY68GJK7",
			"c15": "apn,",
			"c16": "sdkv,bj.6.0.0",
			"c14": "osver,NA",
			"h33": "2",
			"c26": "dmap,3",
			"c27": "cln,0",
			"at": "start",
			"rt": "video",
			"st": "mtvr",
			"vn": "1",
			"c24": "zip,99",
			"dd": "",
			"hrd": "",
			"wkd": "",
			"uoo": "",
			"c68": "bndlid,",
			"c61": "createtm,1587158827",
			"nodeTM": "",
			"logTM": "",
			"c73": "phtype,",
			"c74": "dvcnm,",
			"c62": "sendTime,1587158827",
			"rnd": "679816"
		},
		{
			"_baseurl": "https://secure-qat4.imrworldwide.com/cgi-bin/trans",
			"_sentAt": "2020-04-17T21:27:07.391Z",
			"ci": "us-506843",
			"sessionId": "62rvMH1UfXl33V99cvNitXlQCQXi41587158705",
			"forward": "1",
			"pc": "DHG163HR-BH45-JKY6-BKH7-67GJKY68GJK7",
			"c6": "id3,b01",
			"segment1": "",
			"segment2": "",
			"c9": "devid,",
			"c8": "devgrp,",
			"c7": "osgrp,",
			"c1": "nuid,83OH8pBvFl2X9KM5UyL28zvazvdke1587158705",
			"c10": "plt,",
			"c14": "osver,NA",
			"tp": "false",
			"channame": "defaultChannelName",
			"h33": "2",
			"c26": "dmap,3",
			"uoo": "",
			"c68": "bndlid,",
			"c61": "createtm,1587158827",
			"plugv": "",
			"playerv": "",
			"nodeTM": "",
			"logTM": "",
			"c73": "phtype,",
			"c74": "dvcnm,",
			"c62": "sendTime,1587158827",
			"rnd": "199755"
		},
		{
			"_baseurl": "https://secure-qat4.imrworldwide.com/cgi-bin/trans",
			"_sentAt": "2020-04-17T21:27:56.291Z",
			"ci": "us-506843",
			"sessionId": "62rvMH1UfXl33V99cvNitXlQCQXi41587158705",
			"forward": "1",
			"pc": "DHG163HR-BH45-JKY6-BKH7-67GJKY68GJK7",
			"c6": "id3,b01",
			"segment1": "",
			"segment2": "",
			"c9": "devid,",
			"c8": "devgrp,",
			"c7": "osgrp,",
			"c1": "nuid,83OH8pBvFl2X9KM5UyL28zvazvdke1587158705",
			"c10": "plt,",
			"c14": "osver,NA",
			"tp": "3:S:98:1587158827,www.nielsen.com/KG-La28siY_RNousaZvt0U",
			"channame": "defaultChannelName",
			"h33": "2",
			"c26": "dmap,3",
			"uoo": "",
			"c68": "bndlid,",
			"c61": "createtm,1587158876",
			"plugv": "",
			"playerv": "",
			"nodeTM": "",
			"logTM": "",
			"c73": "phtype,",
			"c74": "dvcnm,",
			"c62": "sendTime,1587158876",
			"rnd": "947845"
		},
		{
			"_baseurl": "https://secure-qat4.imrworldwide.com/cgi-bin/tsv",
			"_sentAt": "2020-04-17T21:28:06.268Z",
			"id3": "www.nielsen.com/KG-La28siY_RNousaZvt0U",
			"fmt": "json",
			"pli": "15871587052349250",
			"segment1": "",
			"segment2": "",
			"tsvevt": "tsvupdate",
			"nmspc": "NOLBUNDLE"
		},
		{
			"_baseurl": "https://secure-qat4.imrworldwide.com/cgi-bin/d",
			"_sentAt": "2020-04-17T21:28:06.556Z",
			"ci": "us-506843",
			"sessionId": "62rvMH1UfXl33V99cvNitXlQCQXi41587158705",
			"c29": "plid,15871587052349250",
			"c30": "bldv,6.0.0.474",
			"davty": "1",
			"forward": "0",
			"c6": "mtvr,b01",
			"ca": "PC_KG-La28siY_RNousaZvt0U",
			"pc": "DHG163HR-BH45-JKY6-BKH7-67GJKY68GJK7",
			"cr": "2_00_98_D124_00001_0",
			"segment1": "",
			"segment2": "",
			"c9": "devid,",
			"c8": "devgrp,",
			"c7": "osgrp,",
			"c1": "nuid,83OH8pBvFl2X9KM5UyL28zvazvdke1587158705",
			"c10": "plt,",
			"plugv": "",
			"playerv": "",
			"c11": "agg,0",
			"c12": "apv,",
			"c13": "asid,DHG163HR-BH45-JKY6-BKH7-67GJKY68GJK7",
			"c15": "apn,",
			"c16": "sdkv,bj.6.0.0",
			"c14": "osver,NA",
			"h33": "2",
			"c26": "dmap,3",
			"c27": "cln,53",
			"at": "timer",
			"rt": "video",
			"st": "mtvr",
			"vn": "1",
			"c24": "zip,99",
			"dd": "",
			"hrd": "",
			"wkd": "",
			"uoo": "",
			"c68": "bndlid,",
			"c61": "createtm,1587158886",
			"nodeTM": "",
			"logTM": "",
			"c73": "phtype,",
			"c74": "dvcnm,",
			"c62": "sendTime,1587158886",
			"rnd": "706720"
		},
		{
			"_baseurl": "https://secure-qat4.imrworldwide.com/cgi-bin/trans",
			"_sentAt": "2020-04-17T21:28:56.308Z",
			"ci": "us-506843",
			"sessionId": "62rvMH1UfXl33V99cvNitXlQCQXi41587158705",
			"forward": "1",
			"pc": "DHG163HR-BH45-JKY6-BKH7-67GJKY68GJK7",
			"c6": "id3,b01",
			"segment1": "",
			"segment2": "",
			"c9": "devid,",
			"c8": "devgrp,",
			"c7": "osgrp,",
			"c1": "nuid,83OH8pBvFl2X9KM5UyL28zvazvdke1587158705",
			"c10": "plt,",
			"c14": "osver,NA",
			"tp": "4:S:98:1587158886,www.nielsen.com/KG-La28siY_RNousaZvt0U",
			"channame": "defaultChannelName",
			"h33": "2",
			"c26": "dmap,3",
			"uoo": "",
			"c68": "bndlid,",
			"c61": "createtm,1587158936",
			"plugv": "",
			"playerv": "",
			"nodeTM": "",
			"logTM": "",
			"c73": "phtype,",
			"c74": "dvcnm,",
			"c62": "sendTime,1587158936",
			"rnd": "143160"
		},
		{
			"_baseurl": "https://secure-qat4.imrworldwide.com/cgi-bin/tsv",
			"_sentAt": "2020-04-17T21:29:16.246Z",
			"id3": "www.nielsen.com/KG-La28siY_RNousaZvt0U",
			"fmt": "json",
			"pli": "15871587052349250",
			"segment1": "",
			"segment2": "",
			"tsvevt": "tsvupdate",
			"nmspc": "NOLBUNDLE"
		},
		{
			"_baseurl": "https://secure-qat4.imrworldwide.com/cgi-bin/d",
			"_sentAt": "2020-04-17T21:29:16.540Z",
			"ci": "us-506843",
			"sessionId": "62rvMH1UfXl33V99cvNitXlQCQXi41587158705",
			"c29": "plid,15871587052349250",
			"c30": "bldv,6.0.0.474",
			"davty": "1",
			"forward": "1",
			"c6": "mtvr,b01",
			"ca": "FD_mI8OMaaM3ASJy4smaf9V7w",
			"pc": "DHG163HR-BH45-JKY6-BKH7-67GJKY68GJK7",
			"cr": "2_00_98_D124_00011_0",
			"segment1": "",
			"segment2": "",
			"c9": "devid,",
			"c8": "devgrp,",
			"c7": "osgrp,",
			"c1": "nuid,83OH8pBvFl2X9KM5UyL28zvazvdke1587158705",
			"c10": "plt,",
			"plugv": "",
			"playerv": "",
			"c11": "agg,1",
			"c12": "apv,",
			"c13": "asid,DHG163HR-BH45-JKY6-BKH7-67GJKY68GJK7",
			"c15": "apn,",
			"c16": "sdkv,bj.6.0.0",
			"c14": "osver,NA",
			"h33": "2",
			"c26": "dmap,3",
			"c27": "cln,120",
			"at": "timer",
			"rt": "video",
			"st": "mtvr",
			"vn": "1",
			"c24": "zip,99",
			"dd": "",
			"hrd": "",
			"wkd": "",
			"uoo": "",
			"c68": "bndlid,",
			"c61": "createtm,1587158956",
			"nodeTM": "",
			"logTM": "",
			"c73": "phtype,",
			"c74": "dvcnm,",
			"c62": "sendTime,1587158956",
			"rnd": "742778"
		},
		{
			"_baseurl": "https://secure-qat4.imrworldwide.com/cgi-bin/trans",
			"_sentAt": "2020-04-17T21:29:56.242Z",
			"ci": "us-506843",
			"sessionId": "62rvMH1UfXl33V99cvNitXlQCQXi41587158705",
			"forward": "1",
			"pc": "DHG163HR-BH45-JKY6-BKH7-67GJKY68GJK7",
			"c6": "id3,b01",
			"segment1": "",
			"segment2": "",
			"c9": "devid,",
			"c8": "devgrp,",
			"c7": "osgrp,",
			"c1": "nuid,83OH8pBvFl2X9KM5UyL28zvazvdke1587158705",
			"c10": "plt,",
			"c14": "osver,NA",
			"tp": "5:S:98:1587158946,www.nielsen.com/KG-La28siY_RNousaZvt0U",
			"channame": "defaultChannelName",
			"h33": "2",
			"c26": "dmap,3",
			"uoo": "",
			"c68": "bndlid,",
			"c61": "createtm,1587158996",
			"plugv": "",
			"playerv": "",
			"nodeTM": "",
			"logTM": "",
			"c73": "phtype,",
			"c74": "dvcnm,",
			"c62": "sendTime,1587158996",
			"rnd": "702021"
		},
		{
			"_baseurl": "https://secure-qat4.imrworldwide.com/cgi-bin/d",
			"_sentAt": "2020-04-17T21:30:10.258Z",
			"ci": "us-506843",
			"sessionId": "62rvMH1UfXl33V99cvNitXlQCQXi41587158705",
			"c29": "plid,15871587052349250",
			"c30": "bldv,6.0.0.474",
			"davty": "2",
			"forward": "1",
			"c6": "mtvr,b01",
			"ca": "FD_mI8OMaaM3ASJy4smaf9V7w",
			"pc": "DHG163HR-BH45-JKY6-BKH7-67GJKY68GJK7",
			"cr": "2_00_98_D125_10000_0",
			"segment1": "",
			"segment2": "",
			"c9": "devid,",
			"c8": "devgrp,",
			"c7": "osgrp,",
			"c1": "nuid,83OH8pBvFl2X9KM5UyL28zvazvdke1587158705",
			"c10": "plt,",
			"plugv": "",
			"playerv": "",
			"c11": "agg,1",
			"c12": "apv,",
			"c13": "asid,DHG163HR-BH45-JKY6-BKH7-67GJKY68GJK7",
			"c15": "apn,",
			"c16": "sdkv,bj.6.0.0",
			"c14": "osver,NA",
			"h33": "2",
			"c26": "dmap,3",
			"c27": "cln,60",
			"at": "timer",
			"rt": "video",
			"st": "mtvr",
			"vn": "1",
			"c24": "zip,99",
			"dd": "",
			"hrd": "",
			"wkd": "",
			"uoo": "",
			"c68": "bndlid,",
			"c61": "createtm,1587159010",
			"nodeTM": "",
			"logTM": "",
			"c73": "phtype,",
			"c74": "dvcnm,",
			"c62": "sendTime,1587159010",
			"rnd": "365205"
		},
		{
			"_baseurl": "https://secure-qat4.imrworldwide.com/cgi-bin/d",
			"_sentAt": "2020-04-17T21:30:10.261Z",
			"ci": "us-506843",
			"sessionId": "62rvMH1UfXl33V99cvNitXlQCQXi41587158705",
			"c29": "plid,15871587052349250",
			"c30": "bldv,6.0.0.474",
			"davty": "2",
			"forward": "0",
			"c6": "mtvr,b01",
			"ca": "PC_KG-La28siY_RNousaZvt0U",
			"pc": "DHG163HR-BH45-JKY6-BKH7-67GJKY68GJK7",
			"cr": "2_00_98_D125_11000_0",
			"segment1": "",
			"segment2": "",
			"c9": "devid,",
			"c8": "devgrp,",
			"c7": "osgrp,",
			"c1": "nuid,83OH8pBvFl2X9KM5UyL28zvazvdke1587158705",
			"c10": "plt,",
			"plugv": "",
			"playerv": "",
			"c11": "agg,0",
			"c12": "apv,",
			"c13": "asid,DHG163HR-BH45-JKY6-BKH7-67GJKY68GJK7",
			"c15": "apn,",
			"c16": "sdkv,bj.6.0.0",
			"c14": "osver,NA",
			"h33": "2",
			"c26": "dmap,3",
			"c27": "cln,127",
			"at": "timer",
			"rt": "video",
			"st": "mtvr",
			"vn": "1",
			"c24": "zip,99",
			"dd": "",
			"hrd": "",
			"wkd": "",
			"uoo": "",
			"c68": "bndlid,",
			"c61": "createtm,1587159010",
			"nodeTM": "",
			"logTM": "",
			"c73": "phtype,",
			"c74": "dvcnm,",
			"c62": "sendTime,1587159010",
			"rnd": "133995"
		},
		{
			"_baseurl": "https://secure-qat4.imrworldwide.com/cgi-bin/trans",
			"_sentAt": "2020-04-17T21:30:10.263Z",
			"ci": "us-506843",
			"sessionId": "62rvMH1UfXl33V99cvNitXlQCQXi41587158705",
			"forward": "1",
			"pc": "DHG163HR-BH45-JKY6-BKH7-67GJKY68GJK7",
			"c6": "id3,b01",
			"segment1": "",
			"segment2": "",
			"c9": "devid,",
			"c8": "devgrp,",
			"c7": "osgrp,",
			"c1": "nuid,83OH8pBvFl2X9KM5UyL28zvazvdke1587158705",
			"c10": "plt,",
			"c14": "osver,NA",
			"tp": "6:S:98:1587159006,www.nielsen.com/KG-La28siY_RNousaZvt0U",
			"channame": "defaultChannelName",
			"h33": "2",
			"c26": "dmap,3",
			"uoo": "",
			"c68": "bndlid,",
			"c61": "createtm,1587159010",
			"plugv": "",
			"playerv": "",
			"nodeTM": "",
			"logTM": "",
			"c73": "phtype,",
			"c74": "dvcnm,",
			"c62": "sendTime,1587159010",
			"rnd": "391557"
		},
		{
			"_baseurl": "https://secure-qat4.imrworldwide.com/cgi-bin/trans",
			"_sentAt": "2020-04-17T21:30:10.378Z",
			"ci": "us-506843",
			"sessionId": "62rvMH1UfXl33V99cvNitXlQCQXi41587158705",
			"forward": "1",
			"pc": "DHG163HR-BH45-JKY6-BKH7-67GJKY68GJK7",
			"c6": "id3,b01",
			"segment1": "",
			"segment2": "",
			"c9": "devid,",
			"c8": "devgrp,",
			"c7": "osgrp,",
			"c1": "nuid,83OH8pBvFl2X9KM5UyL28zvazvdke1587158705",
			"c10": "plt,",
			"c14": "osver,NA",
			"tp": "false",
			"channame": "defaultChannelName",
			"h33": "2",
			"c26": "dmap,3",
			"uoo": "",
			"c68": "bndlid,",
			"c61": "createtm,1587159010",
			"plugv": "",
			"playerv": "",
			"nodeTM": "",
			"logTM": "",
			"c73": "phtype,",
			"c74": "dvcnm,",
			"c62": "sendTime,1587159010",
			"rnd": "762071"
		}
	]
}