{
	"testCaseName": "REGRESSION_BSDK_TrackEvent_DTVR_FirstMin_5Times.xml",
	"baselineGeneratedDate": "2020-02-19T21:29:59.571Z",
	"testUrl": "http://engtestsite.com/bsdk/testsuite/testharness/single/index_eugenia.html?env=qat4&file=REGRESSION_BSDK_TrackEvent_DTVR_FirstMin_5Times.xml&cdn=cdn-gl&nsdkv=600&configEnv=static-staging2&ggcmbVersion=bundled600",
	"results": [
		{
			"_baseurl": "https://secure-qat4.imrworldwide.com/cgi-bin/gn",
			"_sentAt": "2020-02-19T21:24:48.363Z",
			"prd": "session",
			"c9": "devid,",
			"c13": "asid,DHG163HR-BH45-JKY6-BKH7-67GJKY68GJK7",
			"sessionId": "eHfeaNam3P0WAi9cIqNlm33z4LumF1582147488",
			"c16": "sdkv,bj.6.0.0",
			"uoo": "",
			"retry": "0"
		},
		{
			"_baseurl": "https://secure-qat4.imrworldwide.com/cgi-bin/tsv",
			"_sentAt": "2020-02-19T21:24:52.244Z",
			"id3": "www.nielsen.com/X100zdCIGeIlgZnkYj6UvQ",
			"fmt": "json",
			"pli": "15821474881978279",
			"segment1": "",
			"segment2": "",
			"tsvevt": "tsvupdate",
			"nmspc": "NOLBUNDLE"
		},
		{
			"_baseurl": "https://secure-qat4.imrworldwide.com/cgi-bin/d",
			"_sentAt": "2020-02-19T21:24:52.379Z",
			"ci": "us-506843",
			"sessionId": "eHfeaNam3P0WAi9cIqNlm33z4LumF1582147488",
			"c29": "plid,15821474881978279",
			"c30": "bldv,6.0.0.474",
			"davty": "0",
			"forward": "1",
			"c6": "mtvr,b01",
			"ca": "FD_LL-La28siY_RNousaZvt0Q",
			"pc": "DHG163HR-BH45-JKY6-BKH7-67GJKY68GJK7",
			"cr": "2_00_90_I205_00000_0",
			"segment1": "",
			"segment2": "",
			"c9": "devid,",
			"c8": "devgrp,",
			"c7": "osgrp,",
			"c1": "nuid,ISLSSART1SQdcrj8awOFxAfeMRuw71582147488",
			"c10": "plt,",
			"plugv": "",
			"playerv": "",
			"c11": "agg,1",
			"c12": "apv,",
			"c13": "asid,DHG163HR-BH45-JKY6-BKH7-67GJKY68GJK7",
			"c15": "apn,",
			"c16": "sdkv,bj.6.0.0",
			"c14": "osver,NA",
			"h33": "2",
			"c26": "dmap,3",
			"c27": "cln,0",
			"at": "start",
			"rt": "video",
			"st": "mtvr",
			"vn": "1",
			"c24": "zip,99",
			"dd": "",
			"hrd": "",
			"wkd": "",
			"uoo": "",
			"c68": "bndlid,",
			"c61": "createtm,1582147492",
			"nodeTM": "",
			"logTM": "",
			"c73": "phtype,",
			"c74": "dvcnm,",
			"c62": "sendTime,1582147492",
			"rnd": "56269"
		},
		{
			"_baseurl": "https://secure-qat4.imrworldwide.com/cgi-bin/tsv",
			"_sentAt": "2020-02-19T21:25:21.208Z",
			"id3": "www.nielsen.com/X100zdCIGeIlgZnkYj6UvQ",
			"fmt": "json",
			"pli": "15821474881978279",
			"segment1": "",
			"segment2": "",
			"tsvevt": "tsvupdate",
			"nmspc": "NOLBUNDLE"
		},
		{
			"_baseurl": "https://secure-qat4.imrworldwide.com/cgi-bin/d",
			"_sentAt": "2020-02-19T21:25:21.251Z",
			"ci": "us-506843",
			"sessionId": "eHfeaNam3P0WAi9cIqNlm33z4LumF1582147488",
			"c29": "plid,15821474881978279",
			"c30": "bldv,6.0.0.474",
			"davty": "1",
			"forward": "1",
			"c6": "mtvr,b01",
			"ca": "FD_LL-La28siY_RNousaZvt0Q",
			"pc": "DHG163HR-BH45-JKY6-BKH7-67GJKY68GJK7",
			"cr": "2_00_90_V205_00000_0",
			"segment1": "",
			"segment2": "",
			"c9": "devid,",
			"c8": "devgrp,",
			"c7": "osgrp,",
			"c1": "nuid,ISLSSART1SQdcrj8awOFxAfeMRuw71582147488",
			"c10": "plt,",
			"plugv": "",
			"playerv": "",
			"c11": "agg,1",
			"c12": "apv,",
			"c13": "asid,DHG163HR-BH45-JKY6-BKH7-67GJKY68GJK7",
			"c15": "apn,",
			"c16": "sdkv,bj.6.0.0",
			"c14": "osver,NA",
			"h33": "2",
			"c26": "dmap,3",
			"c27": "cln,30",
			"at": "view",
			"rt": "video",
			"st": "mtvr",
			"vn": "1",
			"c24": "zip,99",
			"dd": "",
			"hrd": "",
			"wkd": "",
			"uoo": "",
			"c68": "bndlid,",
			"c61": "createtm,1582147521",
			"nodeTM": "",
			"logTM": "",
			"c73": "phtype,",
			"c74": "dvcnm,",
			"c62": "sendTime,1582147521",
			"rnd": "653738"
		},
		{
			"_baseurl": "https://secure-qat4.imrworldwide.com/cgi-bin/d",
			"_sentAt": "2020-02-19T21:25:21.263Z",
			"ci": "us-506843",
			"sessionId": "eHfeaNam3P0WAi9cIqNlm33z4LumF1582147488",
			"c29": "plid,15821474881978279",
			"c30": "bldv,6.0.0.474",
			"davty": "1",
			"forward": "1",
			"c6": "mtvr,b01",
			"ca": "FD_LL-La28siY_RNousaZvt0Q",
			"pc": "DHG163HR-BH45-JKY6-BKH7-67GJKY68GJK7",
			"cr": "2_00_90_D205_10000_0",
			"segment1": "",
			"segment2": "",
			"c9": "devid,",
			"c8": "devgrp,",
			"c7": "osgrp,",
			"c1": "nuid,ISLSSART1SQdcrj8awOFxAfeMRuw71582147488",
			"c10": "plt,",
			"plugv": "",
			"playerv": "",
			"c11": "agg,1",
			"c12": "apv,",
			"c13": "asid,DHG163HR-BH45-JKY6-BKH7-67GJKY68GJK7",
			"c15": "apn,",
			"c16": "sdkv,bj.6.0.0",
			"c14": "osver,NA",
			"h33": "2",
			"c26": "dmap,3",
			"c27": "cln,30",
			"at": "timer",
			"rt": "video",
			"st": "mtvr",
			"vn": "1",
			"c24": "zip,99",
			"dd": "",
			"hrd": "",
			"wkd": "",
			"uoo": "",
			"c68": "bndlid,",
			"c61": "createtm,1582147521",
			"nodeTM": "",
			"logTM": "",
			"c73": "phtype,",
			"c74": "dvcnm,",
			"c62": "sendTime,1582147521",
			"rnd": "232051"
		},
		{
			"_baseurl": "https://secure-qat4.imrworldwide.com/cgi-bin/trans",
			"_sentAt": "2020-02-19T21:25:41.239Z",
			"ci": "us-506843",
			"sessionId": "eHfeaNam3P0WAi9cIqNlm33z4LumF1582147488",
			"forward": "1",
			"pc": "DHG163HR-BH45-JKY6-BKH7-67GJKY68GJK7",
			"c6": "id3,b01",
			"segment1": "",
			"segment2": "",
			"c9": "devid,",
			"c8": "devgrp,",
			"c7": "osgrp,",
			"c1": "nuid,ISLSSART1SQdcrj8awOFxAfeMRuw71582147488",
			"c10": "plt,",
			"c14": "osver,NA",
			"tp": "0:S:99:1582147492,www.nielsen.com/X100zdCIGeIlgZnkYj6UvQ",
			"channame": "defaultChannelName",
			"h33": "2",
			"c26": "dmap,3",
			"uoo": "",
			"c68": "bndlid,",
			"c61": "createtm,1582147541",
			"plugv": "",
			"playerv": "",
			"nodeTM": "",
			"logTM": "",
			"c73": "phtype,",
			"c74": "dvcnm,",
			"c62": "sendTime,1582147541",
			"rnd": "961001"
		},
		{
			"_baseurl": "https://secure-qat4.imrworldwide.com/cgi-bin/trans",
			"_sentAt": "2020-02-19T21:26:31.252Z",
			"ci": "us-506843",
			"sessionId": "eHfeaNam3P0WAi9cIqNlm33z4LumF1582147488",
			"forward": "1",
			"pc": "DHG163HR-BH45-JKY6-BKH7-67GJKY68GJK7",
			"c6": "id3,b01",
			"segment1": "",
			"segment2": "",
			"c9": "devid,",
			"c8": "devgrp,",
			"c7": "osgrp,",
			"c1": "nuid,ISLSSART1SQdcrj8awOFxAfeMRuw71582147488",
			"c10": "plt,",
			"c14": "osver,NA",
			"tp": "1:S:90:1582147551,www.nielsen.com/X100zdCIGeIlgZnkYj6UvQ",
			"channame": "defaultChannelName",
			"h33": "2",
			"c26": "dmap,3",
			"uoo": "",
			"c68": "bndlid,",
			"c61": "createtm,1582147591",
			"plugv": "",
			"playerv": "",
			"nodeTM": "",
			"logTM": "",
			"c73": "phtype,",
			"c74": "dvcnm,",
			"c62": "sendTime,1582147591",
			"rnd": "476299"
		},
		{
			"_baseurl": "https://secure-qat4.imrworldwide.com/cgi-bin/tsv",
			"_sentAt": "2020-02-19T21:26:52.231Z",
			"id3": "www.nielsen.com/X100zdCIGeIlgZnkYj6UvQ",
			"fmt": "json",
			"pli": "15821474881978279",
			"segment1": "",
			"segment2": "",
			"tsvevt": "tsvupdate",
			"nmspc": "NOLBUNDLE"
		},
		{
			"_baseurl": "https://secure-qat4.imrworldwide.com/cgi-bin/d",
			"_sentAt": "2020-02-19T21:26:52.488Z",
			"ci": "us-506843",
			"sessionId": "eHfeaNam3P0WAi9cIqNlm33z4LumF1582147488",
			"c29": "plid,15821474881978279",
			"c30": "bldv,6.0.0.474",
			"davty": "1",
			"forward": "1",
			"c6": "mtvr,b01",
			"ca": "FD_LL-La28siY_RNousaZvt0Q",
			"pc": "DHG163HR-BH45-JKY6-BKH7-67GJKY68GJK7",
			"cr": "2_00_90_D205_10000_0",
			"segment1": "",
			"segment2": "",
			"c9": "devid,",
			"c8": "devgrp,",
			"c7": "osgrp,",
			"c1": "nuid,ISLSSART1SQdcrj8awOFxAfeMRuw71582147488",
			"c10": "plt,",
			"plugv": "",
			"playerv": "",
			"c11": "agg,1",
			"c12": "apv,",
			"c13": "asid,DHG163HR-BH45-JKY6-BKH7-67GJKY68GJK7",
			"c15": "apn,",
			"c16": "sdkv,bj.6.0.0",
			"c14": "osver,NA",
			"h33": "2",
			"c26": "dmap,3",
			"c27": "cln,90",
			"at": "timer",
			"rt": "video",
			"st": "mtvr",
			"vn": "1",
			"c24": "zip,99",
			"dd": "",
			"hrd": "",
			"wkd": "",
			"uoo": "",
			"c68": "bndlid,",
			"c61": "createtm,1582147612",
			"nodeTM": "",
			"logTM": "",
			"c73": "phtype,",
			"c74": "dvcnm,",
			"c62": "sendTime,1582147612",
			"rnd": "751895"
		},
		{
			"_baseurl": "https://secure-qat4.imrworldwide.com/cgi-bin/trans",
			"_sentAt": "2020-02-19T21:27:21.266Z",
			"ci": "us-506843",
			"sessionId": "eHfeaNam3P0WAi9cIqNlm33z4LumF1582147488",
			"forward": "1",
			"pc": "DHG163HR-BH45-JKY6-BKH7-67GJKY68GJK7",
			"c6": "id3,b01",
			"segment1": "",
			"segment2": "",
			"c9": "devid,",
			"c8": "devgrp,",
			"c7": "osgrp,",
			"c1": "nuid,ISLSSART1SQdcrj8awOFxAfeMRuw71582147488",
			"c10": "plt,",
			"c14": "osver,NA",
			"tp": "2:S:90:1582147601,www.nielsen.com/X100zdCIGeIlgZnkYj6UvQ",
			"channame": "defaultChannelName",
			"h33": "2",
			"c26": "dmap,3",
			"uoo": "",
			"c68": "bndlid,",
			"c61": "createtm,1582147641",
			"plugv": "",
			"playerv": "",
			"nodeTM": "",
			"logTM": "",
			"c73": "phtype,",
			"c74": "dvcnm,",
			"c62": "sendTime,1582147641",
			"rnd": "983734"
		},
		{
			"_baseurl": "https://secure-qat4.imrworldwide.com/cgi-bin/tsv",
			"_sentAt": "2020-02-19T21:28:01.246Z",
			"id3": "www.nielsen.com/X100zdCIGeIlgZnkYj6UvQ",
			"fmt": "json",
			"pli": "15821474881978279",
			"segment1": "",
			"segment2": "",
			"tsvevt": "tsvupdate",
			"nmspc": "NOLBUNDLE"
		},
		{
			"_baseurl": "https://secure-qat4.imrworldwide.com/cgi-bin/d",
			"_sentAt": "2020-02-19T21:28:01.804Z",
			"ci": "us-506843",
			"sessionId": "eHfeaNam3P0WAi9cIqNlm33z4LumF1582147488",
			"c29": "plid,15821474881978279",
			"c30": "bldv,6.0.0.474",
			"davty": "1",
			"forward": "1",
			"c6": "mtvr,b01",
			"ca": "FD_LL-La28siY_RNousaZvt0Q",
			"pc": "DHG163HR-BH45-JKY6-BKH7-67GJKY68GJK7",
			"cr": "2_00_90_D205_10000_0",
			"segment1": "",
			"segment2": "",
			"c9": "devid,",
			"c8": "devgrp,",
			"c7": "osgrp,",
			"c1": "nuid,ISLSSART1SQdcrj8awOFxAfeMRuw71582147488",
			"c10": "plt,",
			"plugv": "",
			"playerv": "",
			"c11": "agg,1",
			"c12": "apv,",
			"c13": "asid,DHG163HR-BH45-JKY6-BKH7-67GJKY68GJK7",
			"c15": "apn,",
			"c16": "sdkv,bj.6.0.0",
			"c14": "osver,NA",
			"h33": "2",
			"c26": "dmap,3",
			"c27": "cln,60",
			"at": "timer",
			"rt": "video",
			"st": "mtvr",
			"vn": "1",
			"c24": "zip,99",
			"dd": "",
			"hrd": "",
			"wkd": "",
			"uoo": "",
			"c68": "bndlid,",
			"c61": "createtm,1582147681",
			"nodeTM": "",
			"logTM": "",
			"c73": "phtype,",
			"c74": "dvcnm,",
			"c62": "sendTime,1582147681",
			"rnd": "382244"
		},
		{
			"_baseurl": "https://secure-qat4.imrworldwide.com/cgi-bin/trans",
			"_sentAt": "2020-02-19T21:28:11.230Z",
			"ci": "us-506843",
			"sessionId": "eHfeaNam3P0WAi9cIqNlm33z4LumF1582147488",
			"forward": "1",
			"pc": "DHG163HR-BH45-JKY6-BKH7-67GJKY68GJK7",
			"c6": "id3,b01",
			"segment1": "",
			"segment2": "",
			"c9": "devid,",
			"c8": "devgrp,",
			"c7": "osgrp,",
			"c1": "nuid,ISLSSART1SQdcrj8awOFxAfeMRuw71582147488",
			"c10": "plt,",
			"c14": "osver,NA",
			"tp": "3:S:90:1582147651,www.nielsen.com/X100zdCIGeIlgZnkYj6UvQ",
			"channame": "defaultChannelName",
			"h33": "2",
			"c26": "dmap,3",
			"uoo": "",
			"c68": "bndlid,",
			"c61": "createtm,1582147691",
			"plugv": "",
			"playerv": "",
			"nodeTM": "",
			"logTM": "",
			"c73": "phtype,",
			"c74": "dvcnm,",
			"c62": "sendTime,1582147691",
			"rnd": "84805"
		},
		{
			"_baseurl": "https://secure-qat4.imrworldwide.com/cgi-bin/tsv",
			"_sentAt": "2020-02-19T21:29:01.236Z",
			"id3": "www.nielsen.com/X100zdCIGeIlgZnkYj6UvQ",
			"fmt": "json",
			"pli": "15821474881978279",
			"segment1": "",
			"segment2": "",
			"tsvevt": "tsvupdate",
			"nmspc": "NOLBUNDLE"
		},
		{
			"_baseurl": "https://secure-qat4.imrworldwide.com/cgi-bin/trans",
			"_sentAt": "2020-02-19T21:29:01.274Z",
			"ci": "us-506843",
			"sessionId": "eHfeaNam3P0WAi9cIqNlm33z4LumF1582147488",
			"forward": "1",
			"pc": "DHG163HR-BH45-JKY6-BKH7-67GJKY68GJK7",
			"c6": "id3,b01",
			"segment1": "",
			"segment2": "",
			"c9": "devid,",
			"c8": "devgrp,",
			"c7": "osgrp,",
			"c1": "nuid,ISLSSART1SQdcrj8awOFxAfeMRuw71582147488",
			"c10": "plt,",
			"c14": "osver,NA",
			"tp": "4:S:90:1582147701,www.nielsen.com/X100zdCIGeIlgZnkYj6UvQ",
			"channame": "defaultChannelName",
			"h33": "2",
			"c26": "dmap,3",
			"uoo": "",
			"c68": "bndlid,",
			"c61": "createtm,1582147741",
			"plugv": "",
			"playerv": "",
			"nodeTM": "",
			"logTM": "",
			"c73": "phtype,",
			"c74": "dvcnm,",
			"c62": "sendTime,1582147741",
			"rnd": "604184"
		},
		{
			"_baseurl": "https://secure-qat4.imrworldwide.com/cgi-bin/d",
			"_sentAt": "2020-02-19T21:29:01.327Z",
			"ci": "us-506843",
			"sessionId": "eHfeaNam3P0WAi9cIqNlm33z4LumF1582147488",
			"c29": "plid,15821474881978279",
			"c30": "bldv,6.0.0.474",
			"davty": "1",
			"forward": "1",
			"c6": "mtvr,b01",
			"ca": "FD_LL-La28siY_RNousaZvt0Q",
			"pc": "DHG163HR-BH45-JKY6-BKH7-67GJKY68GJK7",
			"cr": "2_00_90_D205_10000_0",
			"segment1": "",
			"segment2": "",
			"c9": "devid,",
			"c8": "devgrp,",
			"c7": "osgrp,",
			"c1": "nuid,ISLSSART1SQdcrj8awOFxAfeMRuw71582147488",
			"c10": "plt,",
			"plugv": "",
			"playerv": "",
			"c11": "agg,1",
			"c12": "apv,",
			"c13": "asid,DHG163HR-BH45-JKY6-BKH7-67GJKY68GJK7",
			"c15": "apn,",
			"c16": "sdkv,bj.6.0.0",
			"c14": "osver,NA",
			"h33": "2",
			"c26": "dmap,3",
			"c27": "cln,60",
			"at": "timer",
			"rt": "video",
			"st": "mtvr",
			"vn": "1",
			"c24": "zip,99",
			"dd": "",
			"hrd": "",
			"wkd": "",
			"uoo": "",
			"c68": "bndlid,",
			"c61": "createtm,1582147741",
			"nodeTM": "",
			"logTM": "",
			"c73": "phtype,",
			"c74": "dvcnm,",
			"c62": "sendTime,1582147741",
			"rnd": "998935"
		},
		{
			"_baseurl": "https://secure-qat4.imrworldwide.com/cgi-bin/d",
			"_sentAt": "2020-02-19T21:29:55.233Z",
			"ci": "us-506843",
			"sessionId": "eHfeaNam3P0WAi9cIqNlm33z4LumF1582147488",
			"c29": "plid,15821474881978279",
			"c30": "bldv,6.0.0.474",
			"davty": "2",
			"forward": "1",
			"c6": "mtvr,b01",
			"ca": "FD_LL-La28siY_RNousaZvt0Q",
			"pc": "DHG163HR-BH45-JKY6-BKH7-67GJKY68GJK7",
			"cr": "2_00_90_D205_10000_0",
			"segment1": "",
			"segment2": "",
			"c9": "devid,",
			"c8": "devgrp,",
			"c7": "osgrp,",
			"c1": "nuid,ISLSSART1SQdcrj8awOFxAfeMRuw71582147488",
			"c10": "plt,",
			"plugv": "",
			"playerv": "",
			"c11": "agg,1",
			"c12": "apv,",
			"c13": "asid,DHG163HR-BH45-JKY6-BKH7-67GJKY68GJK7",
			"c15": "apn,",
			"c16": "sdkv,bj.6.0.0",
			"c14": "osver,NA",
			"h33": "2",
			"c26": "dmap,3",
			"c27": "cln,60",
			"at": "timer",
			"rt": "video",
			"st": "mtvr",
			"vn": "1",
			"c24": "zip,99",
			"dd": "",
			"hrd": "",
			"wkd": "",
			"uoo": "",
			"c68": "bndlid,",
			"c61": "createtm,1582147795",
			"nodeTM": "",
			"logTM": "",
			"c73": "phtype,",
			"c74": "dvcnm,",
			"c62": "sendTime,1582147795",
			"rnd": "404424"
		},
		{
			"_baseurl": "https://secure-qat4.imrworldwide.com/cgi-bin/trans",
			"_sentAt": "2020-02-19T21:29:55.235Z",
			"ci": "us-506843",
			"sessionId": "eHfeaNam3P0WAi9cIqNlm33z4LumF1582147488",
			"forward": "1",
			"pc": "DHG163HR-BH45-JKY6-BKH7-67GJKY68GJK7",
			"c6": "id3,b01",
			"segment1": "",
			"segment2": "",
			"c9": "devid,",
			"c8": "devgrp,",
			"c7": "osgrp,",
			"c1": "nuid,ISLSSART1SQdcrj8awOFxAfeMRuw71582147488",
			"c10": "plt,",
			"c14": "osver,NA",
			"tp": "5:S:90:1582147751,www.nielsen.com/X100zdCIGeIlgZnkYj6UvQ",
			"channame": "defaultChannelName",
			"h33": "2",
			"c26": "dmap,3",
			"uoo": "",
			"c68": "bndlid,",
			"c61": "createtm,1582147795",
			"plugv": "",
			"playerv": "",
			"nodeTM": "",
			"logTM": "",
			"c73": "phtype,",
			"c74": "dvcnm,",
			"c62": "sendTime,1582147795",
			"rnd": "606759"
		},
		{
			"_baseurl": "https://secure-qat4.imrworldwide.com/cgi-bin/trans",
			"_sentAt": "2020-02-19T21:29:55.400Z",
			"ci": "us-506843",
			"sessionId": "eHfeaNam3P0WAi9cIqNlm33z4LumF1582147488",
			"forward": "1",
			"pc": "DHG163HR-BH45-JKY6-BKH7-67GJKY68GJK7",
			"c6": "id3,b01",
			"segment1": "",
			"segment2": "",
			"c9": "devid,",
			"c8": "devgrp,",
			"c7": "osgrp,",
			"c1": "nuid,ISLSSART1SQdcrj8awOFxAfeMRuw71582147488",
			"c10": "plt,",
			"c14": "osver,NA",
			"tp": "false",
			"channame": "defaultChannelName",
			"h33": "2",
			"c26": "dmap,3",
			"uoo": "",
			"c68": "bndlid,",
			"c61": "createtm,1582147795",
			"plugv": "",
			"playerv": "",
			"nodeTM": "",
			"logTM": "",
			"c73": "phtype,",
			"c74": "dvcnm,",
			"c62": "sendTime,1582147795",
			"rnd": "827657"
		}
	]
}