{
	"testCaseName": "REGRESSION_BSDK_GGPM_DTVR_RTVOD_Midstream_PC07_to_FD03.xml",
	"baselineGeneratedDate": "2020-02-19T20:23:05.856Z",
	"testUrl": "http://engtestsite.com/bsdk/testsuite/testharness/single/index_eugenia.html?env=qat4&file=REGRESSION_BSDK_GGPM_DTVR_RTVOD_Midstream_PC07_to_FD03.xml&cdn=cdn-gl&nsdkv=600&configEnv=static-staging2&ggcmbVersion=bundled600",
	"results": [
		{
			"_baseurl": "https://secure-qat4.imrworldwide.com/cgi-bin/gn",
			"_sentAt": "2020-02-19T20:07:55.115Z",
			"prd": "session",
			"c9": "devid,",
			"c13": "asid,DHG163HR-BH45-JKY6-BKH7-67GJKY68GJK7",
			"sessionId": "1ciN8noENi2JZY2qy0mScvqPr6BeZ1582142874",
			"c16": "sdkv,bj.6.0.0",
			"uoo": "",
			"retry": "0"
		},
		{
			"_baseurl": "https://secure-qat4.imrworldwide.com/cgi-bin/tsv",
			"_sentAt": "2020-02-19T20:07:59.076Z",
			"id3": "www.nielsen.com/sLK6sS1v0IKGqf3n2TRNwA",
			"fmt": "json",
			"pli": "15821428749135539",
			"segment1": "",
			"segment2": "",
			"tsvevt": "tsvupdate",
			"nmspc": "NOLBUNDLE"
		},
		{
			"_baseurl": "https://secure-qat4.imrworldwide.com/cgi-bin/d",
			"_sentAt": "2020-02-19T20:07:59.228Z",
			"ci": "us-506843",
			"sessionId": "1ciN8noENi2JZY2qy0mScvqPr6BeZ1582142874",
			"c29": "plid,15821428749135539",
			"c30": "bldv,6.0.0.474",
			"davty": "0",
			"forward": "1",
			"c6": "mtvr,b01",
			"ca": "PC_sLK6sS1v0IKGqf3n2TRNwA",
			"pc": "DHG163HR-BH45-JKY6-BKH7-67GJKY68GJK7",
			"cr": "2_00_90_I133_00000_1",
			"segment1": "",
			"segment2": "",
			"c9": "devid,",
			"c8": "devgrp,",
			"c7": "osgrp,",
			"c1": "nuid,Yc5w6EVvvvbPDqZ3oO7Y2pxetQDFK1582142875",
			"c10": "plt,",
			"plugv": "",
			"playerv": "",
			"c11": "agg,1",
			"c12": "apv,",
			"c13": "asid,DHG163HR-BH45-JKY6-BKH7-67GJKY68GJK7",
			"c15": "apn,",
			"c16": "sdkv,bj.6.0.0",
			"c14": "osver,NA",
			"h33": "2",
			"c26": "dmap,3",
			"c27": "cln,0",
			"at": "start",
			"rt": "video",
			"st": "mtvr",
			"vn": "1",
			"c24": "zip,99",
			"dd": "",
			"hrd": "",
			"wkd": "",
			"uoo": "",
			"c68": "bndlid,",
			"c61": "createtm,1582142879",
			"nodeTM": "",
			"logTM": "",
			"c73": "phtype,",
			"c74": "dvcnm,",
			"c62": "sendTime,1582142879",
			"rnd": "166204"
		},
		{
			"_baseurl": "https://secure-qat4.imrworldwide.com/cgi-bin/tsv",
			"_sentAt": "2020-02-19T20:08:27.955Z",
			"id3": "www.nielsen.com/sLK6sS1v0IKGqf3n2TRNwA",
			"fmt": "json",
			"pli": "15821428749135539",
			"segment1": "",
			"segment2": "",
			"tsvevt": "tsvupdate",
			"nmspc": "NOLBUNDLE"
		},
		{
			"_baseurl": "https://secure-qat4.imrworldwide.com/cgi-bin/d",
			"_sentAt": "2020-02-19T20:08:28.025Z",
			"ci": "us-506843",
			"sessionId": "1ciN8noENi2JZY2qy0mScvqPr6BeZ1582142874",
			"c29": "plid,15821428749135539",
			"c30": "bldv,6.0.0.474",
			"davty": "1",
			"forward": "1",
			"c6": "mtvr,b01",
			"ca": "PC_sLK6sS1v0IKGqf3n2TRNwA",
			"pc": "DHG163HR-BH45-JKY6-BKH7-67GJKY68GJK7",
			"cr": "2_00_90_V133_00000_1",
			"segment1": "",
			"segment2": "",
			"c9": "devid,",
			"c8": "devgrp,",
			"c7": "osgrp,",
			"c1": "nuid,Yc5w6EVvvvbPDqZ3oO7Y2pxetQDFK1582142875",
			"c10": "plt,",
			"plugv": "",
			"playerv": "",
			"c11": "agg,1",
			"c12": "apv,",
			"c13": "asid,DHG163HR-BH45-JKY6-BKH7-67GJKY68GJK7",
			"c15": "apn,",
			"c16": "sdkv,bj.6.0.0",
			"c14": "osver,NA",
			"h33": "2",
			"c26": "dmap,3",
			"c27": "cln,30",
			"at": "view",
			"rt": "video",
			"st": "mtvr",
			"vn": "1",
			"c24": "zip,99",
			"dd": "",
			"hrd": "",
			"wkd": "",
			"uoo": "",
			"c68": "bndlid,",
			"c61": "createtm,1582142907",
			"nodeTM": "",
			"logTM": "",
			"c73": "phtype,",
			"c74": "dvcnm,",
			"c62": "sendTime,1582142907",
			"rnd": "824878"
		},
		{
			"_baseurl": "https://secure-qat4.imrworldwide.com/cgi-bin/d",
			"_sentAt": "2020-02-19T20:08:28.234Z",
			"ci": "us-506843",
			"sessionId": "1ciN8noENi2JZY2qy0mScvqPr6BeZ1582142874",
			"c29": "plid,15821428749135539",
			"c30": "bldv,6.0.0.474",
			"davty": "1",
			"forward": "1",
			"c6": "mtvr,b01",
			"ca": "PC_sLK6sS1v0IKGqf3n2TRNwA",
			"pc": "DHG163HR-BH45-JKY6-BKH7-67GJKY68GJK7",
			"cr": "2_00_90_D133_10000_1",
			"segment1": "",
			"segment2": "",
			"c9": "devid,",
			"c8": "devgrp,",
			"c7": "osgrp,",
			"c1": "nuid,Yc5w6EVvvvbPDqZ3oO7Y2pxetQDFK1582142875",
			"c10": "plt,",
			"plugv": "",
			"playerv": "",
			"c11": "agg,1",
			"c12": "apv,",
			"c13": "asid,DHG163HR-BH45-JKY6-BKH7-67GJKY68GJK7",
			"c15": "apn,",
			"c16": "sdkv,bj.6.0.0",
			"c14": "osver,NA",
			"h33": "2",
			"c26": "dmap,3",
			"c27": "cln,30",
			"at": "timer",
			"rt": "video",
			"st": "mtvr",
			"vn": "1",
			"c24": "zip,99",
			"dd": "",
			"hrd": "",
			"wkd": "",
			"uoo": "",
			"c68": "bndlid,",
			"c61": "createtm,1582142908",
			"nodeTM": "",
			"logTM": "",
			"c73": "phtype,",
			"c74": "dvcnm,",
			"c62": "sendTime,1582142908",
			"rnd": "922440"
		},
		{
			"_baseurl": "https://secure-qat4.imrworldwide.com/cgi-bin/trans",
			"_sentAt": "2020-02-19T20:08:47.980Z",
			"ci": "us-506843",
			"sessionId": "1ciN8noENi2JZY2qy0mScvqPr6BeZ1582142874",
			"forward": "1",
			"pc": "DHG163HR-BH45-JKY6-BKH7-67GJKY68GJK7",
			"c6": "id3,b01",
			"segment1": "",
			"segment2": "",
			"c9": "devid,",
			"c8": "devgrp,",
			"c7": "osgrp,",
			"c1": "nuid,Yc5w6EVvvvbPDqZ3oO7Y2pxetQDFK1582142875",
			"c10": "plt,",
			"c14": "osver,NA",
			"tp": "0:S:99:1582142879,www.nielsen.com/sLK6sS1v0IKGqf3n2TRNwA",
			"channame": "defaultChannelName",
			"h33": "2",
			"c26": "dmap,3",
			"uoo": "",
			"c68": "bndlid,",
			"c61": "createtm,1582142927",
			"plugv": "",
			"playerv": "",
			"nodeTM": "",
			"logTM": "",
			"c73": "phtype,",
			"c74": "dvcnm,",
			"c62": "sendTime,1582142927",
			"rnd": "320654"
		},
		{
			"_baseurl": "https://secure-qat4.imrworldwide.com/cgi-bin/trans",
			"_sentAt": "2020-02-19T20:09:38.979Z",
			"ci": "us-506843",
			"sessionId": "1ciN8noENi2JZY2qy0mScvqPr6BeZ1582142874",
			"forward": "1",
			"pc": "DHG163HR-BH45-JKY6-BKH7-67GJKY68GJK7",
			"c6": "id3,b01",
			"segment1": "",
			"segment2": "",
			"c9": "devid,",
			"c8": "devgrp,",
			"c7": "osgrp,",
			"c1": "nuid,Yc5w6EVvvvbPDqZ3oO7Y2pxetQDFK1582142875",
			"c10": "plt,",
			"c14": "osver,NA",
			"tp": "1:S:90:1582142938,www.nielsen.com/sLK6sS1v0IKGqf3n2TRNwA",
			"channame": "defaultChannelName",
			"h33": "2",
			"c26": "dmap,3",
			"uoo": "",
			"c68": "bndlid,",
			"c61": "createtm,1582142978",
			"plugv": "",
			"playerv": "",
			"nodeTM": "",
			"logTM": "",
			"c73": "phtype,",
			"c74": "dvcnm,",
			"c62": "sendTime,1582142978",
			"rnd": "148117"
		},
		{
			"_baseurl": "https://secure-qat4.imrworldwide.com/cgi-bin/trans",
			"_sentAt": "2020-02-19T20:10:37.970Z",
			"ci": "us-506843",
			"sessionId": "1ciN8noENi2JZY2qy0mScvqPr6BeZ1582142874",
			"forward": "1",
			"pc": "DHG163HR-BH45-JKY6-BKH7-67GJKY68GJK7",
			"c6": "id3,b01",
			"segment1": "",
			"segment2": "",
			"c9": "devid,",
			"c8": "devgrp,",
			"c7": "osgrp,",
			"c1": "nuid,Yc5w6EVvvvbPDqZ3oO7Y2pxetQDFK1582142875",
			"c10": "plt,",
			"c14": "osver,NA",
			"tp": "2:S:90:1582142988,www.nielsen.com/sLK6sS1v0IKGqf3n2TRNwA",
			"channame": "defaultChannelName",
			"h33": "2",
			"c26": "dmap,3",
			"uoo": "",
			"c68": "bndlid,",
			"c61": "createtm,1582143037",
			"plugv": "",
			"playerv": "",
			"nodeTM": "",
			"logTM": "",
			"c73": "phtype,",
			"c74": "dvcnm,",
			"c62": "sendTime,1582143037",
			"rnd": "51363"
		},
		{
			"_baseurl": "https://secure-qat4.imrworldwide.com/cgi-bin/trans",
			"_sentAt": "2020-02-19T20:11:38.025Z",
			"ci": "us-506843",
			"sessionId": "1ciN8noENi2JZY2qy0mScvqPr6BeZ1582142874",
			"forward": "1",
			"pc": "DHG163HR-BH45-JKY6-BKH7-67GJKY68GJK7",
			"c6": "id3,b01",
			"segment1": "",
			"segment2": "",
			"c9": "devid,",
			"c8": "devgrp,",
			"c7": "osgrp,",
			"c1": "nuid,Yc5w6EVvvvbPDqZ3oO7Y2pxetQDFK1582142875",
			"c10": "plt,",
			"c14": "osver,NA",
			"tp": "3:S:90:1582143048,www.nielsen.com/sLK6sS1v0IKGqf3n2TRNwA",
			"channame": "defaultChannelName",
			"h33": "2",
			"c26": "dmap,3",
			"uoo": "",
			"c68": "bndlid,",
			"c61": "createtm,1582143097",
			"plugv": "",
			"playerv": "",
			"nodeTM": "",
			"logTM": "",
			"c73": "phtype,",
			"c74": "dvcnm,",
			"c62": "sendTime,1582143097",
			"rnd": "839153"
		},
		{
			"_baseurl": "https://secure-qat4.imrworldwide.com/cgi-bin/tsv",
			"_sentAt": "2020-02-19T20:12:37.959Z",
			"id3": "www.nielsen.com/sLK6sS1v0IKGqf3n2TRNwA",
			"fmt": "json",
			"pli": "15821428749135539",
			"segment1": "",
			"segment2": "",
			"tsvevt": "tsvupdate",
			"nmspc": "NOLBUNDLE"
		},
		{
			"_baseurl": "https://secure-qat4.imrworldwide.com/cgi-bin/trans",
			"_sentAt": "2020-02-19T20:12:38.030Z",
			"ci": "us-506843",
			"sessionId": "1ciN8noENi2JZY2qy0mScvqPr6BeZ1582142874",
			"forward": "1",
			"pc": "DHG163HR-BH45-JKY6-BKH7-67GJKY68GJK7",
			"c6": "id3,b01",
			"segment1": "",
			"segment2": "",
			"c9": "devid,",
			"c8": "devgrp,",
			"c7": "osgrp,",
			"c1": "nuid,Yc5w6EVvvvbPDqZ3oO7Y2pxetQDFK1582142875",
			"c10": "plt,",
			"c14": "osver,NA",
			"tp": "4:S:90:1582143108,www.nielsen.com/sLK6sS1v0IKGqf3n2TRNwA",
			"channame": "defaultChannelName",
			"h33": "2",
			"c26": "dmap,3",
			"uoo": "",
			"c68": "bndlid,",
			"c61": "createtm,1582143157",
			"plugv": "",
			"playerv": "",
			"nodeTM": "",
			"logTM": "",
			"c73": "phtype,",
			"c74": "dvcnm,",
			"c62": "sendTime,1582143158",
			"rnd": "994254"
		},
		{
			"_baseurl": "https://secure-qat4.imrworldwide.com/cgi-bin/d",
			"_sentAt": "2020-02-19T20:12:38.149Z",
			"ci": "us-506843",
			"sessionId": "1ciN8noENi2JZY2qy0mScvqPr6BeZ1582142874",
			"c29": "plid,15821428749135539",
			"c30": "bldv,6.0.0.474",
			"davty": "1",
			"forward": "1",
			"c6": "mtvr,b01",
			"ca": "PC_sLK6sS1v0IKGqf3n2TRNwA",
			"pc": "DHG163HR-BH45-JKY6-BKH7-67GJKY68GJK7",
			"cr": "2_07_90_D133_01111_1",
			"segment1": "",
			"segment2": "",
			"c9": "devid,",
			"c8": "devgrp,",
			"c7": "osgrp,",
			"c1": "nuid,Yc5w6EVvvvbPDqZ3oO7Y2pxetQDFK1582142875",
			"c10": "plt,",
			"plugv": "",
			"playerv": "",
			"c11": "agg,1",
			"c12": "apv,",
			"c13": "asid,DHG163HR-BH45-JKY6-BKH7-67GJKY68GJK7",
			"c15": "apn,",
			"c16": "sdkv,bj.6.0.0",
			"c14": "osver,NA",
			"h33": "2",
			"c26": "dmap,3",
			"c27": "cln,248",
			"at": "timer",
			"rt": "video",
			"st": "mtvr",
			"vn": "1",
			"c24": "zip,99",
			"dd": "",
			"hrd": "",
			"wkd": "",
			"uoo": "",
			"c68": "bndlid,",
			"c61": "createtm,1582143158",
			"nodeTM": "",
			"logTM": "",
			"c73": "phtype,",
			"c74": "dvcnm,",
			"c62": "sendTime,1582143158",
			"rnd": "452032"
		},
		{
			"_baseurl": "https://secure-qat4.imrworldwide.com/cgi-bin/tsv",
			"_sentAt": "2020-02-19T20:12:58.965Z",
			"id3": "www.nielsen.com/X100zdCIGeIlgZnkYj6UvQ",
			"fmt": "json",
			"pli": "15821428749135539",
			"segment1": "",
			"segment2": "",
			"tsvevt": "tsvupdate",
			"nmspc": "NOLBUNDLE"
		},
		{
			"_baseurl": "https://secure-qat4.imrworldwide.com/cgi-bin/trans",
			"_sentAt": "2020-02-19T20:12:59.039Z",
			"ci": "us-506843",
			"sessionId": "1ciN8noENi2JZY2qy0mScvqPr6BeZ1582142874",
			"forward": "1",
			"pc": "DHG163HR-BH45-JKY6-BKH7-67GJKY68GJK7",
			"c6": "id3,b01",
			"segment1": "",
			"segment2": "",
			"c9": "devid,",
			"c8": "devgrp,",
			"c7": "osgrp,",
			"c1": "nuid,Yc5w6EVvvvbPDqZ3oO7Y2pxetQDFK1582142875",
			"c10": "plt,",
			"c14": "osver,NA",
			"tp": "5:S:90:1582143168,www.nielsen.com/sLK6sS1v0IKGqf3n2TRNwA",
			"channame": "defaultChannelName",
			"h33": "2",
			"c26": "dmap,3",
			"uoo": "",
			"c68": "bndlid,",
			"c61": "createtm,1582143178",
			"plugv": "",
			"playerv": "",
			"nodeTM": "",
			"logTM": "",
			"c73": "phtype,",
			"c74": "dvcnm,",
			"c62": "sendTime,1582143178",
			"rnd": "613246"
		},
		{
			"_baseurl": "https://secure-qat4.imrworldwide.com/cgi-bin/d",
			"_sentAt": "2020-02-19T20:12:59.102Z",
			"ci": "us-506843",
			"sessionId": "1ciN8noENi2JZY2qy0mScvqPr6BeZ1582142874",
			"c29": "plid,15821428749135539",
			"c30": "bldv,6.0.0.474",
			"davty": "0",
			"forward": "1",
			"c6": "mtvr,b01",
			"ca": "FD_sDS6sS1v0IKGqf3n2TRNwA",
			"pc": "DHG163HR-BH45-JKY6-BKH7-67GJKY68GJK7",
			"cr": "2_00_98_I133_00000_1",
			"segment1": "",
			"segment2": "",
			"c9": "devid,",
			"c8": "devgrp,",
			"c7": "osgrp,",
			"c1": "nuid,Yc5w6EVvvvbPDqZ3oO7Y2pxetQDFK1582142875",
			"c10": "plt,",
			"plugv": "",
			"playerv": "",
			"c11": "agg,1",
			"c12": "apv,",
			"c13": "asid,DHG163HR-BH45-JKY6-BKH7-67GJKY68GJK7",
			"c15": "apn,",
			"c16": "sdkv,bj.6.0.0",
			"c14": "osver,NA",
			"h33": "2",
			"c26": "dmap,3",
			"c27": "cln,0",
			"at": "start",
			"rt": "video",
			"st": "mtvr",
			"vn": "1",
			"c24": "zip,99",
			"dd": "",
			"hrd": "",
			"wkd": "",
			"uoo": "",
			"c68": "bndlid,",
			"c61": "createtm,1582143179",
			"nodeTM": "",
			"logTM": "",
			"c73": "phtype,",
			"c74": "dvcnm,",
			"c62": "sendTime,1582143179",
			"rnd": "624489"
		},
		{
			"_baseurl": "https://secure-qat4.imrworldwide.com/cgi-bin/tsv",
			"_sentAt": "2020-02-19T20:13:27.933Z",
			"id3": "www.nielsen.com/X100zdCIGeIlgZnkYj6UvQ",
			"fmt": "json",
			"pli": "15821428749135539",
			"segment1": "",
			"segment2": "",
			"tsvevt": "tsvupdate",
			"nmspc": "NOLBUNDLE"
		},
		{
			"_baseurl": "https://secure-qat4.imrworldwide.com/cgi-bin/d",
			"_sentAt": "2020-02-19T20:13:28.011Z",
			"ci": "us-506843",
			"sessionId": "1ciN8noENi2JZY2qy0mScvqPr6BeZ1582142874",
			"c29": "plid,15821428749135539",
			"c30": "bldv,6.0.0.474",
			"davty": "1",
			"forward": "1",
			"c6": "mtvr,b01",
			"ca": "FD_sDS6sS1v0IKGqf3n2TRNwA",
			"pc": "DHG163HR-BH45-JKY6-BKH7-67GJKY68GJK7",
			"cr": "2_00_98_V133_00000_1",
			"segment1": "",
			"segment2": "",
			"c9": "devid,",
			"c8": "devgrp,",
			"c7": "osgrp,",
			"c1": "nuid,Yc5w6EVvvvbPDqZ3oO7Y2pxetQDFK1582142875",
			"c10": "plt,",
			"plugv": "",
			"playerv": "",
			"c11": "agg,1",
			"c12": "apv,",
			"c13": "asid,DHG163HR-BH45-JKY6-BKH7-67GJKY68GJK7",
			"c15": "apn,",
			"c16": "sdkv,bj.6.0.0",
			"c14": "osver,NA",
			"h33": "2",
			"c26": "dmap,3",
			"c27": "cln,30",
			"at": "view",
			"rt": "video",
			"st": "mtvr",
			"vn": "1",
			"c24": "zip,99",
			"dd": "",
			"hrd": "",
			"wkd": "",
			"uoo": "",
			"c68": "bndlid,",
			"c61": "createtm,1582143207",
			"nodeTM": "",
			"logTM": "",
			"c73": "phtype,",
			"c74": "dvcnm,",
			"c62": "sendTime,1582143207",
			"rnd": "340393"
		},
		{
			"_baseurl": "https://secure-qat4.imrworldwide.com/cgi-bin/d",
			"_sentAt": "2020-02-19T20:13:28.032Z",
			"ci": "us-506843",
			"sessionId": "1ciN8noENi2JZY2qy0mScvqPr6BeZ1582142874",
			"c29": "plid,15821428749135539",
			"c30": "bldv,6.0.0.474",
			"davty": "1",
			"forward": "1",
			"c6": "mtvr,b01",
			"ca": "FD_sDS6sS1v0IKGqf3n2TRNwA",
			"pc": "DHG163HR-BH45-JKY6-BKH7-67GJKY68GJK7",
			"cr": "2_00_98_D133_10000_1",
			"segment1": "",
			"segment2": "",
			"c9": "devid,",
			"c8": "devgrp,",
			"c7": "osgrp,",
			"c1": "nuid,Yc5w6EVvvvbPDqZ3oO7Y2pxetQDFK1582142875",
			"c10": "plt,",
			"plugv": "",
			"playerv": "",
			"c11": "agg,1",
			"c12": "apv,",
			"c13": "asid,DHG163HR-BH45-JKY6-BKH7-67GJKY68GJK7",
			"c15": "apn,",
			"c16": "sdkv,bj.6.0.0",
			"c14": "osver,NA",
			"h33": "2",
			"c26": "dmap,3",
			"c27": "cln,30",
			"at": "timer",
			"rt": "video",
			"st": "mtvr",
			"vn": "1",
			"c24": "zip,99",
			"dd": "",
			"hrd": "",
			"wkd": "",
			"uoo": "",
			"c68": "bndlid,",
			"c61": "createtm,1582143208",
			"nodeTM": "",
			"logTM": "",
			"c73": "phtype,",
			"c74": "dvcnm,",
			"c62": "sendTime,1582143208",
			"rnd": "612316"
		},
		{
			"_baseurl": "https://secure-qat4.imrworldwide.com/cgi-bin/trans",
			"_sentAt": "2020-02-19T20:13:47.982Z",
			"ci": "us-506843",
			"sessionId": "1ciN8noENi2JZY2qy0mScvqPr6BeZ1582142874",
			"forward": "1",
			"pc": "DHG163HR-BH45-JKY6-BKH7-67GJKY68GJK7",
			"c6": "id3,b01",
			"segment1": "",
			"segment2": "",
			"c9": "devid,",
			"c8": "devgrp,",
			"c7": "osgrp,",
			"c1": "nuid,Yc5w6EVvvvbPDqZ3oO7Y2pxetQDFK1582142875",
			"c10": "plt,",
			"c14": "osver,NA",
			"tp": "0:S:90:1582143179,www.nielsen.com/X100zdCIGeIlgZnkYj6UvQ",
			"channame": "defaultChannelName",
			"h33": "2",
			"c26": "dmap,3",
			"uoo": "",
			"c68": "bndlid,",
			"c61": "createtm,1582143227",
			"plugv": "",
			"playerv": "",
			"nodeTM": "",
			"logTM": "",
			"c73": "phtype,",
			"c74": "dvcnm,",
			"c62": "sendTime,1582143227",
			"rnd": "98283"
		},
		{
			"_baseurl": "https://secure-qat4.imrworldwide.com/cgi-bin/trans",
			"_sentAt": "2020-02-19T20:14:47.983Z",
			"ci": "us-506843",
			"sessionId": "1ciN8noENi2JZY2qy0mScvqPr6BeZ1582142874",
			"forward": "1",
			"pc": "DHG163HR-BH45-JKY6-BKH7-67GJKY68GJK7",
			"c6": "id3,b01",
			"segment1": "",
			"segment2": "",
			"c9": "devid,",
			"c8": "devgrp,",
			"c7": "osgrp,",
			"c1": "nuid,Yc5w6EVvvvbPDqZ3oO7Y2pxetQDFK1582142875",
			"c10": "plt,",
			"c14": "osver,NA",
			"tp": "1:S:98:1582143238,www.nielsen.com/X100zdCIGeIlgZnkYj6UvQ",
			"channame": "defaultChannelName",
			"h33": "2",
			"c26": "dmap,3",
			"uoo": "",
			"c68": "bndlid,",
			"c61": "createtm,1582143287",
			"plugv": "",
			"playerv": "",
			"nodeTM": "",
			"logTM": "",
			"c73": "phtype,",
			"c74": "dvcnm,",
			"c62": "sendTime,1582143287",
			"rnd": "214842"
		},
		{
			"_baseurl": "https://secure-qat4.imrworldwide.com/cgi-bin/trans",
			"_sentAt": "2020-02-19T20:15:47.980Z",
			"ci": "us-506843",
			"sessionId": "1ciN8noENi2JZY2qy0mScvqPr6BeZ1582142874",
			"forward": "1",
			"pc": "DHG163HR-BH45-JKY6-BKH7-67GJKY68GJK7",
			"c6": "id3,b01",
			"segment1": "",
			"segment2": "",
			"c9": "devid,",
			"c8": "devgrp,",
			"c7": "osgrp,",
			"c1": "nuid,Yc5w6EVvvvbPDqZ3oO7Y2pxetQDFK1582142875",
			"c10": "plt,",
			"c14": "osver,NA",
			"tp": "2:S:98:1582143298,www.nielsen.com/X100zdCIGeIlgZnkYj6UvQ",
			"channame": "defaultChannelName",
			"h33": "2",
			"c26": "dmap,3",
			"uoo": "",
			"c68": "bndlid,",
			"c61": "createtm,1582143347",
			"plugv": "",
			"playerv": "",
			"nodeTM": "",
			"logTM": "",
			"c73": "phtype,",
			"c74": "dvcnm,",
			"c62": "sendTime,1582143347",
			"rnd": "909519"
		},
		{
			"_baseurl": "https://secure-qat4.imrworldwide.com/cgi-bin/trans",
			"_sentAt": "2020-02-19T20:16:48.003Z",
			"ci": "us-506843",
			"sessionId": "1ciN8noENi2JZY2qy0mScvqPr6BeZ1582142874",
			"forward": "1",
			"pc": "DHG163HR-BH45-JKY6-BKH7-67GJKY68GJK7",
			"c6": "id3,b01",
			"segment1": "",
			"segment2": "",
			"c9": "devid,",
			"c8": "devgrp,",
			"c7": "osgrp,",
			"c1": "nuid,Yc5w6EVvvvbPDqZ3oO7Y2pxetQDFK1582142875",
			"c10": "plt,",
			"c14": "osver,NA",
			"tp": "3:S:98:1582143358,www.nielsen.com/X100zdCIGeIlgZnkYj6UvQ",
			"channame": "defaultChannelName",
			"h33": "2",
			"c26": "dmap,3",
			"uoo": "",
			"c68": "bndlid,",
			"c61": "createtm,1582143407",
			"plugv": "",
			"playerv": "",
			"nodeTM": "",
			"logTM": "",
			"c73": "phtype,",
			"c74": "dvcnm,",
			"c62": "sendTime,1582143407",
			"rnd": "519551"
		},
		{
			"_baseurl": "https://secure-qat4.imrworldwide.com/cgi-bin/d",
			"_sentAt": "2020-02-19T20:17:07.986Z",
			"ci": "us-506843",
			"sessionId": "1ciN8noENi2JZY2qy0mScvqPr6BeZ1582142874",
			"c29": "plid,15821428749135539",
			"c30": "bldv,6.0.0.474",
			"davty": "1",
			"forward": "1",
			"c6": "mtvr,b01",
			"ca": "FD_sDS6sS1v0IKGqf3n2TRNwA",
			"pc": "DHG163HR-BH45-JKY6-BKH7-67GJKY68GJK7",
			"aqhflg": "1",
			"cr": "2_00_98_Q45_1_1",
			"segment1": "",
			"segment2": "",
			"c9": "devid,",
			"plugv": "",
			"playerv": "",
			"c8": "devgrp,",
			"c7": "osgrp,",
			"c1": "nuid,Yc5w6EVvvvbPDqZ3oO7Y2pxetQDFK1582142875",
			"c10": "plt,",
			"c11": "agg,1",
			"c12": "apv,",
			"c13": "asid,DHG163HR-BH45-JKY6-BKH7-67GJKY68GJK7",
			"c14": "osver,NA",
			"c16": "sdkv,bj.6.0.0",
			"h33": "2",
			"c26": "dmap,3",
			"at": "view",
			"rt": "video",
			"st": "mtvr",
			"vn": "1",
			"c15": "apn,",
			"c24": "zip,99",
			"dd": "",
			"hrd": "",
			"wkd": "",
			"uoo": "",
			"c68": "bndlid,",
			"c61": "createtm,1582143427",
			"nodeTM": "",
			"logTM": "",
			"c73": "phtype,",
			"c74": "dvcnm,",
			"c62": "sendTime,1582143427",
			"rnd": "75346"
		},
		{
			"_baseurl": "https://secure-qat4.imrworldwide.com/cgi-bin/tsv",
			"_sentAt": "2020-02-19T20:17:37.988Z",
			"id3": "www.nielsen.com/X100zdCIGeIlgZnkYj6UvQ",
			"fmt": "json",
			"pli": "15821428749135539",
			"segment1": "",
			"segment2": "",
			"tsvevt": "tsvupdate",
			"nmspc": "NOLBUNDLE"
		},
		{
			"_baseurl": "https://secure-qat4.imrworldwide.com/cgi-bin/d",
			"_sentAt": "2020-02-19T20:17:38.627Z",
			"ci": "us-506843",
			"sessionId": "1ciN8noENi2JZY2qy0mScvqPr6BeZ1582142874",
			"c29": "plid,15821428749135539",
			"c30": "bldv,6.0.0.474",
			"davty": "1",
			"forward": "1",
			"c6": "mtvr,b01",
			"ca": "FD_sDS6sS1v0IKGqf3n2TRNwA",
			"pc": "DHG163HR-BH45-JKY6-BKH7-67GJKY68GJK7",
			"cr": "2_00_98_D133_01111_1",
			"segment1": "",
			"segment2": "",
			"c9": "devid,",
			"c8": "devgrp,",
			"c7": "osgrp,",
			"c1": "nuid,Yc5w6EVvvvbPDqZ3oO7Y2pxetQDFK1582142875",
			"c10": "plt,",
			"plugv": "",
			"playerv": "",
			"c11": "agg,1",
			"c12": "apv,",
			"c13": "asid,DHG163HR-BH45-JKY6-BKH7-67GJKY68GJK7",
			"c15": "apn,",
			"c16": "sdkv,bj.6.0.0",
			"c14": "osver,NA",
			"h33": "2",
			"c26": "dmap,3",
			"c27": "cln,248",
			"at": "timer",
			"rt": "video",
			"st": "mtvr",
			"vn": "1",
			"c24": "zip,99",
			"dd": "",
			"hrd": "",
			"wkd": "",
			"uoo": "",
			"c68": "bndlid,",
			"c61": "createtm,1582143458",
			"nodeTM": "",
			"logTM": "",
			"c73": "phtype,",
			"c74": "dvcnm,",
			"c62": "sendTime,1582143458",
			"rnd": "610752"
		},
		{
			"_baseurl": "https://secure-qat4.imrworldwide.com/cgi-bin/trans",
			"_sentAt": "2020-02-19T20:17:48.060Z",
			"ci": "us-506843",
			"sessionId": "1ciN8noENi2JZY2qy0mScvqPr6BeZ1582142874",
			"forward": "1",
			"pc": "DHG163HR-BH45-JKY6-BKH7-67GJKY68GJK7",
			"c6": "id3,b01",
			"segment1": "",
			"segment2": "",
			"c9": "devid,",
			"c8": "devgrp,",
			"c7": "osgrp,",
			"c1": "nuid,Yc5w6EVvvvbPDqZ3oO7Y2pxetQDFK1582142875",
			"c10": "plt,",
			"c14": "osver,NA",
			"tp": "4:S:98:1582143418,www.nielsen.com/X100zdCIGeIlgZnkYj6UvQ",
			"channame": "defaultChannelName",
			"h33": "2",
			"c26": "dmap,3",
			"uoo": "",
			"c68": "bndlid,",
			"c61": "createtm,1582143468",
			"plugv": "",
			"playerv": "",
			"nodeTM": "",
			"logTM": "",
			"c73": "phtype,",
			"c74": "dvcnm,",
			"c62": "sendTime,1582143468",
			"rnd": "134001"
		},
		{
			"_baseurl": "https://secure-qat4.imrworldwide.com/cgi-bin/trans",
			"_sentAt": "2020-02-19T20:18:37.991Z",
			"ci": "us-506843",
			"sessionId": "1ciN8noENi2JZY2qy0mScvqPr6BeZ1582142874",
			"forward": "1",
			"pc": "DHG163HR-BH45-JKY6-BKH7-67GJKY68GJK7",
			"c6": "id3,b01",
			"segment1": "",
			"segment2": "",
			"c9": "devid,",
			"c8": "devgrp,",
			"c7": "osgrp,",
			"c1": "nuid,Yc5w6EVvvvbPDqZ3oO7Y2pxetQDFK1582142875",
			"c10": "plt,",
			"c14": "osver,NA",
			"tp": "5:S:98:1582143478,www.nielsen.com/X100zdCIGeIlgZnkYj6UvQ",
			"channame": "defaultChannelName",
			"h33": "2",
			"c26": "dmap,3",
			"uoo": "",
			"c68": "bndlid,",
			"c61": "createtm,1582143517",
			"plugv": "",
			"playerv": "",
			"nodeTM": "",
			"logTM": "",
			"c73": "phtype,",
			"c74": "dvcnm,",
			"c62": "sendTime,1582143517",
			"rnd": "921810"
		},
		{
			"_baseurl": "https://secure-qat4.imrworldwide.com/cgi-bin/trans",
			"_sentAt": "2020-02-19T20:19:38.011Z",
			"ci": "us-506843",
			"sessionId": "1ciN8noENi2JZY2qy0mScvqPr6BeZ1582142874",
			"forward": "1",
			"pc": "DHG163HR-BH45-JKY6-BKH7-67GJKY68GJK7",
			"c6": "id3,b01",
			"segment1": "",
			"segment2": "",
			"c9": "devid,",
			"c8": "devgrp,",
			"c7": "osgrp,",
			"c1": "nuid,Yc5w6EVvvvbPDqZ3oO7Y2pxetQDFK1582142875",
			"c10": "plt,",
			"c14": "osver,NA",
			"tp": "6:S:98:1582143528,www.nielsen.com/X100zdCIGeIlgZnkYj6UvQ",
			"channame": "defaultChannelName",
			"h33": "2",
			"c26": "dmap,3",
			"uoo": "",
			"c68": "bndlid,",
			"c61": "createtm,1582143577",
			"plugv": "",
			"playerv": "",
			"nodeTM": "",
			"logTM": "",
			"c73": "phtype,",
			"c74": "dvcnm,",
			"c62": "sendTime,1582143577",
			"rnd": "360912"
		},
		{
			"_baseurl": "https://secure-qat4.imrworldwide.com/cgi-bin/trans",
			"_sentAt": "2020-02-19T20:20:38.101Z",
			"ci": "us-506843",
			"sessionId": "1ciN8noENi2JZY2qy0mScvqPr6BeZ1582142874",
			"forward": "1",
			"pc": "DHG163HR-BH45-JKY6-BKH7-67GJKY68GJK7",
			"c6": "id3,b01",
			"segment1": "",
			"segment2": "",
			"c9": "devid,",
			"c8": "devgrp,",
			"c7": "osgrp,",
			"c1": "nuid,Yc5w6EVvvvbPDqZ3oO7Y2pxetQDFK1582142875",
			"c10": "plt,",
			"c14": "osver,NA",
			"tp": "7:S:98:1582143588,www.nielsen.com/X100zdCIGeIlgZnkYj6UvQ",
			"channame": "defaultChannelName",
			"h33": "2",
			"c26": "dmap,3",
			"uoo": "",
			"c68": "bndlid,",
			"c61": "createtm,1582143638",
			"plugv": "",
			"playerv": "",
			"nodeTM": "",
			"logTM": "",
			"c73": "phtype,",
			"c74": "dvcnm,",
			"c62": "sendTime,1582143638",
			"rnd": "311925"
		},
		{
			"_baseurl": "https://secure-qat4.imrworldwide.com/cgi-bin/trans",
			"_sentAt": "2020-02-19T20:21:38.091Z",
			"ci": "us-506843",
			"sessionId": "1ciN8noENi2JZY2qy0mScvqPr6BeZ1582142874",
			"forward": "1",
			"pc": "DHG163HR-BH45-JKY6-BKH7-67GJKY68GJK7",
			"c6": "id3,b01",
			"segment1": "",
			"segment2": "",
			"c9": "devid,",
			"c8": "devgrp,",
			"c7": "osgrp,",
			"c1": "nuid,Yc5w6EVvvvbPDqZ3oO7Y2pxetQDFK1582142875",
			"c10": "plt,",
			"c14": "osver,NA",
			"tp": "8:S:98:1582143648,www.nielsen.com/X100zdCIGeIlgZnkYj6UvQ",
			"channame": "defaultChannelName",
			"h33": "2",
			"c26": "dmap,3",
			"uoo": "",
			"c68": "bndlid,",
			"c61": "createtm,1582143698",
			"plugv": "",
			"playerv": "",
			"nodeTM": "",
			"logTM": "",
			"c73": "phtype,",
			"c74": "dvcnm,",
			"c62": "sendTime,1582143698",
			"rnd": "218234"
		},
		{
			"_baseurl": "https://secure-qat4.imrworldwide.com/cgi-bin/tsv",
			"_sentAt": "2020-02-19T20:22:37.953Z",
			"id3": "www.nielsen.com/X100zdCIGeIlgZnkYj6UvQ",
			"fmt": "json",
			"pli": "15821428749135539",
			"segment1": "",
			"segment2": "",
			"tsvevt": "tsvupdate",
			"nmspc": "NOLBUNDLE"
		},
		{
			"_baseurl": "https://secure-qat4.imrworldwide.com/cgi-bin/trans",
			"_sentAt": "2020-02-19T20:22:38.032Z",
			"ci": "us-506843",
			"sessionId": "1ciN8noENi2JZY2qy0mScvqPr6BeZ1582142874",
			"forward": "1",
			"pc": "DHG163HR-BH45-JKY6-BKH7-67GJKY68GJK7",
			"c6": "id3,b01",
			"segment1": "",
			"segment2": "",
			"c9": "devid,",
			"c8": "devgrp,",
			"c7": "osgrp,",
			"c1": "nuid,Yc5w6EVvvvbPDqZ3oO7Y2pxetQDFK1582142875",
			"c10": "plt,",
			"c14": "osver,NA",
			"tp": "9:S:98:1582143708,www.nielsen.com/X100zdCIGeIlgZnkYj6UvQ",
			"channame": "defaultChannelName",
			"h33": "2",
			"c26": "dmap,3",
			"uoo": "",
			"c68": "bndlid,",
			"c61": "createtm,1582143757",
			"plugv": "",
			"playerv": "",
			"nodeTM": "",
			"logTM": "",
			"c73": "phtype,",
			"c74": "dvcnm,",
			"c62": "sendTime,1582143757",
			"rnd": "311147"
		},
		{
			"_baseurl": "https://secure-qat4.imrworldwide.com/cgi-bin/d",
			"_sentAt": "2020-02-19T20:22:38.645Z",
			"ci": "us-506843",
			"sessionId": "1ciN8noENi2JZY2qy0mScvqPr6BeZ1582142874",
			"c29": "plid,15821428749135539",
			"c30": "bldv,6.0.0.474",
			"davty": "1",
			"forward": "1",
			"c6": "mtvr,b01",
			"ca": "FD_sDS6sS1v0IKGqf3n2TRNwA",
			"pc": "DHG163HR-BH45-JKY6-BKH7-67GJKY68GJK7",
			"cr": "2_03_98_D134_11111_1",
			"segment1": "",
			"segment2": "",
			"c9": "devid,",
			"c8": "devgrp,",
			"c7": "osgrp,",
			"c1": "nuid,Yc5w6EVvvvbPDqZ3oO7Y2pxetQDFK1582142875",
			"c10": "plt,",
			"plugv": "",
			"playerv": "",
			"c11": "agg,1",
			"c12": "apv,",
			"c13": "asid,DHG163HR-BH45-JKY6-BKH7-67GJKY68GJK7",
			"c15": "apn,",
			"c16": "sdkv,bj.6.0.0",
			"c14": "osver,NA",
			"h33": "2",
			"c26": "dmap,3",
			"c27": "cln,300",
			"at": "timer",
			"rt": "video",
			"st": "mtvr",
			"vn": "1",
			"c24": "zip,99",
			"dd": "",
			"hrd": "",
			"wkd": "",
			"uoo": "",
			"c68": "bndlid,",
			"c61": "createtm,1582143758",
			"nodeTM": "",
			"logTM": "",
			"c73": "phtype,",
			"c74": "dvcnm,",
			"c62": "sendTime,1582143758",
			"rnd": "431604"
		},
		{
			"_baseurl": "https://secure-qat4.imrworldwide.com/cgi-bin/d",
			"_sentAt": "2020-02-19T20:23:01.994Z",
			"ci": "us-506843",
			"sessionId": "1ciN8noENi2JZY2qy0mScvqPr6BeZ1582142874",
			"c29": "plid,15821428749135539",
			"c30": "bldv,6.0.0.474",
			"davty": "2",
			"forward": "1",
			"c6": "mtvr,b01",
			"ca": "FD_sDS6sS1v0IKGqf3n2TRNwA",
			"pc": "DHG163HR-BH45-JKY6-BKH7-67GJKY68GJK7",
			"cr": "2_03_98_D135_00000_1",
			"segment1": "",
			"segment2": "",
			"c9": "devid,",
			"c8": "devgrp,",
			"c7": "osgrp,",
			"c1": "nuid,Yc5w6EVvvvbPDqZ3oO7Y2pxetQDFK1582142875",
			"c10": "plt,",
			"plugv": "",
			"playerv": "",
			"c11": "agg,1",
			"c12": "apv,",
			"c13": "asid,DHG163HR-BH45-JKY6-BKH7-67GJKY68GJK7",
			"c15": "apn,",
			"c16": "sdkv,bj.6.0.0",
			"c14": "osver,NA",
			"h33": "2",
			"c26": "dmap,3",
			"c27": "cln,22",
			"at": "timer",
			"rt": "video",
			"st": "mtvr",
			"vn": "1",
			"c24": "zip,99",
			"dd": "",
			"hrd": "",
			"wkd": "",
			"uoo": "",
			"c68": "bndlid,",
			"c61": "createtm,1582143781",
			"nodeTM": "",
			"logTM": "",
			"c73": "phtype,",
			"c74": "dvcnm,",
			"c62": "sendTime,1582143781",
			"rnd": "428453"
		},
		{
			"_baseurl": "https://secure-qat4.imrworldwide.com/cgi-bin/d",
			"_sentAt": "2020-02-19T20:23:02.000Z",
			"ci": "us-506843",
			"sessionId": "1ciN8noENi2JZY2qy0mScvqPr6BeZ1582142874",
			"c29": "plid,15821428749135539",
			"c30": "bldv,6.0.0.474",
			"davty": "2",
			"forward": "1",
			"c6": "mtvr,b01",
			"ca": "PC_sLK6sS1v0IKGqf3n2TRNwA",
			"pc": "DHG163HR-BH45-JKY6-BKH7-67GJKY68GJK7",
			"cr": "2_07_90_D134_00000_1",
			"segment1": "",
			"segment2": "",
			"c9": "devid,",
			"c8": "devgrp,",
			"c7": "osgrp,",
			"c1": "nuid,Yc5w6EVvvvbPDqZ3oO7Y2pxetQDFK1582142875",
			"c10": "plt,",
			"plugv": "",
			"playerv": "",
			"c11": "agg,1",
			"c12": "apv,",
			"c13": "asid,DHG163HR-BH45-JKY6-BKH7-67GJKY68GJK7",
			"c15": "apn,",
			"c16": "sdkv,bj.6.0.0",
			"c14": "osver,NA",
			"h33": "2",
			"c26": "dmap,3",
			"c27": "cln,22",
			"at": "timer",
			"rt": "video",
			"st": "mtvr",
			"vn": "1",
			"c24": "zip,99",
			"dd": "",
			"hrd": "",
			"wkd": "",
			"uoo": "",
			"c68": "bndlid,",
			"c61": "createtm,1582143781",
			"nodeTM": "",
			"logTM": "",
			"c73": "phtype,",
			"c74": "dvcnm,",
			"c62": "sendTime,1582143781",
			"rnd": "187384"
		},
		{
			"_baseurl": "https://secure-qat4.imrworldwide.com/cgi-bin/trans",
			"_sentAt": "2020-02-19T20:23:02.005Z",
			"ci": "us-506843",
			"sessionId": "1ciN8noENi2JZY2qy0mScvqPr6BeZ1582142874",
			"forward": "1",
			"pc": "DHG163HR-BH45-JKY6-BKH7-67GJKY68GJK7",
			"c6": "id3,b01",
			"segment1": "",
			"segment2": "",
			"c9": "devid,",
			"c8": "devgrp,",
			"c7": "osgrp,",
			"c1": "nuid,Yc5w6EVvvvbPDqZ3oO7Y2pxetQDFK1582142875",
			"c10": "plt,",
			"c14": "osver,NA",
			"tp": "10:S:98:1582143768,www.nielsen.com/X100zdCIGeIlgZnkYj6UvQ",
			"channame": "defaultChannelName",
			"h33": "2",
			"c26": "dmap,3",
			"uoo": "",
			"c68": "bndlid,",
			"c61": "createtm,1582143781",
			"plugv": "",
			"playerv": "",
			"nodeTM": "",
			"logTM": "",
			"c73": "phtype,",
			"c74": "dvcnm,",
			"c62": "sendTime,1582143782",
			"rnd": "6882"
		},
		{
			"_baseurl": "https://secure-qat4.imrworldwide.com/cgi-bin/trans",
			"_sentAt": "2020-02-19T20:23:02.134Z",
			"ci": "us-506843",
			"sessionId": "1ciN8noENi2JZY2qy0mScvqPr6BeZ1582142874",
			"forward": "1",
			"pc": "DHG163HR-BH45-JKY6-BKH7-67GJKY68GJK7",
			"c6": "id3,b01",
			"segment1": "",
			"segment2": "",
			"c9": "devid,",
			"c8": "devgrp,",
			"c7": "osgrp,",
			"c1": "nuid,Yc5w6EVvvvbPDqZ3oO7Y2pxetQDFK1582142875",
			"c10": "plt,",
			"c14": "osver,NA",
			"tp": "false",
			"channame": "defaultChannelName",
			"h33": "2",
			"c26": "dmap,3",
			"uoo": "",
			"c68": "bndlid,",
			"c61": "createtm,1582143782",
			"plugv": "",
			"playerv": "",
			"nodeTM": "",
			"logTM": "",
			"c73": "phtype,",
			"c74": "dvcnm,",
			"c62": "sendTime,1582143782",
			"rnd": "103856"
		}
	]
}