{
	"testCaseName": "REGRESSION_BSDK_GGPM_DTVR_Live_AdmodelDynamic.xml",
	"baselineGeneratedDate": "2020-03-09T16:13:35.388Z",
	"testUrl": "http://engtestsite.com/bsdk/testsuite/testharness/single/index_eugenia.html?env=qat4&file=REGRESSION_BSDK_GGPM_DTVR_Live_AdmodelDynamic.xml&cdn=development2&nsdkv=600_rc&configEnv=static-staging2&ggcmbVersion=bundled600",
	"results": [
		{
			"_baseurl": "https://secure-qat4.imrworldwide.com/cgi-bin/gn",
			"_sentAt": "2020-03-09T16:08:13.948Z",
			"prd": "session",
			"c9": "devid,",
			"c13": "asid,DHG163HR-BH45-JKY6-BKH7-67GJKY68GJK7",
			"sessionId": "zMuIXtRQh25VDgWPpyPb7kSy15gdv1583770093",
			"c16": "sdkv,bj.6.0.0",
			"uoo": "",
			"retry": "0"
		},
		{
			"_baseurl": "https://secure-qat4.imrworldwide.com/cgi-bin/tsv",
			"_sentAt": "2020-03-09T16:08:17.703Z",
			"id3": "www.nielsen.com/X100zdCIGeIlgZnkYj6UvQ",
			"fmt": "json",
			"pli": "15837700936351040",
			"segment1": "",
			"segment2": "",
			"tsvevt": "tsvupdate",
			"nmspc": "NOLBUNDLE"
		},
		{
			"_baseurl": "https://secure-qat4.imrworldwide.com/cgi-bin/d",
			"_sentAt": "2020-03-09T16:08:17.903Z",
			"ci": "us-506843",
			"sessionId": "zMuIXtRQh25VDgWPpyPb7kSy15gdv1583770093",
			"c29": "plid,15837700936351040",
			"c30": "bldv,6.0.0.484",
			"davty": "0",
			"forward": "1",
			"c6": "mtvr,b01",
			"ca": "FD_LL-La28siY_RNousaZvt0Q",
			"pc": "DHG163HR-BH45-JKY6-BKH7-67GJKY68GJK7",
			"cr": "2_00_90_I124_00000_0",
			"segment1": "",
			"segment2": "",
			"c9": "devid,",
			"c8": "devgrp,",
			"c7": "osgrp,",
			"c1": "nuid,UiFAysBTP8xsORmJGzLbVPUBFzOiF1583770093",
			"c10": "plt,",
			"plugv": "",
			"playerv": "",
			"c11": "agg,1",
			"c12": "apv,",
			"c13": "asid,DHG163HR-BH45-JKY6-BKH7-67GJKY68GJK7",
			"c15": "apn,",
			"c16": "sdkv,bj.6.0.0",
			"c14": "osver,NA",
			"h33": "2",
			"c26": "dmap,3",
			"c27": "cln,0",
			"at": "start",
			"rt": "video",
			"st": "mtvr",
			"vn": "1",
			"c24": "zip,99",
			"dd": "",
			"hrd": "",
			"wkd": "",
			"uoo": "",
			"c68": "bndlid,",
			"c61": "createtm,1583770096",
			"nodeTM": "",
			"logTM": "",
			"c73": "phtype,",
			"c74": "dvcnm,",
			"c62": "sendTime,1583770096",
			"rnd": "48832"
		},
		{
			"_baseurl": "https://secure-qat4.imrworldwide.com/cgi-bin/tsv",
			"_sentAt": "2020-03-09T16:08:46.647Z",
			"id3": "www.nielsen.com/X100zdCIGeIlgZnkYj6UvQ",
			"fmt": "json",
			"pli": "15837700936351040",
			"segment1": "",
			"segment2": "",
			"tsvevt": "tsvupdate",
			"nmspc": "NOLBUNDLE"
		},
		{
			"_baseurl": "https://secure-qat4.imrworldwide.com/cgi-bin/d",
			"_sentAt": "2020-03-09T16:08:46.694Z",
			"ci": "us-506843",
			"sessionId": "zMuIXtRQh25VDgWPpyPb7kSy15gdv1583770093",
			"c29": "plid,15837700936351040",
			"c30": "bldv,6.0.0.484",
			"davty": "1",
			"forward": "1",
			"c6": "mtvr,b01",
			"ca": "FD_LL-La28siY_RNousaZvt0Q",
			"pc": "DHG163HR-BH45-JKY6-BKH7-67GJKY68GJK7",
			"cr": "2_00_90_V124_00000_0",
			"segment1": "",
			"segment2": "",
			"c9": "devid,",
			"c8": "devgrp,",
			"c7": "osgrp,",
			"c1": "nuid,UiFAysBTP8xsORmJGzLbVPUBFzOiF1583770093",
			"c10": "plt,",
			"plugv": "",
			"playerv": "",
			"c11": "agg,1",
			"c12": "apv,",
			"c13": "asid,DHG163HR-BH45-JKY6-BKH7-67GJKY68GJK7",
			"c15": "apn,",
			"c16": "sdkv,bj.6.0.0",
			"c14": "osver,NA",
			"h33": "2",
			"c26": "dmap,3",
			"c27": "cln,30",
			"at": "view",
			"rt": "video",
			"st": "mtvr",
			"vn": "1",
			"c24": "zip,99",
			"dd": "",
			"hrd": "",
			"wkd": "",
			"uoo": "",
			"c68": "bndlid,",
			"c61": "createtm,1583770125",
			"nodeTM": "",
			"logTM": "",
			"c73": "phtype,",
			"c74": "dvcnm,",
			"c62": "sendTime,1583770125",
			"rnd": "183411"
		},
		{
			"_baseurl": "https://secure-qat4.imrworldwide.com/cgi-bin/d",
			"_sentAt": "2020-03-09T16:08:46.974Z",
			"ci": "us-506843",
			"sessionId": "zMuIXtRQh25VDgWPpyPb7kSy15gdv1583770093",
			"c29": "plid,15837700936351040",
			"c30": "bldv,6.0.0.484",
			"davty": "1",
			"forward": "1",
			"c6": "mtvr,b01",
			"ca": "FD_LL-La28siY_RNousaZvt0Q",
			"pc": "DHG163HR-BH45-JKY6-BKH7-67GJKY68GJK7",
			"cr": "2_00_90_D124_10000_0",
			"segment1": "",
			"segment2": "",
			"c9": "devid,",
			"c8": "devgrp,",
			"c7": "osgrp,",
			"c1": "nuid,UiFAysBTP8xsORmJGzLbVPUBFzOiF1583770093",
			"c10": "plt,",
			"plugv": "",
			"playerv": "",
			"c11": "agg,1",
			"c12": "apv,",
			"c13": "asid,DHG163HR-BH45-JKY6-BKH7-67GJKY68GJK7",
			"c15": "apn,",
			"c16": "sdkv,bj.6.0.0",
			"c14": "osver,NA",
			"h33": "2",
			"c26": "dmap,3",
			"c27": "cln,30",
			"at": "timer",
			"rt": "video",
			"st": "mtvr",
			"vn": "1",
			"c24": "zip,99",
			"dd": "",
			"hrd": "",
			"wkd": "",
			"uoo": "",
			"c68": "bndlid,",
			"c61": "createtm,1583770125",
			"nodeTM": "",
			"logTM": "",
			"c73": "phtype,",
			"c74": "dvcnm,",
			"c62": "sendTime,1583770125",
			"rnd": "505487"
		},
		{
			"_baseurl": "https://secure-qat4.imrworldwide.com/cgi-bin/trans",
			"_sentAt": "2020-03-09T16:09:06.678Z",
			"ci": "us-506843",
			"sessionId": "zMuIXtRQh25VDgWPpyPb7kSy15gdv1583770093",
			"forward": "1",
			"pc": "DHG163HR-BH45-JKY6-BKH7-67GJKY68GJK7",
			"c6": "id3,b01",
			"segment1": "",
			"segment2": "",
			"c9": "devid,",
			"c8": "devgrp,",
			"c7": "osgrp,",
			"c1": "nuid,UiFAysBTP8xsORmJGzLbVPUBFzOiF1583770093",
			"c10": "plt,",
			"c14": "osver,NA",
			"tp": "0:S:99:1583770097,www.nielsen.com/X100zdCIGeIlgZnkYj6UvQ",
			"channame": "defaultChannelName",
			"h33": "2",
			"c26": "dmap,3",
			"uoo": "",
			"c68": "bndlid,",
			"c61": "createtm,1583770145",
			"plugv": "",
			"playerv": "",
			"nodeTM": "",
			"logTM": "",
			"c73": "phtype,",
			"c74": "dvcnm,",
			"c62": "sendTime,1583770145",
			"rnd": "867008"
		},
		{
			"_baseurl": "https://secure-qat4.imrworldwide.com/cgi-bin/trans",
			"_sentAt": "2020-03-09T16:10:06.693Z",
			"ci": "us-506843",
			"sessionId": "zMuIXtRQh25VDgWPpyPb7kSy15gdv1583770093",
			"forward": "1",
			"pc": "DHG163HR-BH45-JKY6-BKH7-67GJKY68GJK7",
			"c6": "id3,b01",
			"segment1": "",
			"segment2": "",
			"c9": "devid,",
			"c8": "devgrp,",
			"c7": "osgrp,",
			"c1": "nuid,UiFAysBTP8xsORmJGzLbVPUBFzOiF1583770093",
			"c10": "plt,",
			"c14": "osver,NA",
			"tp": "1:S:90:1583770156,www.nielsen.com/X100zdCIGeIlgZnkYj6UvQ",
			"channame": "defaultChannelName",
			"h33": "2",
			"c26": "dmap,3",
			"uoo": "",
			"c68": "bndlid,",
			"c61": "createtm,1583770205",
			"plugv": "",
			"playerv": "",
			"nodeTM": "",
			"logTM": "",
			"c73": "phtype,",
			"c74": "dvcnm,",
			"c62": "sendTime,1583770205",
			"rnd": "736915"
		},
		{
			"_baseurl": "https://secure-qat4.imrworldwide.com/cgi-bin/trans",
			"_sentAt": "2020-03-09T16:11:06.710Z",
			"ci": "us-506843",
			"sessionId": "zMuIXtRQh25VDgWPpyPb7kSy15gdv1583770093",
			"forward": "1",
			"pc": "DHG163HR-BH45-JKY6-BKH7-67GJKY68GJK7",
			"c6": "id3,b01",
			"segment1": "",
			"segment2": "",
			"c9": "devid,",
			"c8": "devgrp,",
			"c7": "osgrp,",
			"c1": "nuid,UiFAysBTP8xsORmJGzLbVPUBFzOiF1583770093",
			"c10": "plt,",
			"c14": "osver,NA",
			"tp": "2:S:90:1583770216,www.nielsen.com/X100zdCIGeIlgZnkYj6UvQ",
			"channame": "defaultChannelName",
			"h33": "2",
			"c26": "dmap,3",
			"uoo": "",
			"c68": "bndlid,",
			"c61": "createtm,1583770265",
			"plugv": "",
			"playerv": "",
			"nodeTM": "",
			"logTM": "",
			"c73": "phtype,",
			"c74": "dvcnm,",
			"c62": "sendTime,1583770265",
			"rnd": "886193"
		},
		{
			"_baseurl": "https://secure-qat4.imrworldwide.com/cgi-bin/trans",
			"_sentAt": "2020-03-09T16:12:06.738Z",
			"ci": "us-506843",
			"sessionId": "zMuIXtRQh25VDgWPpyPb7kSy15gdv1583770093",
			"forward": "1",
			"pc": "DHG163HR-BH45-JKY6-BKH7-67GJKY68GJK7",
			"c6": "id3,b01",
			"segment1": "",
			"segment2": "",
			"c9": "devid,",
			"c8": "devgrp,",
			"c7": "osgrp,",
			"c1": "nuid,UiFAysBTP8xsORmJGzLbVPUBFzOiF1583770093",
			"c10": "plt,",
			"c14": "osver,NA",
			"tp": "3:S:90:1583770276,www.nielsen.com/X100zdCIGeIlgZnkYj6UvQ",
			"channame": "defaultChannelName",
			"h33": "2",
			"c26": "dmap,3",
			"uoo": "",
			"c68": "bndlid,",
			"c61": "createtm,1583770325",
			"plugv": "",
			"playerv": "",
			"nodeTM": "",
			"logTM": "",
			"c73": "phtype,",
			"c74": "dvcnm,",
			"c62": "sendTime,1583770325",
			"rnd": "121981"
		},
		{
			"_baseurl": "https://secure-qat4.imrworldwide.com/cgi-bin/d",
			"_sentAt": "2020-03-09T16:12:46.690Z",
			"ci": "us-506843",
			"sessionId": "zMuIXtRQh25VDgWPpyPb7kSy15gdv1583770093",
			"c29": "plid,15837700936351040",
			"c30": "bldv,6.0.0.484",
			"davty": "1",
			"forward": "1",
			"c6": "mtvr,b01",
			"ca": "FD_LL-La28siY_RNousaZvt0Q",
			"pc": "DHG163HR-BH45-JKY6-BKH7-67GJKY68GJK7",
			"aqhflg": "1",
			"cr": "2_00_90_Q70_16296_0",
			"segment1": "",
			"segment2": "",
			"c9": "devid,",
			"plugv": "",
			"playerv": "",
			"c8": "devgrp,",
			"c7": "osgrp,",
			"c1": "nuid,UiFAysBTP8xsORmJGzLbVPUBFzOiF1583770093",
			"c10": "plt,",
			"c11": "agg,1",
			"c12": "apv,",
			"c13": "asid,DHG163HR-BH45-JKY6-BKH7-67GJKY68GJK7",
			"c14": "osver,NA",
			"c16": "sdkv,bj.6.0.0",
			"h33": "2",
			"c26": "dmap,3",
			"at": "view",
			"rt": "video",
			"st": "mtvr",
			"vn": "1",
			"c15": "apn,",
			"c24": "zip,99",
			"dd": "",
			"hrd": "",
			"wkd": "",
			"uoo": "",
			"c68": "bndlid,",
			"c61": "createtm,1583770365",
			"nodeTM": "",
			"logTM": "",
			"c73": "phtype,",
			"c74": "dvcnm,",
			"c62": "sendTime,1583770365",
			"rnd": "384588"
		},
		{
			"_baseurl": "https://secure-qat4.imrworldwide.com/cgi-bin/trans",
			"_sentAt": "2020-03-09T16:13:06.687Z",
			"ci": "us-506843",
			"sessionId": "zMuIXtRQh25VDgWPpyPb7kSy15gdv1583770093",
			"forward": "1",
			"pc": "DHG163HR-BH45-JKY6-BKH7-67GJKY68GJK7",
			"c6": "id3,b01",
			"segment1": "",
			"segment2": "",
			"c9": "devid,",
			"c8": "devgrp,",
			"c7": "osgrp,",
			"c1": "nuid,UiFAysBTP8xsORmJGzLbVPUBFzOiF1583770093",
			"c10": "plt,",
			"c14": "osver,NA",
			"tp": "4:S:90:1583770336,www.nielsen.com/X100zdCIGeIlgZnkYj6UvQ",
			"channame": "defaultChannelName",
			"h33": "2",
			"c26": "dmap,3",
			"uoo": "",
			"c68": "bndlid,",
			"c61": "createtm,1583770385",
			"plugv": "",
			"playerv": "",
			"nodeTM": "",
			"logTM": "",
			"c73": "phtype,",
			"c74": "dvcnm,",
			"c62": "sendTime,1583770385",
			"rnd": "911960"
		},
		{
			"_baseurl": "https://secure-qat4.imrworldwide.com/cgi-bin/tsv",
			"_sentAt": "2020-03-09T16:13:26.669Z",
			"id3": "www.nielsen.com/X100zdCIGeIlgZnkYj6UvQ",
			"fmt": "json",
			"pli": "15837700936351040",
			"segment1": "",
			"segment2": "",
			"tsvevt": "tsvupdate",
			"nmspc": "NOLBUNDLE"
		},
		{
			"_baseurl": "https://secure-qat4.imrworldwide.com/cgi-bin/d",
			"_sentAt": "2020-03-09T16:13:27.191Z",
			"ci": "us-506843",
			"sessionId": "zMuIXtRQh25VDgWPpyPb7kSy15gdv1583770093",
			"c29": "plid,15837700936351040",
			"c30": "bldv,6.0.0.484",
			"davty": "1",
			"forward": "1",
			"c6": "mtvr,b01",
			"ca": "FD_LL-La28siY_RNousaZvt0Q",
			"pc": "DHG163HR-BH45-JKY6-BKH7-67GJKY68GJK7",
			"cr": "2_00_90_D124_01111_0",
			"segment1": "",
			"segment2": "",
			"c9": "devid,",
			"c8": "devgrp,",
			"c7": "osgrp,",
			"c1": "nuid,UiFAysBTP8xsORmJGzLbVPUBFzOiF1583770093",
			"c10": "plt,",
			"plugv": "",
			"playerv": "",
			"c11": "agg,1",
			"c12": "apv,",
			"c13": "asid,DHG163HR-BH45-JKY6-BKH7-67GJKY68GJK7",
			"c15": "apn,",
			"c16": "sdkv,bj.6.0.0",
			"c14": "osver,NA",
			"h33": "2",
			"c26": "dmap,3",
			"c27": "cln,270",
			"at": "timer",
			"rt": "video",
			"st": "mtvr",
			"vn": "1",
			"c24": "zip,99",
			"dd": "",
			"hrd": "",
			"wkd": "",
			"uoo": "",
			"c68": "bndlid,",
			"c61": "createtm,1583770406",
			"nodeTM": "",
			"logTM": "",
			"c73": "phtype,",
			"c74": "dvcnm,",
			"c62": "sendTime,1583770406",
			"rnd": "377506"
		},
		{
			"_baseurl": "https://secure-qat4.imrworldwide.com/cgi-bin/d",
			"_sentAt": "2020-03-09T16:13:27.673Z",
			"ci": "us-506843",
			"sessionId": "zMuIXtRQh25VDgWPpyPb7kSy15gdv1583770093",
			"c29": "plid,15837700936351040",
			"c30": "bldv,6.0.0.484",
			"davty": "2",
			"forward": "1",
			"c6": "mtvr,b01",
			"ca": "FD_LL-La28siY_RNousaZvt0Q",
			"pc": "DHG163HR-BH45-JKY6-BKH7-67GJKY68GJK7",
			"cr": "2_00_90_D125_00000_0",
			"segment1": "",
			"segment2": "",
			"c9": "devid,",
			"c8": "devgrp,",
			"c7": "osgrp,",
			"c1": "nuid,UiFAysBTP8xsORmJGzLbVPUBFzOiF1583770093",
			"c10": "plt,",
			"plugv": "",
			"playerv": "",
			"c11": "agg,1",
			"c12": "apv,",
			"c13": "asid,DHG163HR-BH45-JKY6-BKH7-67GJKY68GJK7",
			"c15": "apn,",
			"c16": "sdkv,bj.6.0.0",
			"c14": "osver,NA",
			"h33": "2",
			"c26": "dmap,3",
			"c27": "cln,10",
			"at": "timer",
			"rt": "video",
			"st": "mtvr",
			"vn": "1",
			"c24": "zip,99",
			"dd": "",
			"hrd": "",
			"wkd": "",
			"uoo": "",
			"c68": "bndlid,",
			"c61": "createtm,1583770406",
			"nodeTM": "",
			"logTM": "",
			"c73": "phtype,",
			"c74": "dvcnm,",
			"c62": "sendTime,1583770406",
			"rnd": "565701"
		},
		{
			"_baseurl": "https://secure-qat4.imrworldwide.com/cgi-bin/trans",
			"_sentAt": "2020-03-09T16:13:27.674Z",
			"ci": "us-506843",
			"sessionId": "zMuIXtRQh25VDgWPpyPb7kSy15gdv1583770093",
			"forward": "1",
			"pc": "DHG163HR-BH45-JKY6-BKH7-67GJKY68GJK7",
			"c6": "id3,b01",
			"segment1": "",
			"segment2": "",
			"c9": "devid,",
			"c8": "devgrp,",
			"c7": "osgrp,",
			"c1": "nuid,UiFAysBTP8xsORmJGzLbVPUBFzOiF1583770093",
			"c10": "plt,",
			"c14": "osver,NA",
			"tp": "5:S:90:1583770396,www.nielsen.com/X100zdCIGeIlgZnkYj6UvQ",
			"channame": "defaultChannelName",
			"h33": "2",
			"c26": "dmap,3",
			"uoo": "",
			"c68": "bndlid,",
			"c61": "createtm,1583770406",
			"plugv": "",
			"playerv": "",
			"nodeTM": "",
			"logTM": "",
			"c73": "phtype,",
			"c74": "dvcnm,",
			"c62": "sendTime,1583770406",
			"rnd": "16542"
		},
		{
			"_baseurl": "https://secure-qat4.imrworldwide.com/cgi-bin/trans",
			"_sentAt": "2020-03-09T16:13:30.705Z",
			"ci": "us-506843",
			"sessionId": "zMuIXtRQh25VDgWPpyPb7kSy15gdv1583770093",
			"forward": "1",
			"pc": "DHG163HR-BH45-JKY6-BKH7-67GJKY68GJK7",
			"c6": "id3,b01",
			"segment1": "",
			"segment2": "",
			"c9": "devid,",
			"c8": "devgrp,",
			"c7": "osgrp,",
			"c1": "nuid,UiFAysBTP8xsORmJGzLbVPUBFzOiF1583770093",
			"c10": "plt,",
			"c14": "osver,NA",
			"tp": "false",
			"channame": "defaultChannelName",
			"h33": "2",
			"c26": "dmap,3",
			"uoo": "",
			"c68": "bndlid,",
			"c61": "createtm,1583770409",
			"plugv": "",
			"playerv": "",
			"nodeTM": "",
			"logTM": "",
			"c73": "phtype,",
			"c74": "dvcnm,",
			"c62": "sendTime,1583770409",
			"rnd": "603609"
		}
	]
}